{"text_format":"1","workbook":"xlsx","n_sheets":2,"sheets":["Расчет","Медикаменты"],"not_rendered":{"charts":0,"images":0,"macros":1,"external_links":0,"defined_names":5,"comments":0,"pivot_tables":0},"unopened":[],"bounds":{"document_bytes":16777216,"sheet_cells":100000,"rows_first":2000,"rows_last":500,"rows_between":2000,"halvings":0,"cell_chars":16384,"cell_head_chars":4096},"cells_cut":0,"cells_raw":0,"read":"whole","date_system":"1900"}

{"sheet":"Расчет","index":0,"n_rows":18,"n_cols":16,"rows_kept":18,"cut":false,"hidden":false,"merged":[]}
[null,null,null,null,null,null,null,null,null,null,null,null,null,null,null,{"$f":"IF(Опер=\"Операции со складом\",,IFERROR(INDEX(Договоры_tb[Поставщик],SMALL(IF(Договоры_tb[Наименование]=Наим,ROW(Договоры_tb[Наименование])-ROW(Договоры_tb[[#Headers],[Наименование]])),ROW())),))","v":0}]
[null,null,null,null,null,null,null,null,null,null,null,null,null,null,null,{"$f":"IF(Опер=\"Операции со складом\",,IFERROR(INDEX(Договоры_tb[Поставщик],SMALL(IF(Договоры_tb[Наименование]=Наим,ROW(Договоры_tb[Наименование])-ROW(Договоры_tb[[#Headers],[Наименование]])),ROW())),))","v":0}]
[null,null,null,null,null,null,null,null,null,null,null,null,null,null,null,{"$f":"IF(Опер=\"Операции со складом\",,IFERROR(INDEX(Договоры_tb[Поставщик],SMALL(IF(Договоры_tb[Наименование]=Наим,ROW(Договоры_tb[Наименование])-ROW(Договоры_tb[[#Headers],[Наименование]])),ROW())),))","v":0}]
[null,null,null,null,null,null,null,null,null,null,null,null,null,null,null,{"$f":"IF(Опер=\"Операции со складом\",,IFERROR(INDEX(Договоры_tb[Поставщик],SMALL(IF(Договоры_tb[Наименование]=Наим,ROW(Договоры_tb[Наименование])-ROW(Договоры_tb[[#Headers],[Наименование]])),ROW())),))","v":0}]
[null,null,null,null,null,null,null,null,null,null,null,null,null,null,null,{"$f":"IF(Опер=\"Операции со складом\",,IFERROR(INDEX(Договоры_tb[Поставщик],SMALL(IF(Договоры_tb[Наименование]=Наим,ROW(Договоры_tb[Наименование])-ROW(Договоры_tb[[#Headers],[Наименование]])),ROW())),))","v":0}]
[null,null,null,null,null,null,null,null,null,null,null,null,null,null,null,{"$f":"IF(Опер=\"Операции со складом\",,IFERROR(INDEX(Договоры_tb[Поставщик],SMALL(IF(Договоры_tb[Наименование]=Наим,ROW(Договоры_tb[Наименование])-ROW(Договоры_tb[[#Headers],[Наименование]])),ROW())),))","v":0}]
[null,null,null,null,null,null,null,null,null,null,null,null,null,null,null,{"$f":"IF(Опер=\"Операции со складом\",,IFERROR(INDEX(Договоры_tb[Поставщик],SMALL(IF(Договоры_tb[Наименование]=Наим,ROW(Договоры_tb[Наименование])-ROW(Договоры_tb[[#Headers],[Наименование]])),ROW())),))","v":0}]
[null,null,null,null,null,null,null,null,null,null,null,null,null,null,null,{"$f":"IF(Опер=\"Операции со складом\",,IFERROR(INDEX(Договоры_tb[Поставщик],SMALL(IF(Договоры_tb[Наименование]=Наим,ROW(Договоры_tb[Наименование])-ROW(Договоры_tb[[#Headers],[Наименование]])),ROW())),))","v":0}]
[null,null,"Дата","Наименование","Операция","Выбор поставщика","Выбор договора","Срок годности","Остаток у поставщика","Наличие","Приход","Расход","Остаток","Кому выдано",null,{"$f":"IF(Опер=\"Операции со складом\",,IFERROR(INDEX(Договоры_tb[Поставщик],SMALL(IF(Договоры_tb[Наименование]=Наим,ROW(Договоры_tb[Наименование])-ROW(Договоры_tb[[#Headers],[Наименование]])),ROW())),))","v":0}]
[null,null,"2018-04-01","Пробирка Vacuette (4 мл., 50 шт.)","Операции со складом",0,"нет",null,null,{"$f":"IFERROR(IFERROR(LOOKUP(,-1/(Вводные[[#This Row],[Наименование]]=$D$9:D9),$M$9:M9),VLOOKUP(Вводные[[#This Row],[Наименование]],#REF!,6,)),\"\")","v":""},null,null,{"$f":"IFERROR(Вводные[Наличие]+Вводные[Приход]-Вводные[Расход],\"\")","v":""},null,null,{"$f":"IF(Опер=\"Операции со складом\",,IFERROR(INDEX(Договоры_tb[Поставщик],SMALL(IF(Договоры_tb[Наименование]=Наим,ROW(Договоры_tb[Наименование])-ROW(Договоры_tb[[#Headers],[Наименование]])),ROW())),))","v":0}]
[null,null,"2018-04-01","Пробирка Vacuette (4 мл., 50 шт.)","Заказано у поставщика",null,"да",null,null,{"$f":"IFERROR(IFERROR(LOOKUP(,-1/(Вводные[[#This Row],[Наименование]]=$D$9:D10),$M$9:M10),VLOOKUP(Вводные[[#This Row],[Наименование]],#REF!,6,)),\"\")","v":""},null,null,{"$f":"IFERROR(Вводные[Наличие]+Вводные[Приход]-Вводные[Расход],\"\")","v":""},null,null,{"$f":"IF(Опер=\"Операции со складом\",,IFERROR(INDEX(Договоры_tb[Поставщик],SMALL(IF(Договоры_tb[Наименование]=Наим,ROW(Договоры_tb[Наименование])-ROW(Договоры_tb[[#Headers],[Наименование]])),ROW())),))","v":0}]
[null,null,"2018-04-01","Пробирка Vacuette (8 мл., 50 шт.)","Получено от поставщика","ООО \"Медресурс\"","да",null,null,{"$f":"IFERROR(IFERROR(LOOKUP(,-1/(Вводные[[#This Row],[Наименование]]=$D$9:D11),$M$9:M11),VLOOKUP(Вводные[[#This Row],[Наименование]],#REF!,6,)),\"\")","v":""},null,null,{"$f":"IFERROR(Вводные[Наличие]+Вводные[Приход]-Вводные[Расход],\"\")","v":""},null,null,{"$f":"IF(Опер=\"Операции со складом\",,IFERROR(INDEX(Договоры_tb[Поставщик],SMALL(IF(Договоры_tb[Наименование]=Наим,ROW(Договоры_tb[Наименование])-ROW(Договоры_tb[[#Headers],[Наименование]])),ROW())),))","v":0}]
[null,null,"2018-04-01","Пробирка Vacuette (4 мл., 50 шт.)","Операции со складом",0,null,null,null,{"$f":"IFERROR(IFERROR(LOOKUP(,-1/(Вводные[[#This Row],[Наименование]]=$D$9:D12),$M$9:M12),VLOOKUP(Вводные[[#This Row],[Наименование]],#REF!,6,)),\"\")","v":""},null,null,{"$f":"IFERROR(Вводные[Наличие]+Вводные[Приход]-Вводные[Расход],\"\")","v":""},null,null,{"$f":"IF(Опер=\"Операции со складом\",,IFERROR(INDEX(Договоры_tb[Поставщик],SMALL(IF(Договоры_tb[Наименование]=Наим,ROW(Договоры_tb[Наименование])-ROW(Договоры_tb[[#Headers],[Наименование]])),ROW())),))","v":0}]
[null,null,null,null,null,null,null,null,null,null,null,null,null,null,null,{"$f":"IF(Опер=\"Операции со складом\",,IFERROR(INDEX(Договоры_tb[Поставщик],SMALL(IF(Договоры_tb[Наименование]=Наим,ROW(Договоры_tb[Наименование])-ROW(Договоры_tb[[#Headers],[Наименование]])),ROW())),))","v":0}]
[null,null,null,null,null,null,null,null,null,null,null,null,null,null,null,{"$f":"IF(Опер=\"Операции со складом\",,IFERROR(INDEX(Договоры_tb[Поставщик],SMALL(IF(Договоры_tb[Наименование]=Наим,ROW(Договоры_tb[Наименование])-ROW(Договоры_tb[[#Headers],[Наименование]])),ROW())),))","v":0}]
[null,null,null,null,null,null,null,null,null,null,null,null,null,null,null,{"$f":"IF(Опер=\"Операции со складом\",,IFERROR(INDEX(Договоры_tb[Поставщик],SMALL(IF(Договоры_tb[Наименование]=Наим,ROW(Договоры_tb[Наименование])-ROW(Договоры_tb[[#Headers],[Наименование]])),ROW())),))","v":0}]
[null,null,null,null,null,null,null,null,null,null,null,null,null,null,null,{"$f":"IF(Опер=\"Операции со складом\",,IFERROR(INDEX(Договоры_tb[Поставщик],SMALL(IF(Договоры_tb[Наименование]=Наим,ROW(Договоры_tb[Наименование])-ROW(Договоры_tb[[#Headers],[Наименование]])),ROW())),))","v":0}]
[null,null,null,null,null,null,null,null,null,null,null,null,null,null,null,{"$f":"IF(Опер=\"Операции со складом\",,IFERROR(INDEX(Договоры_tb[Поставщик],SMALL(IF(Договоры_tb[Наименование]=Наим,ROW(Договоры_tb[Наименование])-ROW(Договоры_tb[[#Headers],[Наименование]])),ROW())),))","v":0}]

{"sheet":"Медикаменты","index":1,"n_rows":322,"n_cols":25,"rows_kept":322,"cut":false,"hidden":false,"merged":[]}
["Наименование новое","Единицы","Количество","Цена за упаковку","Единицы в упаковке","Количество в упаковке","Цена за единицу",null,null,null,"Поставщик","Контактные данные","Договор",null,null,"Наименование","Поставщик","Договор","Столбец3","Единицы","Обеъем закупки",null,null,null,"Медикаменты"]
["?водный раствор люголя","?",null,null,null,null,"",null,null,null,"ООО \"Медресурс\"","Иванов, 11-22-99",12345,null,null,"Пробирка Vacuette (4 мл., 50 шт.)","ООО \"Медресурс\"",12345,null,"уп.",100,null,null,null,"Бинт (нест., 10 м.х15 см.)"]
["?Детский жирный крем","?",null,null,null,null,"",null,null,null,"ООО \"Сибмедком\"","Петров, 895012345678 (9-00-18-00)",4569,null,null,"Пробирка Vacuette (8 мл., 50 шт.)","ООО \"Медресурс\"",12345,null,"уп.",150,null,null,null,"Бинт (нест., 5 м.х10 см.)"]
["?Иголка","?",null,null,null,null,"",null,null,null,"ООО \"Медресурс\"","Иванов, 11-22-99","ПР-123",null,null,"Пробирка Vacuette (9 мл., 50 шт.)","ООО \"Медресурс\"",12345,null,"уп.",200,null,null,null,"Бинт (стер. 10 м.х15 см.)"]
["?Лекарственные стредства","?",null,null,null,null,"",null,null,null,"ООО \"Восток\"","Маша, 952632588932","Кн-999",null,null,"Пробирка вакуумная Cerebrum (4 мл., 50 шт.)","ООО \"Медресурс\"",12345,null,"уп.",20,null,null,null,"Бинт (стер. 5 м.х10 см.)"]
["?Пеленка одноразовая","шт.",1,370,null,null,"",null,null,null,"ООО \"Сибмедком\"","Петров, 895012345678 (9-00-18-00)",5996,null,null,"Пробирка вакуумная Cerebrum (5 мл., 50 шт.)","ООО \"Медресурс\"",12345,null,"уп.",30,null,null,null,"Контейнер для сбора мочи (стер., 100 мл.)"]
["?Перевязочный метариал","?",null,null,null,null,"",null,null,null,null,null,null,null,null,"Пробирка вакуумная Cerebrum (8 мл., 50 шт.)","ООО \"Медресурс\"",12345,null,"уп.",40,null,null,null,"Контейнер для утилизации отходов МК-01 (однораз., желтый, 3 л.)"]
["?Пробирка (с активатором свертывания)","шт.",1,1200,null,null,"",null,null,null,null,null,null,null,null,"Пробирка микровета с ЭДТА (0,2 мл., 100 шт.)","ООО \"Медресурс\"",12345,null,"уп.",80,null,null,null,"Контейнер для утилизации отходов МК-04 (многораз., бирюзовый, 7,5 л.)."]
["?Салфетка для обработки датчиков","шт.",1,214.02,null,null,"",null,null,null,null,null,null,null,null,"Пробирка вакуумная Cerebrum (4 мл., 50 шт.)","ООО \"Сибмедком\"",4569,null,"уп.",50,null,null,null,"Контейнер для утилизации отходов МК-05 (многораз., желтый 50 л.)"]
["?Салфетка одноразовая","шт.",1,214.02,null,null,"",null,null,null,null,null,null,null,null,"Пакеты упаковочные для стерилизации СтериТ (150*250, 100 шт.)","ООО \"Сибмедком\"",4569,null,"уп.",50,null,null,null,"Контрольная сыворотка на РМП (отрицательный) (1 мл., 10 шт.)"]
["?Спирт","мл.",null,28,null,null,"",null,null,null,null,null,null,null,null,"Пакеты упаковочные для стерилизации СтериТ (200*300, 100 шт.)","ООО \"Сибмедком\"",4569,null,"уп.",60,null,null,null,"Контрольная сыворотка на РМП (положительная) (1 мл., 10 шт.)"]
["?Спиртовая салфетка","шт.",1,1.35,null,null,"",null,null,null,null,null,null,null,null,"Пакеты упаковочные для стерилизации СтериТ (200*330, 100 шт.)","ООО \"Сибмедком\"",4569,null,"уп.",180,null,null,null,"Контрольная сыворотка на РМП (слабоположительный) (1 мл., 10 шт.)"]
["?Тампон для задней тампонады","?",null,null,null,null,"",null,null,null,null,null,null,null,null,"Шприц (1 мл.)","ООО \"Сибмедком\"",4569,null,"шт.",120,null,null,null,"Контрольный материал гематологических анализаторов (2х2,5 норм. ур., 1х2,5 ср. ур., 1х2,5 выс. ур.)"]
["?Термобумага для эхограмм","снимок",null,4.6399999999999997,null,null,"",null,null,null,null,null,null,null,null,"Шприц (10 мл.)","ООО \"Сибмедком\"",4569,null,"шт.",180,null,null,null,"Пакеты упаковочные для стерилизации СтериТ (150*250, 100 шт.)"]
["?Турудна","?",null,null,null,null,"",null,null,null,null,null,null,null,null,"Шприц (2 мл. 2 иглы)","ООО \"Сибмедком\"",4569,null,"шт.",90,null,null,null,"Пакеты упаковочные для стерилизации СтериТ (200*300, 100 шт.)"]
["?Физраствор","?",null,null,null,null,"",null,null,null,null,null,null,null,null,"Шприц (2 мл.)","ООО \"Сибмедком\"",4569,null,"шт.",110,null,null,null,"Пакеты упаковочные для стерилизации СтериТ (200*330, 100 шт.)"]
["?Шовный материал","?",null,null,null,null,"",null,null,null,null,null,null,null,null,"Шприц (20 мл.)","ООО \"Сибмедком\"",4569,null,"шт.",150,null,null,null,"Пробирка Vacuette (4 мл., 50 шт.)"]
["Адреналин гидрохлорид (р-р, 0,1%, 1 мл.)","уп.",20,74.510000000000005,null,null,"",null,null,null,null,null,null,null,null,"Шприц (5 мл. 2 иглы)","ООО \"Сибмедком\"",4569,null,"шт.",130,null,null,null,"Пробирка Vacuette (8 мл., 50 шт.)"]
["Азитромицин (таб., 125 мг, №6)","уп.",10,206.67,null,null,"",null,null,null,null,null,null,null,null,"Шприц (5 мл.)","ООО \"Сибмедком\"",4569,null,"шт.",120,null,null,null,"Пробирка Vacuette (9 мл., 50 шт.)"]
["Азопирам","комп.",10,364.44,null,null,"",null,null,null,null,null,null,null,null,"Пробирка вакуумная Cerebrum (4 мл., 50 шт.)","ООО \"Медресурс\"","ПР-123",null,"уп.",150,null,null,null,"Пробирка вакуумная Cerebrum (4 мл., 50 шт.)"]
["Азур-эозин по Романовскому (р-р, 0,76%, окраска 6000, 1 л.)","фл.",6,261.60000000000002,"мл.",1000,0.2616,null,null,null,null,null,null,null,null,"Бинт (нест., 10 м.х15 см.)","ООО \"Медресурс\"","ПР-123",null,"уп.",100,null,null,null,"Пробирка вакуумная Cerebrum (5 мл., 50 шт.)"]
["Актовегин (р-р, 5 мл., №5)","уп.",2,675,null,null,"",null,null,null,null,null,null,null,null,"Бинт (нест., 5 м.х10 см.)","ООО \"Медресурс\"","ПР-123",null,"уп.",120,null,null,null,"Пробирка вакуумная Cerebrum (8 мл., 50 шт.)"]
["Аллерген из библиотечной пыли для диагностики","комп.",2,4216.63,"комп.",1,4216.63,null,null,null,null,null,null,null,null,"Бинт (стер. 10 м.х15 см.)","ООО \"Медресурс\"","ПР-123",null,"уп.",90,null,null,null,"Пробирка микровета с ЭДТА (0,2 мл., 100 шт.)"]
["Аллерген из дафнии для диагностики","комп.",1,4216.63,"комп.",1,4216.63,null,null,null,null,null,null,null,null,"Бинт (стер. 5 м.х10 см.)","ООО \"Медресурс\"","ПР-123",null,"уп.",100,null,null,null,"Шприц (1 мл.)"]
["Аллерген из домашней пыли для диагностики","комп.",2,6644.33,"комп.",1,6644.33,null,null,null,null,null,null,null,null,"Контейнер для сбора мочи (стер., 100 мл.)","ООО \"Восток\"","Кн-999",null,"шт.",140,null,null,null,"Шприц (10 мл.)"]
["Аллерген из клеща Dermatophagoides pteronissinus для диагностики и лечения","комп.",2,6644.33,"комп.",1,6644.33,null,null,null,null,null,null,null,null,"Пробирка Vacuette (4 мл., 50 шт.)","ООО \"Восток\"","Кн-999",null,"шт.",110,null,null,null,"Шприц (2 мл. 2 иглы)"]
["Аллерген из пера подушек для диагностики и лечения","комп.",2,6644.33,"комп.",1,6644.33,null,null,null,null,null,null,null,null,"Контейнер для утилизации отходов МК-01 (однораз., желтый, 3 л.)","ООО \"Восток\"","Кн-999",null,"шт.",200,null,null,null,"Шприц (2 мл.)"]
["Аллерген из перхоти лошади для диагностики","комп.",2,4216.63,"комп.",1,4216.63,null,null,null,null,null,null,null,null,"Контейнер для утилизации отходов МК-04 (многораз., бирюзовый, 7,5 л.).","ООО \"Восток\"","Кн-999",null,"шт.",60,null,null,null,"Шприц (20 мл.)"]
["Аллерген из пыльцы березы висячей для диагностики и лечения","комп.",2,3932.61,"комп.",1,3932.61,null,null,null,null,null,null,null,null,"Контейнер для утилизации отходов МК-05 (многораз., желтый 50 л.)","ООО \"Восток\"","Кн-999",null,"шт.",80,null,null,null,"Шприц (5 мл. 2 иглы)"]
["Аллерген из пыльцы клена ясенелистного для диагностики и лечения","комп.",1,3932.61,"комп.",1,3932.61,null,null,null,null,null,null,null,null,"Контрольная сыворотка на РМП (отрицательный) (1 мл., 10 шт.)","ООО \"Восток\"","Кн-999",null,"уп.",200,null,null,null,"Шприц (5 мл.)"]
["Аллерген из пыльцы лебеды татарской для диагностики и лечения","комп.",2,3932.61,"комп.",1,3932.61,null,null,null,null,null,null,null,null,"Контрольная сыворотка на РМП (положительная) (1 мл., 10 шт.)","ООО \"Восток\"","Кн-999",null,"уп.",60]
["Аллерген из пыльцы луговых трав для диагностики и лечения","комп.",2,4424.42,"комп.",1,4424.42,null,null,null,null,null,null,null,null,"Контрольная сыворотка на РМП (слабоположительный) (1 мл., 10 шт.)","ООО \"Восток\"","Кн-999",null,"уп.",90]
["Аллерген из пыльцы одуванчика лекарственного для диагностики и лечения","комп.",1,3932.61,"комп.",1,3932.61,null,null,null,null,null,null,null,null,"Пробирка Vacuette (4 мл., 50 шт.)","ООО \"Сибмедком\"",5996,null,"уп.",70]
["Аллерген из пыльцы полыни горькой для диагностики и лечения","комп.",2,3932.61,"комп.",1,3932.61,null,null,null,null,null,null,null,null,"Пакеты упаковочные для стерилизации СтериТ (200*300, 100 шт.)","ООО \"Сибмедком\"",5996,null,"уп.",100]
["Аллерген эпидермальный из шерсти кошки для диагностики","комп.",2,4216.63,"комп.",1,4216.63,null,null,null,null,null,null,null,null,"Пакеты упаковочные для стерилизации СтериТ (200*330, 100 шт.)","ООО \"Сибмедком\"",5996,null,"уп.",200]
["Аллерген эпидермальный из шерсти собаки для диагностики","комп.",2,4216.63,"комп.",1,4216.63]
["Амброксол (р-р для приема внутрь и ингаляций, 7,5 мг./1 мл., 100 мл.)","фл.",5,171.13,null,null,""]
["Аммиака раствор (амп., 10%, 40 мл.)","фл.",50,21,null,null,""]
["Баллон Политцера с оливами","набор",1,3422.4,null,null,""]
["Берет медицинский (однораз.)","шт.",1,11,"шт.",1,11]
["Беродуал (р-р для ингаляций флакон/кап. по 20 мл.)","фл.",5,260.13,null,null,""]
["Бинт (нест., 10 м.х15 см.)","шт.",1,21.36,"шт.",1,21.36]
["Бинт (нест., 5 м.х10 см.)","шт.",1,6.13,"шт.",1,6.13]
["Бинт (стер. 10 м.х15 см.)","шт.",1,23.68,"шт.",1,23.68]
["Бинт (стер. 5 м.х10 см.)","шт.",1,7.44,"шт.",1,7.44]
["Бонадерм - крем для рук восстанавливающий (100 мл.)","шт.",1,99.12,"мл.",100,0.99120000000000008]
["Бонадерм-гель (100 мл.)","шт.",1,178.18,"мл.",100,1.7818000000000001]
["Бонадерм-ИП салфетки (100 шт.)","уп.",150,324.5,"шт.",100,3.2450000000000001]
["Бонадерм-Ультра (100 мл., с распыляющей насадкой)","шт.",1,149.86000000000001,"мл.",100,1.4986000000000002]
["Бонадерм-Ультра (50 мл., с распыляющей насадкой)","шт.",1,118,"мл.",50,2.36]
["Бриллиантовый зеленый (амп., 1%, 10 мл.)","шт.",1,9.5,"мл.",10,0.95]
["Бромгексин (таб., 4 мг., № 50)","уп.",50,70.77,null,null,""]
["Бромгексин (таб., 8 мг., № 20)","уп.",20,9.2799999999999994,null,null,""]
["Бумага для спирографа Микролаб viasys (110*12*12)","уп.",5,72.34,null,null,""]
["Бумага УЗИ сканер (20 м.)","рул.",2,1006.3,"м.",20,50.314999999999998]
["Бумага ЭКГ (110 мм. х 30 мм.)","рул.",60,108,null,null,""]
["Бумага ЭКГ (80 мм. х 70 мм., 300 л.)","пач.",50,74.61,null,null,""]
["Буфер для окраски мазков (рН от 6,8 до 7,2, 10 мл.)","фл.",6,46.9,null,null,""]
["Вазелиновое масло (100 мл.)","шт.",1,52.8,"мл.",100,0.52800000000000002]
["Валериана (20 мг., №50)","уп.",null,null,null,null,""]
["Вата (нест. 100 гр.)","уп.",70,21.1,null,null,""]
["Вата (нест. 250 гр.)","уп.",60,46.92,null,null,""]
["Вата (стер. 100 гр.)","уп.",5,28.54,null,null,""]
["Ватные палочки, ушные (100 шт.)","уп.",5000,0.14000000000000001,"шт.",100,1.4000000000000002E-3]
["Ватные шарики (стер.)","уп.",null,null,null,null,""]
["Вентолин Небулы (амп., для ингаляций 1 мг/мл., 2,5 мл. № 20)","уп.",3,265.13,"шт.",20,13.256499999999999]
["Винпоцетин (таб., 5 мг., №10)","уп.",70,54.6,null,null,""]
["Винпоцетин-АКОС (амп., 2 мл., №10)","уп.",20,57.24,null,null,""]
["Вода дистиллированная (амп., 50 мл., №10)","уп.",60,30.25,null,null,""]
["Воронка ушная (1-4 мм.)","шт.",1,200,"шт.",1,200]
["Воронка ушная (2-5 мм.)","шт.",1,200,"шт.",1,200]
["Гель для УЗИ (1 л.)","фл.",10,169.58,null,1000,0.16958000000000001]
["Гель для УЗИ (5 л.)","кан.",1,633.66,null,null,""]
["Гипотиазид (таб., 25 мг., №20)","уп.",null,null,null,null,""]
["Гистамин дигидрохлорид 0,1% раствор (аллерген), шт",null,null,1100,null,null,""]
["Глицин (таб., 100 мг., №50)","уп.",75,31,null,null,""]
["Губка гемостатическая коллагеновая (90х90 мм., №1)","уп.",150,95,null,null,""]
["Дез.средство \"Литосептин\", 1л, л",null,null,1206,null,null,""]
["Дез.средство \"Литосептин\", 5л, л",null,null,1120.7,null,null,""]
["Дез.средство \"ОДС-14\", 1л, л",null,null,936.86,null,null,""]
["Дезинфицирующее средство \"Бонацид\", л",null,null,1237.82,null,null,""]
["Дексаметазон (сусп., 5 мл., №1)","уп.",3,33.43,null,null,""]
["Диаскинтест, доз.",null,null,53.69,null,null,""]
["Диклофенак (75 мг., №10)","уп.",null,null,null,null,""]
["Димексид (100 мл.)","уп.",4,46.3,null,null,""]
["Диспенсер для листовых полотенец","шт.",1,908.6,"шт.",1,908.6]
["Дозатор автоматический BIOHIT (100-1000 мкл.)","шт.",1,6800,"шт.",1,6800]
["Дозатор автоматический BIOHIT (500-5000 мкл.)","шт.",1,10744,"шт.",1,10744]
["Дозатор жидк. дез. средств локтевой","шт.",1,1843.75,"шт.",1,1843.75]
["Доксициклин","уп.",null,15.78,null,null,""]
["Дюфастон (таб., 10 мг., №20)","уп.",null,null,null,null,""]
["Ёмкость для сбора использованного медицинского материала класса Б","шт.",1,44.32,"шт.",1,44.32]
["Жгут венозный детский","шт.",1,382,"шт.",1,382]
["Жгут многоразовый автоматический Vacuette","шт.",1,617,"шт.",1,617]
["Жгут резиновый кровостанавливающий (1,5 м.)","шт.",1,27,"шт.",1,27]
["Зажим типа Москит изогнутый (140 мм.)","шт.",1,384,"шт.",1,384]
["Зажим типа Москит прямой (150 мм.)","шт.",1,346,"шт.",1,346]
["Зеркало гинекологическое \"Куско\"","шт.",1,null,"шт.",1,0]
["Зеркало носовое (№30)","шт.",1,603,"шт.",1,603]
["Зеркало носовое (№35)","шт.",1,603,"шт.",1,603]
["Зеркало носовое (№40)","шт.",1,603,"шт.",1,603]
["Зонд аттиковый (140 мм.)","шт.",1,430,"шт.",1,430]
["Зонд урогенитальный (стер., однораз.)","шт.",1,5.42,"шт.",1,5.42]
["Игла двусторонняя Vacuette ( 0,8х38 мм (21Gх1 ½), 100 шт.)","уп.",80,965,"шт.",100,9.65]
["Игла зеленая для пробирок Vacuette (100 шт.)","уп.",80,965,"шт.",100,9.65]
["Иглодержатель","шт.",1,430,"шт.",1,430]
["Инструмент универсальный сенсорный","шт.",1,1205,"шт.",1,1205]
["Кавинтон (амп., 10 мг., 2,0, №10)","уп.",null,null,null,null,""]
["Кавинтон (таб. 5 мг., №50)","уп.",null,null,null,null,""]
["Калибратор (10 ммоль/л, 4 шт.)","уп.",2,450,"шт.",4,112.5]
["Кальция хлорид (10%, 5,0 №10)","уп.",null,null,null,null,""]
["Камера Горяева","шт.",1,584.53,"шт.",1,584.53]
["Канюля для промывания аттика","шт.",1,298,"шт.",1,298]
["Капилляр Панченкова ","шт.",1,9.3000000000000007,"шт.",1,9.3000000000000007]
["Катетер урологический (женский, стер.)","шт.",1,6.88,"шт.",1,6.88]
["Кислородная подушка (25 л.)","шт.",1,1123,"шт.",1,1123]
["Кислота уксусная (р-р)","уп.",null,54,null,null,""]
["Колларгол (р-р)","уп.",null,98,null,null,""]
["Комплект противоэпидемический","комп.",1,1787.52,null,null,""]
["Контейнер для сбора кала (стер., 40 мл.)","шт.",1,4.12,"шт.",1,4.12]
{"$rows_left_out":202}