{"text_format":"1","workbook":"xlsx","n_sheets":2,"sheets":["Sheet1","Лист1"],"not_rendered":{"charts":0,"images":0,"macros":1,"external_links":0,"defined_names":0,"comments":0,"pivot_tables":0},"unopened":[],"bounds":{"document_bytes":16777216,"sheet_cells":100000,"rows_first":2000,"rows_last":500,"rows_between":2000,"halvings":0,"cell_chars":16384,"cell_head_chars":4096},"cells_cut":0,"cells_raw":0,"read":"whole","date_system":"1900"}

{"sheet":"Sheet1","index":0,"n_rows":14,"n_cols":5,"rows_kept":14,"cut":false,"hidden":false,"merged":[]}
["Дата","оценка","номер договора","Сотрудник","Начальник"]
["2018-06-27T12:25:49",null,null,"соболев",{"$f":"IFERROR(VLOOKUP(D2,Лист1!D$1:E$500,2,),\"\")","v":"Иванова"}]
["2018-06-27T11:39:40",null,null,"соболев",{"$f":"IFERROR(VLOOKUP(D3,Лист1!D$1:E$500,2,),\"\")","v":"Иванова"}]
["2018-06-27T11:39:41",null,null,"соболев",{"$f":"IFERROR(VLOOKUP(D4,Лист1!D$1:E$500,2,),\"\")","v":"Иванова"}]
["2018-06-27T11:39:42",null,null,"соболев",{"$f":"IFERROR(VLOOKUP(D5,Лист1!D$1:E$500,2,),\"\")","v":"Иванова"}]
["2018-06-27T11:18:57",null,null,"соболев",{"$f":"IFERROR(VLOOKUP(D6,Лист1!D$1:E$500,2,),\"\")","v":"Иванова"}]
["2018-06-27T11:39:43",null,null,"соболев",{"$f":"IFERROR(VLOOKUP(D7,Лист1!D$1:E$500,2,),\"\")","v":"Иванова"}]
["2018-06-27T11:39:44",4,null,"соболев",{"$f":"IFERROR(VLOOKUP(D8,Лист1!D$1:E$500,2,),\"\")","v":"Иванова"}]
["2018-06-27T12:24:49",null,null,"соболев",{"$f":"IFERROR(VLOOKUP(D9,Лист1!D$1:E$500,2,),\"\")","v":"Иванова"}]
["2018-06-27T11:39:45",null,null,null,{"$f":"IFERROR(VLOOKUP(D10,Лист1!D$1:E$500,2,),\"\")","v":""}]
["2018-06-27T11:39:45",null,null,null,{"$f":"IFERROR(VLOOKUP(D11,Лист1!D$1:E$500,2,),\"\")","v":""}]
["2018-06-27T11:39:46",null,null,"соболев",{"$f":"IFERROR(VLOOKUP(D12,Лист1!D$1:E$500,2,),\"\")","v":"Иванова"}]
["2018-06-27T11:39:47",null,null,"соболев",{"$f":"IFERROR(VLOOKUP(D13,Лист1!D$1:E$500,2,),\"\")","v":"Иванова"}]
["2018-06-27T11:40:10",null,null,null,{"$f":"IFERROR(VLOOKUP(D14,Лист1!D$1:E$500,2,),\"\")","v":""}]

{"sheet":"Лист1","index":1,"n_rows":6,"n_cols":5,"rows_kept":6,"cut":false,"hidden":false,"merged":[]}
[false,null,null,"Петров","Иванова"]
[null,null,null,"Смирнов","Иванова"]
[null,null,null,"Соболев","Иванова"]
[]
[null,null,null,"иванов","петров"]
[null,null,null,"степанов","петров"]