{"text_format":"1","workbook":"xlsx","n_sheets":2,"sheets":["Sheet1","Лист1"],"not_rendered":{"charts":0,"images":0,"macros":1,"external_links":0,"defined_names":1,"comments":0,"pivot_tables":0},"unopened":[],"bounds":{"document_bytes":16777216,"sheet_cells":100000,"rows_first":2000,"rows_last":500,"rows_between":2000,"halvings":0,"cell_chars":16384,"cell_head_chars":4096},"cells_cut":0,"cells_raw":0,"read":"whole","date_system":"1900"}

{"sheet":"Sheet1","index":0,"n_rows":29,"n_cols":5,"rows_kept":29,"cut":false,"hidden":false,"merged":[]}
["Дата","сотрудник","дата чата","Сотрудник","НС"]
["2018-06-27T08:21:43",null,null,"петров",{"$f":"VLOOKUP(D2,Лист1!$D$1:$E$500,2,FALSE)","v":"Иванова"}]
["2018-06-27T08:21:44",null,null,"петров",{"$f":"VLOOKUP(D3,Лист1!$D$1:$E$500,2,FALSE)","v":"Иванова"}]
["2018-06-27T08:21:45",null,null,"петров",{"$f":"VLOOKUP(D4,Лист1!$D$1:$E$500,2,FALSE)","v":"Иванова"}]
["2018-06-27T08:21:46",null,null,"петров",{"$f":"VLOOKUP(D5,Лист1!$D$1:$E$500,2,FALSE)","v":"Иванова"}]
["2018-06-27T08:21:46",null,null,"петров",{"$f":"VLOOKUP(D6,Лист1!$D$1:$E$500,2,FALSE)","v":"Иванова"}]
["2018-06-27T08:21:47",null,null,"петров",{"$f":"VLOOKUP(D7,Лист1!$D$1:$E$500,2,FALSE)","v":"Иванова"}]
["2018-06-27T08:21:48",null,null,"петров",{"$f":"VLOOKUP(D8,Лист1!$D$1:$E$500,2,FALSE)","v":"Иванова"}]
["2018-06-27T08:21:48",null,null,"петров",{"$f":"VLOOKUP(D9,Лист1!$D$1:$E$500,2,FALSE)","v":"Иванова"}]
["2018-06-27T08:21:49",null,null,"петров",{"$f":"VLOOKUP(D10,Лист1!$D$1:$E$500,2,FALSE)","v":"Иванова"}]
["2018-06-27T08:21:50",null,null,"петров",{"$f":"VLOOKUP(D11,Лист1!$D$1:$E$500,2,FALSE)","v":"Иванова"}]
["2018-06-27T08:21:51",null,null,"петров",{"$f":"VLOOKUP(D12,Лист1!$D$1:$E$500,2,FALSE)","v":"Иванова"}]
["2018-06-27T08:21:35",null,null,null,{"$f":"VLOOKUP(D13,Лист1!$D$1:$E$500,2,FALSE)","v":{"$error":"#N/A"}}]
["2018-06-26T22:25:28",null,null,null,{"$f":"VLOOKUP(D14,Лист1!$D$1:$E$500,2,FALSE)","v":{"$error":"#N/A"}}]
["2018-06-26T22:25:27",null,null,null,{"$f":"VLOOKUP(D15,Лист1!$D$1:$E$500,2,FALSE)","v":{"$error":"#N/A"}}]
["2018-06-26T22:25:06",null,null,null,{"$f":"VLOOKUP(D16,Лист1!$D$1:$E$500,2,FALSE)","v":{"$error":"#N/A"}}]
["2018-06-26T22:25:06",null,null,null,{"$f":"VLOOKUP(D17,Лист1!$D$1:$E$500,2,FALSE)","v":{"$error":"#N/A"}}]
["2018-06-26T22:25:06",null,null,null,{"$f":"VLOOKUP(D18,Лист1!$D$1:$E$500,2,FALSE)","v":{"$error":"#N/A"}}]
["2018-06-26T22:25:06",null,null,null,{"$f":"VLOOKUP(D19,Лист1!$D$1:$E$500,2,FALSE)","v":{"$error":"#N/A"}}]
["2018-06-26T22:25:06",null,null,null,{"$f":"VLOOKUP(D20,Лист1!$D$1:$E$500,2,FALSE)","v":{"$error":"#N/A"}}]
["2018-06-26T22:25:06",null,null,null,{"$f":"VLOOKUP(D21,Лист1!$D$1:$E$500,2,FALSE)","v":{"$error":"#N/A"}}]
["2018-06-26T22:25:06",null,null,null,{"$f":"VLOOKUP(D22,Лист1!$D$1:$E$500,2,FALSE)","v":{"$error":"#N/A"}}]
["2018-06-26T22:25:06",null,null,null,{"$f":"VLOOKUP(D23,Лист1!$D$1:$E$500,2,FALSE)","v":{"$error":"#N/A"}}]
["2018-06-26T22:25:06",null,null,null,{"$f":"VLOOKUP(D24,Лист1!$D$1:$E$500,2,FALSE)","v":{"$error":"#N/A"}}]
["2018-06-26T22:25:06",null,null,null,{"$f":"VLOOKUP(D25,Лист1!$D$1:$E$500,2,FALSE)","v":{"$error":"#N/A"}}]
["2018-06-26T22:25:06",null,null,"и",{"$f":"VLOOKUP(D26,Лист1!$D$1:$E$500,2,FALSE)","v":{"$error":"#N/A"}}]
[]
[]
[null,null,null,"и"]

{"sheet":"Лист1","index":1,"n_rows":3,"n_cols":5,"rows_kept":3,"cut":false,"hidden":false,"merged":[]}
[false,null,null,"Петров","Иванова"]
[null,null,null,"Смирнов","Иванова"]
[null,null,null,"Соболев","Иванова"]