{"text_format":"1","workbook":"xlsx","n_sheets":6,"sheets":["Январь","Февраль","Март","ТС","Отчет журнал","Сотрудники"],"not_rendered":{"charts":0,"images":0,"macros":1,"external_links":0,"defined_names":7,"comments":0,"pivot_tables":0},"unopened":[],"bounds":{"document_bytes":16777216,"sheet_cells":100000,"rows_first":2000,"rows_last":500,"rows_between":2000,"halvings":0,"cell_chars":16384,"cell_head_chars":4096},"cells_cut":0,"cells_raw":0,"read":"whole","date_system":"1900"}

{"sheet":"Январь","index":0,"n_rows":41,"n_cols":26,"rows_kept":41,"cut":false,"hidden":false,"merged":[[1,0,1,15],[2,0,2,15],[3,14,3,15]]}
[null,null,null,null,null,null,null,null,null,null,null,null,null,null,null,"Январь",null,null,null,2,null,null,null,"Экономия","Базовая норма расхода на 100 км","Базовая норма расхода на 1 мото/час"]
["Общество с ограниченной ответственностью  \"Втормет Царицыно\"",null,null,null,null,null,null,null,null,null,null,null,null,null,null,null,null,"1-я половина","2018-01-01","2018-01-18",{"$f":"ТС!E5","v":500},{"$f":"SUMIFS(Январь[Выдано топливо, литр],Январь[Дата],\">=\"&$S$2,Январь[Дата],\"<=\"&$T$2)+IF(MONTH(T2)<>MONTH(S2),INDIRECT(TEXT(A7-1,\"ММММ\")&\"!F38\")-SUM(INDIRECT(TEXT(A7-1,\"ММММ\")&\"!V1:V2\")))","v":330},{"$f":"IF(V2=0,0,(SUMIFS($N$7:$N$37,$A$7:$A$37,\">=\"&$S$2,$A$7:$A$37,\"<=\"&$T$2))/(V2-U2+G7))","v":1.0985000000000003},{"$f":"SUMIFS(Январь[Отклонение от нормы (Перерасход(+), экономия(-)), литр],Январь[Дата],\">=\"&$S$2,Январь[Дата],\"<=\"&$T$2)","v":-32.50500000000001},{"$f":"IF(Y4=\"Зима\",VLOOKUP(Z4,Расчет[[Номер гос.регистрации / Заводской номер]:[Итога норма а/м \"ЛЕТО\"]],8,FALSE),VLOOKUP(Z4,Расчет[[Номер гос.регистрации / Заводской номер]:[Итога норма а/м \"ЛЕТО\"]],9,FALSE))","v":51.546000000000006},{"$f":"IF(Y4=\"Зима\",VLOOKUP(Z4,Расчет[[Номер гос.регистрации / Заводской номер]:[Итога норма а/м \"ЛЕТО\"]],13,FALSE),VLOOKUP(Z4,Расчет[[Номер гос.регистрации / Заводской номер]:[Итога норма а/м \"ЛЕТО\"]],14,FALSE))","v":6.0500000000000007}]
["Отчет водителя ломовоза с манипулятором",null,null,null,null,null,null,null,null,null,null,null,null,null,null,null,null,"2-я половина",{"$f":"T2+1","v":"2018-01-19"},{"$f":"INDEX(Январь[Дата],COUNT(Январь[Дата]))-T1","v":"2018-01-29"},{"$f":"ТС!E6","v":500},{"$f":"SUMIFS(Январь[Выдано топливо, литр],Январь[Дата],\">=\"&$S$3,Январь[Дата],\"<=\"&$T$3)+IF(MONTH(T3)<>MONTH(S3),INDIRECT(TEXT(A7-1,\"ММММ\")&\"!F38\")-SUM(INDIRECT(TEXT(A7-1,\"ММММ\")&\"!V1:V2\")))","v":502},{"$f":"IF(V3=0,0,(SUMIFS($N$7:$N$37,$A$7:$A$37,\">=\"&$S$3,$A$7:$A$37,\"<=\"&$T$3))/(V3-U3+U3))","v":1.4440836653386455},{"$f":"SUMIFS(Январь[Отклонение от нормы (Перерасход(+), экономия(-)), литр],Январь[Дата],\">=\"&$S$3,Январь[Дата],\"<=\"&$T$3)","v":-221.92999999999998}]
[null,null,null,null,null,null,null,"за",2018,null,null,null,null,null,"т056вв 197",null,null,null,{"$f":"T3+1","v":"2018-01-30"},null,null,null,{"$f":"IFERROR(INDIRECT(TEXT(A7+40,\"ММММ\")&\"!W2\"),)","v":0.90583314154200212},null,"Зима","Норма 1"]
[]
["Дата","ФИО водителя","Показание одометра машины на начало дня, км","Показание одометра машины на конец дня, км","Пройдено за день, км","Выдано топливо, литр","Остаток топлива в баке на начало дня, литр","Показание счетчика моточасов спецоборудования на начало дня, м/ч","Показание счетчика моточасов  спецоборудования на конец дня, м/ч","Работа спецоборудования за день, м/ч","Количество ходок","Расход топлива на работу спецоборудования, литр","Остаток топлива в баке на конец дня, литр","Расход топлива по норме, литр","Фактический расход топлива, литр","Отклонение от нормы (Перерасход(+), экономия(-)), литр",null,"Выдано топливо, литр","Пройдено за день, км","Фактический расход топлива, литр","Работа спецоборудования за день, м/ч","Расход топлива по норме, литр","Дата"]
[{"$f":"IFERROR(DATEVALUE((COUNT($A$6:A6)+1)&$P$1&$I$4),\"\")","v":"2018-01-01"},null,{"$f":"ТС!C5","v":209024},209024,{"$f":"Январь[[#This Row],[Показание одометра машины на конец дня, км]]-Январь[[#This Row],[Показание одометра машины на начало дня, км]]+S7","v":0},null,{"$f":"ТС!E5","v":500},{"$f":"ТС!D5","v":620},620,{"$f":"IF(U7=\"\",Январь[[#This Row],[Показание счетчика моточасов  спецоборудования на конец дня, м/ч]],Январь[[#This Row],[Показание счетчика моточасов  спецоборудования на конец дня, м/ч]]+1)-Январь[[#This Row],[Показание счетчика моточасов спецоборудования на начало дня, м/ч]]","v":0},null,{"$f":"IF(Январь[[#This Row],[Работа спецоборудования за день, м/ч]]=\"\",\"\",Январь[[#This Row],[Работа спецоборудования за день, м/ч]]*$Z$2)","v":0},{"$f":"IF(VLOOKUP(Январь[Дата],S$2:U$3,3),IFERROR(IF(R7=\"\",Январь[[#This Row],[Выдано топливо, литр]],Январь[[#This Row],[Выдано топливо, литр]]+R7)+Январь[[#This Row],[Остаток топлива в баке на начало дня, литр]]-Январь[[#This Row],[Фактический расход топлива, литр]],\"\"),\"\")","v":500},{"$f":"ROUND((Январь[[#This Row],[Пройдено за день, км]]*0.01*$Y$2+Январь[[#This Row],[Расход топлива на работу спецоборудования, литр]]),3)+V7","v":0},{"$f":"ROUND(Январь[[#This Row],[Расход топлива по норме, литр]]/VLOOKUP(Январь[Дата],S$2:W$4,5),0)+T7","v":0},{"$f":"IFERROR(Январь[[#This Row],[Фактический расход топлива, литр]]-Январь[[#This Row],[Расход топлива по норме, литр]],\"\")","v":0},null,null,null,null,null,null,{"$f":"Январь[[#This Row],[Дата]]","v":"2018-01-01"}]
[{"$f":"IFERROR(DATEVALUE((COUNT($A$6:A7)+1)&$P$1&$I$4),\"\")","v":"2018-01-02"},null,{"$f":"IF(D7=\"\",\"\",D7)","v":209024},209024,{"$f":"Январь[[#This Row],[Показание одометра машины на конец дня, км]]-Январь[[#This Row],[Показание одометра машины на начало дня, км]]+S8","v":0},null,{"$f":"IF(Январь[[#This Row],[Дата]]=\"\",\"\",M7)","v":500},{"$f":"I7","v":620},620,{"$f":"IF(U8=\"\",Январь[[#This Row],[Показание счетчика моточасов  спецоборудования на конец дня, м/ч]],Январь[[#This Row],[Показание счетчика моточасов  спецоборудования на конец дня, м/ч]]+1)-Январь[[#This Row],[Показание счетчика моточасов спецоборудования на начало дня, м/ч]]","v":0},null,{"$f":"IF(Январь[[#This Row],[Работа спецоборудования за день, м/ч]]=\"\",\"\",Январь[[#This Row],[Работа спецоборудования за день, м/ч]]*$Z$2)","v":0},{"$f":"IF(VLOOKUP(Январь[Дата],S$2:U$3,3),IFERROR(IF(R8=\"\",Январь[[#This Row],[Выдано топливо, литр]],Январь[[#This Row],[Выдано топливо, литр]]+R8)+Январь[[#This Row],[Остаток топлива в баке на начало дня, литр]]-Январь[[#This Row],[Фактический расход топлива, литр]],\"\"),\"\")","v":500},{"$f":"ROUND((Январь[[#This Row],[Пройдено за день, км]]*0.01*$Y$2+Январь[[#This Row],[Расход топлива на работу спецоборудования, литр]]),3)+V8","v":0},{"$f":"ROUND(Январь[[#This Row],[Расход топлива по норме, литр]]/VLOOKUP(Январь[Дата],S$2:W$4,5),0)+T8","v":0},{"$f":"IFERROR(Январь[[#This Row],[Фактический расход топлива, литр]]-Январь[[#This Row],[Расход топлива по норме, литр]],\"\")","v":0},null,null,null,null,null,null,{"$f":"Январь[[#This Row],[Дата]]","v":"2018-01-02"}]
{"$rows_left_out":34}
{"sheet":"Февраль","index":1,"n_rows":40,"n_cols":26,"rows_kept":40,"cut":false,"hidden":false,"merged":[[1,0,1,15],[2,0,2,15],[3,14,3,15]]}
[null,null,null,null,null,null,null,null,null,null,null,null,null,null,null,"Февраль",null,null,null,-3,null,null,null,"Экономия","Базовая норма расхода на 100 км","Базовая норма расхода на 1 мото/час"]
["Общество с ограниченной ответственностью  \"Втормет Царицыно\"",null,null,null,null,null,null,null,null,null,null,null,null,null,null,null,null,"1-я половина",{"$f":"INDIRECT(TEXT(A7-1,\"ММММ\")&\"!t3\")+1","v":"2018-01-30"},"2018-02-15",{"$f":"ТС!E5","v":500},{"$f":"SUMIFS(Февраль[Выдано топливо, литр],Февраль[Дата],\">=\"&$S$2,Февраль[Дата],\"<=\"&$T$2)+IF(MONTH(T2)<>MONTH(S2),INDIRECT(TEXT(A7-1,\"ММММ\")&\"!F38\")-SUM(INDIRECT(TEXT(A7-1,\"ММММ\")&\"!V3:V2\")))","v":870},{"$f":"IF(V2=0,0,(SUMIFS(N7:N37,A7:A37,\">=\"&S2,A7:A37,\"<=\"&T2)+SUMIFS(INDIRECT(TEXT(A7-1,\"ММММ\")&\"!N7:N37\"),INDIRECT(TEXT(A7-1,\"ММММ\")&\"!A7:A37\"),\">=\"&S2))/(V2-U2+IF(MONTH(T2)=MONTH(S2),G7,INDEX(INDIRECT(TEXT(A7-1,\"ММММ\")&\"!G7:G37\"),DAY(S2)))))","v":0.90583314154200212},{"$f":"SUMIFS(Февраль[Отклонение от нормы (Перерасход(+), экономия(-)), литр],Февраль[Дата],\">=\"&$S$2,Февраль[Дата],\"<=\"&$T$2)","v":73.899000000000001},{"$f":"IF(Y4=\"Зима\",VLOOKUP(Z4,Расчет[[Номер гос.регистрации / Заводской номер]:[Итога норма а/м \"ЛЕТО\"]],8,FALSE),VLOOKUP(Z4,Расчет[[Номер гос.регистрации / Заводской номер]:[Итога норма а/м \"ЛЕТО\"]],9,FALSE))","v":51.546000000000006},{"$f":"IF(Y4=\"Зима\",VLOOKUP(Z4,Расчет[[Номер гос.регистрации / Заводской номер]:[Итога норма а/м \"ЛЕТО\"]],13,FALSE),VLOOKUP(Z4,Расчет[[Номер гос.регистрации / Заводской номер]:[Итога норма а/м \"ЛЕТО\"]],14,FALSE))","v":6.0500000000000007}]
["Отчет водителя ломовоза с манипулятором",null,null,null,null,null,null,null,null,null,null,null,null,null,null,null,null,"2-я половина",{"$f":"T2+1","v":"2018-02-16"},{"$f":"INDEX(Февраль[Дата],COUNT(Февраль[Дата]))-T1","v":"2018-03-03"},{"$f":"ТС!E6","v":500},{"$f":"SUMIFS(Февраль[Выдано топливо, литр],Февраль[Дата],\">=\"&$S$3,Февраль[Дата],\"<=\"&$T$3)+IF(MONTH(T3)<>MONTH(S3),SUMIFS(INDIRECT(TEXT(T3,\"ММММ\")&\"[Выдано топливо, литр]\"),INDIRECT(TEXT(T3,\"ММММ\")&\"[Дата]\"),\">=\"&$S$3,INDIRECT(TEXT(T3,\"ММММ\")&\"[Дата]\"),\"<=\"&$T$3))","v":450},{"$f":"IF(V3=0,0,(SUMIFS(N7:N37,A7:A37,\">=\"&S3,A7:A37,\"<=\"&T3)+SUMIFS(INDIRECT(TEXT(A7-1,\"ММММ\")&\"!N7:N37\"),INDIRECT(TEXT(A7-1,\"ММММ\")&\"!A7:A37\"),\">=\"&S3))/(V3-U3+IF(MONTH(T3)=MONTH(S3),G7,INDEX(INDIRECT(TEXT(A7-1,\"ММММ\")&\"!G7:G37\"),DAY(S3)))))","v":1.0857218543046359},{"$f":"SUMIFS(Февраль[Отклонение от нормы (Перерасход(+), экономия(-)), литр],Февраль[Дата],\">=\"&$S$3,Февраль[Дата],\"<=\"&$T$3)","v":-25.887999999999991}]
[null,null,null,null,null,null,null,"за",2018,null,null,null,null,null,"т056вв 197",null,null,null,{"$f":"T3+1","v":"2018-03-04"},null,null,null,{"$f":"IFERROR(INDIRECT(TEXT(A7+40,\"ММММ\")&\"!W2\"),)","v":1.0292209677419355},null,"Зима","Норма 1"]
[]
["Дата","ФИО водителя","Показание одометра машины на начало дня, км","Показание одометра машины на конец дня, км","Пройдено за день, км","Выдано топливо, литр","Остаток топлива в баке на начало дня, литр","Показание счетчика моточасов спецоборудования на начало дня, м/ч","Показание счетчика моточасов  спецоборудования на конец дня, м/ч","Работа спецоборудования за день, м/ч","Количество ходок","Расход топлива на работу спецоборудования, литр","Остаток топлива в баке на конец дня, литр","Расход топлива по норме, литр","Фактический расход топлива, литр","Отклонение от нормы (Перерасход(+), экономия(-)), литр",null,"Выдано топливо, литр","Пройдено за день, км","Фактический расход топлива, литр","Работа спецоборудования за день, м/ч","Расход топлива по норме, литр","Дата"]
[{"$f":"IFERROR(DATEVALUE((COUNT($A$6:A6)+1)&$P$1&$I$4),\"\")","v":"2018-02-01"},null,{"$f":"INDEX(Январь!D7:D37,COUNT(Январь!D7:D37))","v":210723},210723,{"$f":"IFERROR(Февраль[[#This Row],[Показание одометра машины на конец дня, км]]-Февраль[[#This Row],[Показание одометра машины на начало дня, км]]+S7,\"\")","v":0},null,{"$f":"U2","v":500},{"$f":"INDEX(Январь!I7:I37,COUNT(Январь!I7:I37))","v":671},671,{"$f":"IFERROR(IF(U7=\"\",Февраль[[#This Row],[Показание счетчика моточасов  спецоборудования на конец дня, м/ч]],Февраль[[#This Row],[Показание счетчика моточасов  спецоборудования на конец дня, м/ч]]+1)-Февраль[[#This Row],[Показание счетчика моточасов спецоборудования на начало дня, м/ч]],\"\")","v":0},0,{"$f":"IF(Февраль[[#This Row],[Работа спецоборудования за день, м/ч]]=\"\",\"\",Февраль[[#This Row],[Работа спецоборудования за день, м/ч]]*$Z$2)","v":0},{"$f":"IFERROR(IF(VLOOKUP(Февраль[Дата],S$2:U$3,3),IFERROR(IF(R7=\"\",Февраль[[#This Row],[Выдано топливо, литр]],Февраль[[#This Row],[Выдано топливо, литр]]+R7)+Февраль[[#This Row],[Остаток топлива в баке на начало дня, литр]]-Февраль[[#This Row],[Фактический расход топлива, литр]],\"\"),\"\"),\"\")","v":500},{"$f":"IFERROR(ROUND((Февраль[[#This Row],[Пройдено за день, км]]*0.01*$Y$2+Февраль[[#This Row],[Расход топлива на работу спецоборудования, литр]]),3)+V7,\"\")","v":0},{"$f":"IFERROR(IF(Февраль[[#Totals],[Выдано топливо, литр]]=0,0,(ROUND(Февраль[[#This Row],[Расход топлива по норме, литр]]/IF(DAY(Февраль[Дата])<=18,$W$2,$W$3),0)))+T7,\"\")","v":0},{"$f":"IFERROR(Февраль[[#This Row],[Фактический расход топлива, литр]]-Февраль[[#This Row],[Расход топлива по норме, литр]],\"\")","v":0},null,null,null,null,null,null,{"$f":"Февраль[[#This Row],[Дата]]","v":"2018-02-01"}]
[{"$f":"IFERROR(DATEVALUE((COUNT($A$6:A7)+1)&$P$1&$I$4),\"\")","v":"2018-02-02"},"Никляев В.А.",{"$f":"IF(Февраль[[#This Row],[Дата]]=\"\",\"\",D7)","v":210723},210735,{"$f":"IFERROR(Февраль[[#This Row],[Показание одометра машины на конец дня, км]]-Февраль[[#This Row],[Показание одометра машины на начало дня, км]]+S8,\"\")","v":12},null,{"$f":"IF(Февраль[[#This Row],[Дата]]=\"\",\"\",M7)","v":500},{"$f":"IF(Февраль[[#This Row],[Дата]]=\"\",\"\",I7)","v":671},672,{"$f":"IFERROR(IF(U8=\"\",Февраль[[#This Row],[Показание счетчика моточасов  спецоборудования на конец дня, м/ч]],Февраль[[#This Row],[Показание счетчика моточасов  спецоборудования на конец дня, м/ч]]+1)-Февраль[[#This Row],[Показание счетчика моточасов спецоборудования на начало дня, м/ч]],\"\")","v":1},1,{"$f":"IF(Февраль[[#This Row],[Работа спецоборудования за день, м/ч]]=\"\",\"\",Февраль[[#This Row],[Работа спецоборудования за день, м/ч]]*$Z$2)","v":6.0500000000000007},{"$f":"IFERROR(IF(VLOOKUP(Февраль[Дата],S$2:U$3,3),IFERROR(IF(R8=\"\",Февраль[[#This Row],[Выдано топливо, литр]],Февраль[[#This Row],[Выдано топливо, литр]]+R8)+Февраль[[#This Row],[Остаток топлива в баке на начало дня, литр]]-Февраль[[#This Row],[Фактический расход топлива, литр]],\"\"),\"\"),\"\")","v":486},{"$f":"IFERROR(ROUND((Февраль[[#This Row],[Пройдено за день, км]]*0.01*$Y$2+Февраль[[#This Row],[Расход топлива на работу спецоборудования, литр]]),3)+V8,\"\")","v":12.236000000000001},{"$f":"IFERROR(IF(Февраль[[#Totals],[Выдано топливо, литр]]=0,0,(ROUND(Февраль[[#This Row],[Расход топлива по норме, литр]]/IF(DAY(Февраль[Дата])<=18,$W$2,$W$3),0)))+T8,\"\")","v":14},{"$f":"IFERROR(Февраль[[#This Row],[Фактический расход топлива, литр]]-Февраль[[#This Row],[Расход топлива по норме, литр]],\"\")","v":1.7639999999999993},null,null,null,null,null,null,{"$f":"Февраль[[#This Row],[Дата]]","v":"2018-02-02"}]
{"$rows_left_out":33}
{"sheet":"Март","index":2,"n_rows":40,"n_cols":26,"rows_kept":40,"cut":false,"hidden":false,"merged":[[1,0,1,15],[2,0,2,15],[3,14,3,15]]}
[null,null,null,null,null,null,null,null,null,null,null,null,null,null,null,"Март",null,null,null,null,null,null,null,"Экономия","Базовая норма расхода на 100 км","Базовая норма расхода на 1 мото/час"]
["Общество с ограниченной ответственностью  \"Втормет Царицыно\"",null,null,null,null,null,null,null,null,null,null,null,null,null,null,null,null,"1-я половина",{"$f":"INDIRECT(TEXT(A7-1,\"ММММ\")&\"!t3\")+1","v":"2018-03-04"},"2018-03-15",{"$f":"ТС!E5","v":500},{"$f":"SUMIFS(Март[Выдано топливо, литр],Март[Дата],\">=\"&$S$2,Март[Дата],\"<=\"&$T$2)+IF(MONTH(T2)<>MONTH(S2),INDIRECT(TEXT(A7-1,\"ММММ\")&\"!F38\")-SUM(INDIRECT(TEXT(A7-1,\"ММММ\")&\"!V1:V2\")))","v":620},{"$f":"IF(V2=0,0,(SUMIFS(N7:N37,A7:A37,\">=\"&S2,A7:A37,\"<=\"&T2)+SUMIFS(INDIRECT(TEXT(A7-1,\"ММММ\")&\"!N7:N37\"),INDIRECT(TEXT(A7-1,\"ММММ\")&\"!A7:A37\"),\">=\"&S2))/(V2-U2+IF(MONTH(T2)=MONTH(S2),G7,INDEX(INDIRECT(TEXT(A7-1,\"ММММ\")&\"!G7:G37\"),DAY(S2)))))","v":1.0292209677419355},{"$f":"SUMIFS(Март[Отклонение от нормы (Перерасход(+), экономия(-)), литр],Март[Дата],\">=\"&$S$2,Март[Дата],\"<=\"&$T$2)","v":-16.11699999999999},{"$f":"IF(Y4=\"Зима\",VLOOKUP(Z4,Расчет[[Номер гос.регистрации / Заводской номер]:[Итога норма а/м \"ЛЕТО\"]],8,FALSE),VLOOKUP(Z4,Расчет[[Номер гос.регистрации / Заводской номер]:[Итога норма а/м \"ЛЕТО\"]],9,FALSE))","v":51.546000000000006},{"$f":"IF(Y4=\"Зима\",VLOOKUP(Z4,Расчет[[Номер гос.регистрации / Заводской номер]:[Итога норма а/м \"ЛЕТО\"]],13,FALSE),VLOOKUP(Z4,Расчет[[Номер гос.регистрации / Заводской номер]:[Итога норма а/м \"ЛЕТО\"]],14,FALSE))","v":6.0500000000000007}]
["Отчет водителя ломовоза с манипулятором",null,null,null,null,null,null,null,null,null,null,null,null,null,null,null,null,"2-я половина",{"$f":"T2+1","v":"2018-03-16"},{"$f":"INDEX(Март[Дата],COUNT(Март[Дата]))","v":"2018-03-31"},{"$f":"ТС!E6","v":500},{"$f":"SUMIFS(Март[Выдано топливо, литр],Март[Дата],\">=\"&$S$3,Март[Дата],\"<=\"&$T$3)+IF(MONTH(T3)<>MONTH(S3),INDIRECT(TEXT(A8-1,\"ММММ\")&\"!F38\")-SUM(INDIRECT(TEXT(A8-1,\"ММММ\")&\"!V1:V2\")))","v":300},{"$f":"IF(V3=0,0,(SUMIFS(N7:N37,A7:A37,\">=\"&S3,A7:A37,\"<=\"&T3)+SUMIFS(INDIRECT(TEXT(A7-1,\"ММММ\")&\"!N7:N37\"),INDIRECT(TEXT(A7-1,\"ММММ\")&\"!A7:A37\"),\">=\"&S3))/(V3-U3+IF(MONTH(T3)=MONTH(S3),G7,INDEX(INDIRECT(TEXT(A7-1,\"ММММ\")&\"!G7:G37\"),DAY(S3)))))","v":-377.87642666666665},{"$f":"SUMIFS(Март[Отклонение от нормы (Перерасход(+), экономия(-)), литр],Март[Дата],\">=\"&$S$3,Март[Дата],\"<=\"&$T$3)","v":113663.928}]
[null,null,null,null,null,null,null,"за",2018,null,null,null,null,null,"т056вв 197",null,null,null,{"$f":"T3+1","v":"2018-04-01"},null,null,null,{"$f":"IFERROR(INDIRECT(TEXT(A7+40,\"ММММ\")&\"!W2\"),)","v":0},null,"Зима","Норма 1"]
[]
["Дата","ФИО водителя","Показание одометра машины на начало дня, км","Показание одометра машины на конец дня, км","Пройдено за день, км","Выдано топливо, литр","Остаток топлива в баке на начало дня, литр","Показание счетчика моточасов спецоборудования на начало дня, м/ч","Показание счетчика моточасов  спецоборудования на конец дня, м/ч","Работа спецоборудования за день, м/ч","Количество ходок","Расход топлива на работу спецоборудования, литр","Остаток топлива в баке на конец дня, литр","Расход топлива по норме, литр","Фактический расход топлива, литр","Отклонение от нормы (Перерасход(+), экономия(-)), литр",null,"Выдано топливо, литр","Пройдено за день, км","Фактический расход топлива, литр","Работа спецоборудования за день, м/ч","Расход топлива по норме, литр","Дата"]
[{"$f":"IFERROR(DATEVALUE((COUNT($A$6:A6)+1)&$P$1&$I$4),\"\")","v":"2018-03-01"},null,{"$f":"INDEX(Январь!D7:D37,COUNT(Январь!D7:D37))","v":210723},210723,{"$f":"IFERROR(Март[[#This Row],[Показание одометра машины на конец дня, км]]-Март[[#This Row],[Показание одометра машины на начало дня, км]]+S7,\"\")","v":0},null,{"$f":"U2","v":500},{"$f":"INDEX(Январь!I7:I37,COUNT(Январь!I7:I37))","v":671},671,{"$f":"IFERROR(IF(U7=\"\",Март[[#This Row],[Показание счетчика моточасов  спецоборудования на конец дня, м/ч]],Март[[#This Row],[Показание счетчика моточасов  спецоборудования на конец дня, м/ч]]+1)-Март[[#This Row],[Показание счетчика моточасов спецоборудования на начало дня, м/ч]],\"\")","v":0},0,{"$f":"IF(Март[[#This Row],[Работа спецоборудования за день, м/ч]]=\"\",\"\",Март[[#This Row],[Работа спецоборудования за день, м/ч]]*$Z$2)","v":0},{"$f":"IFERROR(IF(VLOOKUP(Март[Дата],S$2:U$3,3),IFERROR(IF(R7=\"\",Март[[#This Row],[Выдано топливо, литр]],Март[[#This Row],[Выдано топливо, литр]]+R7)+Март[[#This Row],[Остаток топлива в баке на начало дня, литр]]-Март[[#This Row],[Фактический расход топлива, литр]],\"\"),\"\"),\"\")","v":""},{"$f":"IFERROR(ROUND((Март[[#This Row],[Пройдено за день, км]]*0.01*$Y$2+Март[[#This Row],[Расход топлива на работу спецоборудования, литр]]),3)+V7,\"\")","v":0},{"$f":"IFERROR(IF(Март[[#Totals],[Выдано топливо, литр]]=0,0,(ROUND(Март[[#This Row],[Расход топлива по норме, литр]]/IF(DAY(Март[Дата])<=18,$W$2,$W$3),0)))+T7,\"\")","v":0},{"$f":"IFERROR(Март[[#This Row],[Фактический расход топлива, литр]]-Март[[#This Row],[Расход топлива по норме, литр]],\"\")","v":0},null,null,null,null,null,null,{"$f":"Март[[#This Row],[Дата]]","v":"2018-03-01"}]
[{"$f":"IFERROR(DATEVALUE((COUNT($A$6:A7)+1)&$P$1&$I$4),\"\")","v":"2018-03-02"},"Никляев В.А.",{"$f":"IF(Март[[#This Row],[Дата]]=\"\",\"\",D7)","v":210723},210735,{"$f":"IFERROR(Март[[#This Row],[Показание одометра машины на конец дня, км]]-Март[[#This Row],[Показание одометра машины на начало дня, км]]+S8,\"\")","v":12},150,{"$f":"IF(Март[[#This Row],[Дата]]=\"\",\"\",M7)","v":""},{"$f":"IF(Март[[#This Row],[Дата]]=\"\",\"\",I7)","v":671},672,{"$f":"IFERROR(IF(U8=\"\",Март[[#This Row],[Показание счетчика моточасов  спецоборудования на конец дня, м/ч]],Март[[#This Row],[Показание счетчика моточасов  спецоборудования на конец дня, м/ч]]+1)-Март[[#This Row],[Показание счетчика моточасов спецоборудования на начало дня, м/ч]],\"\")","v":1},1,{"$f":"IF(Март[[#This Row],[Работа спецоборудования за день, м/ч]]=\"\",\"\",Март[[#This Row],[Работа спецоборудования за день, м/ч]]*$Z$2)","v":6.0500000000000007},{"$f":"IFERROR(IF(VLOOKUP(Март[Дата],S$2:U$3,3),IFERROR(IF(R8=\"\",Март[[#This Row],[Выдано топливо, литр]],Март[[#This Row],[Выдано топливо, литр]]+R8)+Март[[#This Row],[Остаток топлива в баке на начало дня, литр]]-Март[[#This Row],[Фактический расход топлива, литр]],\"\"),\"\"),\"\")","v":""},{"$f":"IFERROR(ROUND((Март[[#This Row],[Пройдено за день, км]]*0.01*$Y$2+Март[[#This Row],[Расход топлива на работу спецоборудования, литр]]),3)+V8,\"\")","v":12.236000000000001},{"$f":"IFERROR(IF(Март[[#Totals],[Выдано топливо, литр]]=0,0,(ROUND(Март[[#This Row],[Расход топлива по норме, литр]]/IF(DAY(Март[Дата])<=18,$W$2,$W$3),0)))+T8,\"\")","v":12},{"$f":"IFERROR(Март[[#This Row],[Фактический расход топлива, литр]]-Март[[#This Row],[Расход топлива по норме, литр]],\"\")","v":-0.23600000000000065},null,null,null,null,null,null,{"$f":"Март[[#This Row],[Дата]]","v":"2018-03-02"}]
{"$rows_left_out":33}
{"sheet":"ТС","index":3,"n_rows":29,"n_cols":25,"rows_kept":29,"cut":false,"hidden":false,"merged":[[0,15,2,24],[2,6,2,7],[2,11,2,12]]}
[null,null,null,null,null,null,"Зима :","01.11 - 31.03",null,null,null,"Зима :","01.11 - 31.03",null,null,"Расчет максимальной нормы расхода ДТ (литр/100км)"]
[null,null,null,null,null,null,"Лето:","01.04 - 30.10",null,null,null,"Лето:","01.04 - 30.10"]
[null,null,null,null,null,null,"доп.коэфф-т к норме",null,null,null,null,"доп.коэфф-т к норме"]
["№ п/п","Номер гос.регистрации / Заводской номер","Километраж, км","Спецоборудование, м/ч","Топливо, л","Базовая норма расхода на 100 км","Зима","Лето","Итога норма а/м ЗИМА","Итога норма а/м ЛЕТО","Базовая норма расхода на 1 мото/час","\"Зима\"","\"Лето\"","Итога норма а/м \"ЗИМА\"","Итога норма а/м \"ЛЕТО\"","Норма на 100 км, литров","движение с манипулятором","Тоннаж","Литры","На движение с грузом","Тоннаж1","К-т загрузки","ИТОГ","25% за работу в городе с населением свыше 3 млн. человек","10 % за работу зимой"]
[1,"Норма 1",209024,620,500,46.86,10,-9.1,{"$f":"F5*(100+G5)%","v":51.546000000000006},{"$f":"F5*(100+H5)%","v":42.595739999999999},5.5,10,0,{"$f":"K5*(100+L5)%","v":6.0500000000000007},{"$f":"K5*(100+M5)%","v":5.5},32.200000000000003,{"$f":"R5*S5","v":2.9379999999999997},2.2599999999999998,1.3,{"$f":"U5*V5*S5","v":5.2},8,0.5,{"$f":"P5+Q5+T5","v":40.338000000000008},{"$f":"W5*25%+W5","v":50.422500000000014},{"$f":"W5*10%+X5","v":54.456300000000013}]
[2,"Норма 2",null,null,500,{"$f":"F5-F5*5%","v":44.516999999999996},10,-9.1,48.968699999999998,40.465952999999999,{"$f":"K5-K5*5%","v":5.2249999999999996},10,0,5.7475000000000005,5.2249999999999996,32.200000000000003,2.9379999999999997,2.2599999999999998,1.3,5.2,8,0.5,40.338000000000008,50.422500000000014,54.456300000000013]
[3,"Норма 3",null,null,500,{"$f":"F5-F5*10%","v":42.173999999999999},10,-9.1,46.391400000000004,38.336165999999999,{"$f":"K5-K5*10%","v":4.95},10,0,5.4450000000000003,4.95,32.200000000000003,2.9379999999999997,2.2599999999999998,1.3,5.2,8,0.5,40.338000000000008,50.422500000000014,54.456300000000013]
[]
{"$rows_left_out":22}
{"sheet":"Отчет журнал","index":4,"n_rows":8,"n_cols":17,"rows_kept":8,"cut":false,"hidden":false,"merged":[[0,0,0,16],[1,0,1,16]]}
["Общество с ограниченной ответственностью  \"Втормет Царицыно\""]
["Отчет водителя ломовоза с манипулятором"]
[null,null,null,null,null,null,null,null,"за",2018]
[]
["Дата","ФИО водителя","Номер гос.регистрации","Показание одометра машины на начало дня, км","Показание одометра машины на конец дня, км","Пройдено за день, км","Выдано топливо, литр","Остаток топлива в баке на начало дня, литр","Показание счетчика моточасов спецоборудования на начало дня, м/ч","Показание счетчика моточасов  спецоборудования на конец дня, м/ч","Работа спецоборудования за день, м/ч","Количество ходок","Расход топлива на работу спецоборудования, литр","Остаток топлива в баке на конец дня, литр","Расход топлива по норме, литр","Фактический расход топлива, литр","Отклонение от нормы (Перерасход(+), экономия(-)), литр"]
["2018-01-01","Никляев В.А.","т056вв 197",209024,209024,{"$f":"E6-D6","v":0},0,500,620,620,{"$f":"J6-I6","v":0},null,{"$f":"K6*#REF!","v":{"$error":"#REF!"}},{"$f":"G6+H6-P6","v":500},{"$f":"ROUND((F6*0.01*#REF!+M6),3)","v":{"$error":"#REF!"}},{"$f":"IF($I$10=0,0,(ROUND(O6/$T$6,0)))","v":0},{"$f":"P6-O6","v":{"$error":"#REF!"}}]
["2018-01-01","Супрун С.В.","к190вк 799",156340,157300,960,150,{"$f":"N6","v":500},{"$f":"J6","v":620},540,{"$f":"J7-I7","v":-80},null,{"$f":"K7*#REF!","v":{"$error":"#REF!"}},{"$f":"G7+H7-P7","v":650},{"$f":"ROUND((F7*0.01*#REF!+M7),3)","v":{"$error":"#REF!"}},{"$f":"IF($I$10=0,0,(ROUND(O7/$T$6,0)))","v":0},{"$error":"#REF!"}]
["2018-01-01","Щинов М.","х733ун 197",164230,164590,360,50,650,{"$f":"J7","v":540},620,80,null,{"$f":"K8*#REF!","v":{"$error":"#REF!"}},700,{"$f":"ROUND((F8*0.01*#REF!+M8),3)","v":{"$error":"#REF!"}},{"$f":"IF($I$10=0,0,(ROUND(O8/$T$6,0)))","v":0},{"$error":"#REF!"}]
{"$rows_left_out":1}
{"sheet":"Сотрудники","index":5,"n_rows":23,"n_cols":2,"rows_kept":23,"cut":false,"hidden":false,"merged":[[0,0,1,1]]}
["Водители ломовоза с манипулятором"]
[]
["№ п/п","Ф.И.О."]
[1,"Никляев В.А."]
[2,"Ильин А.Г."]
[3,"Малышев О.С."]
[4,"Кобалян М.В."]
[5]
{"$rows_left_out":15}