{"text_format":"1","workbook":"xlsx","n_sheets":6,"sheets":["Январь","Февраль","Март","Апрель","ТС","Сотрудники"],"not_rendered":{"charts":0,"images":0,"macros":1,"external_links":1,"defined_names":4,"comments":0,"pivot_tables":0},"unopened":[],"bounds":{"document_bytes":16777216,"sheet_cells":100000,"rows_first":2000,"rows_last":500,"rows_between":2000,"halvings":0,"cell_chars":16384,"cell_head_chars":4096},"cells_cut":0,"cells_raw":0,"read":"whole","date_system":"1900"}

{"sheet":"Январь","index":0,"n_rows":40,"n_cols":26,"rows_kept":40,"cut":false,"hidden":false,"merged":[[1,0,1,15],[2,0,2,15],[3,14,3,15]]}
[null,null,null,null,null,null,null,null,null,null,null,null,null,null,null,"Январь",null,null,null,null,null,null,null,"Экономия","Базовая норма расхода на 100 км","Базовая норма расхода на 1 мото/час"]
["Общество с ограниченной ответственностью  \"Втормет Царицыно\"",null,null,null,null,null,null,null,null,null,null,null,null,null,null,null,null,"1-я пол.","2018-01-01","2018-01-18",350,0,0,0,46.860000000000007,5.5]
["Отчет водителя ломовоза с манипулятором",null,null,null,null,null,null,null,null,null,null,null,null,null,null,null,null,"2-я пол.","2018-01-19","2018-01-31",350,920,0,0]
[null,null,null,null,null,null,null,"за",2018,null,null,null,null,null,"с 504 уо 777",null,null,null,"",null,null,null,"",null,"Зима","Норма 1"]
[]
["Дата","ФИО водителя","Показание одометра машины на начало дня, км","Показание одометра машины на конец дня, км","Пройдено за день, км","Выдано топливо, литр","Остаток топлива в баке на начало дня, литр","Показание счетчика моточасов спецоборудования на начало дня, м/ч","Показание счетчика моточасов  спецоборудования на конец дня, м/ч","Работа спецоборудования за день, м/ч","Количество ходок","Расход топлива на работу спецоборудования, литр","Остаток топлива в баке на конец дня, литр","Расход топлива по норме, литр","Фактический расход топлива, литр","Отклонение от нормы (Перерасход(+), экономия(-)), литр",null,"Дата","Обнуление одометра, км","Пройдено за день, км","Выдано топливо, литр","Обнуление счетчика моточасов спецоборудования, м/ч","Работа спецоборудования за день, м/ч","Расход топлива по норме, литр","Фактический расход топлива, литр","Дата"]
["2018-01-01",null,23190,23190,0,0,350,1306,1306,0,null,0,350,0,0,0,null,"2018-01-01",null,null,null,null,null,null,null,"2018-01-01"]
["2018-01-02",null,23190,23190,0,0,350,1306,1306,0,null,0,350,0,0,0,null,"2018-01-02",null,null,null,null,null,null,null,"2018-01-02"]
["2018-01-03",null,23190,23190,0,0,350,1306,1306,0,null,0,350,0,0,0,null,"2018-01-03",null,null,null,null,null,null,null,"2018-01-03"]
["2018-01-04",null,23190,23190,0,0,350,1306,1306,0,null,0,350,0,0,0,null,"2018-01-04",null,null,null,null,null,null,null,"2018-01-04"]
{"$rows_left_out":31}
{"sheet":"Февраль","index":1,"n_rows":40,"n_cols":26,"rows_kept":40,"cut":false,"hidden":false,"merged":[[1,0,1,15],[2,0,2,15],[3,14,3,15]]}
[null,null,null,null,null,null,null,null,null,null,null,null,null,null,null,"Февраль",null,null,null,null,null,null,null,"Экономия","Базовая норма расхода на 100 км","Базовая норма расхода на 1 мото/час"]
["Общество с ограниченной ответственностью  \"Втормет Царицыно\"",null,null,null,null,null,null,null,null,null,null,null,null,null,null,null,null,"1-я пол.","2018-02-01","2018-02-15",350,0,0,0,46.860000000000007,5.5]
["Отчет водителя ломовоза с манипулятором",null,null,null,null,null,null,null,null,null,null,null,null,null,null,null,null,"2-я пол.","2018-02-16","2018-02-28",350,810,0,0]
[null,null,null,null,null,null,null,"за",2018,null,null,null,null,null,"с 504 уо 777",null,null,null,"",null,null,null,"",null,"Зима","Норма 1"]
[]
["Дата","ФИО водителя","Показание одометра машины на начало дня, км","Показание одометра машины на конец дня, км","Пройдено за день, км","Выдано топливо, литр","Остаток топлива в баке на начало дня, литр","Показание счетчика моточасов спецоборудования на начало дня, м/ч","Показание счетчика моточасов  спецоборудования на конец дня, м/ч","Работа спецоборудования за день, м/ч","Количество ходок","Расход топлива на работу спецоборудования, литр","Остаток топлива в баке на конец дня, литр","Расход топлива по норме, литр","Фактический расход топлива, литр","Отклонение от нормы (Перерасход(+), экономия(-)), литр",null,"Дата","Обнуление одометра, км","Пройдено за день, км","Выдано топливо, литр","Обнуление счетчика моточасов спецоборудования, м/ч","Работа спецоборудования за день, м/ч","Расход топлива по норме, литр","Фактический расход топлива, литр","Дата"]
["2018-02-01",null,23190,23190,0,0,350,1306,1306,0,null,0,350,0,0,0,null,"2018-02-01",null,null,null,null,null,null,null,"2018-02-01"]
["2018-02-02",null,23190,23190,0,0,350,1306,1306,0,null,0,350,0,0,0,null,"2018-02-02",null,null,null,null,null,null,null,"2018-02-02"]
["2018-02-03",null,23190,23190,0,0,350,1306,1306,0,null,0,350,0,0,0,null,"2018-02-03",null,null,null,null,null,null,null,"2018-02-03"]
["2018-02-04",null,23190,23190,0,0,350,1306,1306,0,null,0,350,0,0,0,null,"2018-02-04",null,null,null,null,null,null,null,"2018-02-04"]
{"$rows_left_out":31}
{"sheet":"Март","index":2,"n_rows":40,"n_cols":26,"rows_kept":40,"cut":false,"hidden":false,"merged":[[1,0,1,15],[2,0,2,15],[3,14,3,15]]}
[null,null,null,null,null,null,null,null,null,null,null,null,null,null,null,"Март",null,null,null,null,null,null,null,"Экономия","Базовая норма расхода на 100 км","Базовая норма расхода на 1 мото/час"]
["Общество с ограниченной ответственностью  \"Втормет Царицыно\"",null,null,null,null,null,null,null,null,null,null,null,null,null,null,null,null,"1-я пол.","2018-03-01","2018-03-15",350,0,0,0,46.860000000000007,5.5]
["Отчет водителя ломовоза с манипулятором",null,null,null,null,null,null,null,null,null,null,null,null,null,null,null,null,"2-я пол.","2018-03-16","2018-03-31",350,917,0.40144601962922571,198.87399999999997]
[null,null,null,null,null,null,null,"за",2018,null,null,null,null,null,"с 504 уо 777",null,null,null,"",null,null,null,"",null,"Зима","Норма 1"]
[]
["Дата","ФИО водителя","Показание одометра машины на начало дня, км","Показание одометра машины на конец дня, км","Пройдено за день, км","Выдано топливо, литр","Остаток топлива в баке на начало дня, литр","Показание счетчика моточасов спецоборудования на начало дня, м/ч","Показание счетчика моточасов  спецоборудования на конец дня, м/ч","Работа спецоборудования за день, м/ч","Количество ходок","Расход топлива на работу спецоборудования, литр","Остаток топлива в баке на конец дня, литр","Расход топлива по норме, литр","Фактический расход топлива, литр","Отклонение от нормы (Перерасход(+), экономия(-)), литр",null,"Дата","Обнуление одометра, км","Пройдено за день, км","Выдано топливо, литр","Обнуление счетчика моточасов спецоборудования, м/ч","Работа спецоборудования за день, м/ч","Расход топлива по норме, литр","Фактический расход топлива, литр","Дата"]
["2018-03-01",null,23190,23190,0,0,350,1306,1306,0,null,0,350,0,0,0,null,"2018-03-01",null,null,null,null,null,null,null,"2018-03-01"]
["2018-03-02",null,23190,23190,0,0,350,1306,1306,0,null,0,350,0,0,0,null,"2018-03-02",null,null,null,null,null,null,null,"2018-03-02"]
["2018-03-03",null,23190,23190,0,0,350,1306,1306,0,null,0,350,0,0,0,null,"2018-03-03",null,null,null,null,null,null,null,"2018-03-03"]
["2018-03-04",null,23190,23190,0,0,350,1306,1306,0,null,0,350,0,0,0,null,"2018-03-04",null,null,null,null,null,null,null,"2018-03-04"]
{"$rows_left_out":31}
{"sheet":"Апрель","index":3,"n_rows":40,"n_cols":26,"rows_kept":40,"cut":false,"hidden":false,"merged":[[1,0,1,15],[2,0,2,15],[3,14,3,15]]}
[null,null,null,null,null,null,null,null,null,null,null,null,null,null,null,"Апрель",null,null,null,null,null,null,null,"Экономия","Базовая норма расхода на 100 км","Базовая норма расхода на 1 мото/час"]
["Общество с ограниченной ответственностью  \"Втормет Царицыно\"",null,null,null,null,null,null,null,null,null,null,null,null,null,null,null,null,"1-я пол.",{"$f":"INDIRECT(TEXT(A7-1,\"ММММ\")&\"!T3\")+1","v":"2018-04-01"},"2018-04-14",{"$f":"ТС!E5","v":350},{"$f":"SUMIFS(Апрель[Выдано топливо, литр],Апрель[Дата],\">=\"&$S$2,Апрель[Дата],\"<=\"&$T$2)+IF(MONTH(T2)<>MONTH(S2),INDIRECT(TEXT(A7-1,\"ММММ\")&\"!F38\")-SUM(INDIRECT(TEXT(A7-1,\"ММММ\")&\"!V1:V2\")))+SUMIFS($U$7:$U$37,Апрель[Дата],\">=\"&$S$2,Апрель[Дата],\"<=\"&$T$2)+IF(MONTH(T2)<>MONTH(S2),INDIRECT(TEXT(A7-1,\"ММММ\")&\"!F38\")-SUM(INDIRECT(TEXT(A7-1,\"ММММ\")&\"!V1:V2\")))","v":0},{"$f":"IF(V2=0,0,(SUMIFS(N7:N37,A7:A37,\">=\"&S2,A7:A37,\"<=\"&T2)+SUMIFS(INDIRECT(TEXT(A7-1,\"ММММ\")&\"!N7:N37\"),INDIRECT(TEXT(A7-1,\"ММММ\")&\"!A7:A37\"),\">=\"&S2))/(V2-U2+IF(MONTH(T2)=MONTH(S2),G7,INDEX(INDIRECT(TEXT(A7-1,\"ММММ\")&\"!G7:G37\"),DAY(S2)))))","v":0},{"$f":"SUMIFS(Апрель[Отклонение от нормы (Перерасход(+), экономия(-)), литр],Апрель[Дата],\">=\"&$S$2,Апрель[Дата],\"<=\"&$T$2)","v":0},{"$f":"IF(Y4=\"Зима\",VLOOKUP(Z4,Расчет[[Номер гос.регистрации / Заводской номер]:[Итога норма а/м \"ЛЕТО\"]],8,FALSE),VLOOKUP(Z4,Расчет[[Номер гос.регистрации / Заводской номер]:[Итога норма а/м \"ЛЕТО\"]],9,FALSE))","v":42.6},{"$f":"IF(Y4=\"Зима\",VLOOKUP(Z4,Расчет[[Номер гос.регистрации / Заводской номер]:[Итога норма а/м \"ЛЕТО\"]],13,FALSE),VLOOKUP(Z4,Расчет[[Номер гос.регистрации / Заводской номер]:[Итога норма а/м \"ЛЕТО\"]],14,FALSE))","v":5}]
["Отчет водителя ломовоза с манипулятором",null,null,null,null,null,null,null,null,null,null,null,null,null,null,null,null,"2-я пол.",{"$f":"T2+1","v":"2018-04-15"},{"$f":"INDEX(Апрель[Дата],COUNT(Апрель[Дата]))-T1","v":"2018-04-30"},{"$f":"ТС!E6","v":350},{"$f":"SUMIFS(Апрель[Выдано топливо, литр],Апрель[Дата],\">=\"&$S$3,Апрель[Дата],\"<=\"&$T$3)+IF(MONTH(T3)<>MONTH(S3),INDIRECT(TEXT(A7-1,\"ММММ\")&\"!F38\")-SUM(INDIRECT(TEXT(A7-1,\"ММММ\")&\"!V1:V2\")))+SUMIFS($U$7:$U$37,Апрель[Дата],\">=\"&$S$3,Апрель[Дата],\"<=\"&$T$3)+IF(MONTH(T3)<>MONTH(S3),INDIRECT(TEXT(A7-1,\"ММММ\")&\"!F38\")-SUM(INDIRECT(TEXT(A7-1,\"ММММ\")&\"!V1:V2\")))","v":1240},{"$f":"IF(V3=0,0,(SUMIFS(N7:N37,A7:A37,\">=\"&S3,A7:A37,\"<=\"&T3)+SUMIFS(INDIRECT(TEXT(A7-1,\"ММММ\")&\"!N7:N37\"),INDIRECT(TEXT(A7-1,\"ММММ\")&\"!A7:A37\"),\">=\"&S3))/(V3-U3+IF(MONTH(T3)=MONTH(S3),G7,INDEX(INDIRECT(TEXT(A7-1,\"ММММ\")&\"!G7:G37\"),DAY(S3)))))","v":0.99995161290322587},{"$f":"SUMIFS(Апрель[Отклонение от нормы (Перерасход(+), экономия(-)), литр],Апрель[Дата],\">=\"&$S$3,Апрель[Дата],\"<=\"&$T$3)","v":1240}]
[null,null,null,null,null,null,null,"за",2018,null,null,null,null,null,{"$f":"Январь!O4","v":"с 504 уо 777"},null,null,null,{"$f":"IF(INDEX(Апрель[Дата],COUNT(Апрель[Дата]))=T3,\"\",T3+1)","v":""},null,null,null,{"$f":"IFERROR(IF(S4=\"\",\"\",INDIRECT(TEXT(A7+40,\"ММММ\")&\"!W2\")),)","v":""},null,"Лето","Норма 1"]
[]
["Дата","ФИО водителя","Показание одометра машины на начало дня, км","Показание одометра машины на конец дня, км","Пройдено за день, км","Выдано топливо, литр","Остаток топлива в баке на начало дня, литр","Показание счетчика моточасов спецоборудования на начало дня, м/ч","Показание счетчика моточасов  спецоборудования на конец дня, м/ч","Работа спецоборудования за день, м/ч","Количество ходок","Расход топлива на работу спецоборудования, литр","Остаток топлива в баке на конец дня, литр","Расход топлива по норме, литр","Фактический расход топлива, литр","Отклонение от нормы (Перерасход(+), экономия(-)), литр",null,"Дата","Обнуление одометра, км","Пройдено за день, км","Выдано топливо, литр","Обнуление счетчика моточасов спецоборудования, м/ч","Работа спецоборудования за день, м/ч","Расход топлива по норме, литр","Фактический расход топлива, литр","Дата"]
[{"$f":"IFERROR(DATEVALUE((COUNT($A$6:A6)+1)&$P$1&$I$4),\"\")","v":"2018-04-01"},null,{"$f":"INDEX(Март!D7:D37,COUNT(Март!D7:D37))","v":23600},23600,{"$f":"IFERROR(Апрель[[#This Row],[Показание одометра машины на конец дня, км]]-Апрель[[#This Row],[Показание одометра машины на начало дня, км]]+T7,\"\")","v":0},{"$f":"IF(Апрель[[#This Row],[Дата]]=\"\",\"\",SUMPRODUCT([1]Апрель!$E$4:$E$153*([1]Апрель!$G$4:$G$153=$O$4)*([1]Апрель!$D$4:$D$153=Апрель[[#This Row],[Дата]])))","v":0},{"$f":"U2","v":350},{"$f":"INDEX(Март!I7:I37,COUNT(Март!I7:I37))","v":1338},1338,{"$f":"IFERROR(IF(W7=\"\",Апрель[[#This Row],[Показание счетчика моточасов  спецоборудования на конец дня, м/ч]],Апрель[[#This Row],[Показание счетчика моточасов  спецоборудования на конец дня, м/ч]]+1)-Апрель[[#This Row],[Показание счетчика моточасов спецоборудования на начало дня, м/ч]],\"\")","v":0},null,{"$f":"IF(Апрель[[#This Row],[Работа спецоборудования за день, м/ч]]=\"\",\"\",Апрель[[#This Row],[Работа спецоборудования за день, м/ч]]*$Z$2)","v":0},{"$f":"IFERROR(IF(VLOOKUP([Дата],S$2:U$3,3),IFERROR(IF(U7=\"\",Апрель[[#This Row],[Выдано топливо, литр]],Апрель[[#This Row],[Выдано топливо, литр]]+U7)+Апрель[[#This Row],[Остаток топлива в баке на начало дня, литр]]-Апрель[[#This Row],[Фактический расход топлива, литр]],\"\"),\"\"),\"\")","v":350},{"$f":"IFERROR(ROUND((Апрель[[#This Row],[Пройдено за день, км]]*0.01*$Y$2+Апрель[[#This Row],[Расход топлива на работу спецоборудования, литр]]),3)+X7,\"\")","v":0},{"$f":"IFERROR(IF(Апрель[[#Totals],[Выдано топливо, литр]]=0,0,(ROUND(Апрель[[#This Row],[Расход топлива по норме, литр]]/IF(DAY([Дата])<=18,$W$2,$W$3),0)))+Y7,)","v":0},{"$f":"IFERROR(IF(Апрель[[#Totals],[Выдано топливо, литр]]=0,0,(ROUND(Апрель[[#This Row],[Расход топлива по норме, литр]]/VLOOKUP([Дата],S$2:W$3,5),0)))+Y7,)","v":0},null,{"$f":"Апрель[[#This Row],[Дата]]","v":"2018-04-01"},null,null,null,null,null,null,null,{"$f":"Апрель[[#This Row],[Дата]]","v":"2018-04-01"}]
[{"$f":"IFERROR(DATEVALUE((COUNT($A$6:A7)+1)&$P$1&$I$4),\"\")","v":"2018-04-02"},null,{"$f":"IFERROR(IF(INDIRECT(TEXT(A7-1,\"ММММ\")&\"!A7:A37\")=\"\",\"\",IF(S7=\"\",D7,S7)),\"\")","v":23600},23600,{"$f":"IFERROR(Апрель[[#This Row],[Показание одометра машины на конец дня, км]]-Апрель[[#This Row],[Показание одометра машины на начало дня, км]]+T8,\"\")","v":0},{"$f":"IF(Апрель[[#This Row],[Дата]]=\"\",\"\",SUMPRODUCT([1]Апрель!$E$4:$E$153*([1]Апрель!$G$4:$G$153=$O$4)*([1]Апрель!$D$4:$D$153=Апрель[[#This Row],[Дата]])))","v":0},{"$f":"IF(Апрель[[#This Row],[Дата]]=\"\",\"\",M7)","v":350},{"$f":"IFERROR(IF(INDIRECT(TEXT(A7-1,\"ММММ\")&\"!A7:A37\")=\"\",\"\",IF(V7=\"\",I7,V7)),\"\")","v":1338},1338,{"$f":"IFERROR(IF(W8=\"\",Апрель[[#This Row],[Показание счетчика моточасов  спецоборудования на конец дня, м/ч]],Апрель[[#This Row],[Показание счетчика моточасов  спецоборудования на конец дня, м/ч]]+1)-Апрель[[#This Row],[Показание счетчика моточасов спецоборудования на начало дня, м/ч]],\"\")","v":0},null,{"$f":"IF(Апрель[[#This Row],[Работа спецоборудования за день, м/ч]]=\"\",\"\",Апрель[[#This Row],[Работа спецоборудования за день, м/ч]]*$Z$2)","v":0},{"$f":"IFERROR(IF(VLOOKUP([Дата],S$2:U$3,3),IFERROR(IF(U8=\"\",Апрель[[#This Row],[Выдано топливо, литр]],Апрель[[#This Row],[Выдано топливо, литр]]+U8)+Апрель[[#This Row],[Остаток топлива в баке на начало дня, литр]]-Апрель[[#This Row],[Фактический расход топлива, литр]],\"\"),\"\"),\"\")","v":350},{"$f":"IFERROR(ROUND((Апрель[[#This Row],[Пройдено за день, км]]*0.01*$Y$2+Апрель[[#This Row],[Расход топлива на работу спецоборудования, литр]]),3)+X8,\"\")","v":0},{"$f":"IFERROR(IF(Апрель[[#Totals],[Выдано топливо, литр]]=0,0,(ROUND(Апрель[[#This Row],[Расход топлива по норме, литр]]/IF(DAY([Дата])<=18,$W$2,$W$3),0)))+Y8,)","v":0},{"$f":"IFERROR(IF(Апрель[[#Totals],[Выдано топливо, литр]]=0,0,(ROUND(Апрель[[#This Row],[Расход топлива по норме, литр]]/VLOOKUP([Дата],S$2:W$3,5),0)))+Y8,)","v":0},null,{"$f":"Апрель[[#This Row],[Дата]]","v":"2018-04-02"},null,null,null,null,null,null,null,{"$f":"Апрель[[#This Row],[Дата]]","v":"2018-04-02"}]
[{"$f":"IFERROR(DATEVALUE((COUNT($A$6:A8)+1)&$P$1&$I$4),\"\")","v":"2018-04-03"},null,{"$f":"IFERROR(IF(INDIRECT(TEXT(A8-1,\"ММММ\")&\"!A7:A37\")=\"\",\"\",IF(S8=\"\",D8,S8)),\"\")","v":23600},23600,{"$f":"IFERROR(Апрель[[#This Row],[Показание одометра машины на конец дня, км]]-Апрель[[#This Row],[Показание одометра машины на начало дня, км]]+T9,\"\")","v":0},{"$f":"IF(Апрель[[#This Row],[Дата]]=\"\",\"\",SUMPRODUCT([1]Апрель!$E$4:$E$153*([1]Апрель!$G$4:$G$153=$O$4)*([1]Апрель!$D$4:$D$153=Апрель[[#This Row],[Дата]])))","v":0},{"$f":"IF(Апрель[[#This Row],[Дата]]=\"\",\"\",M8)","v":350},{"$f":"IFERROR(IF(INDIRECT(TEXT(A8-1,\"ММММ\")&\"!A7:A37\")=\"\",\"\",IF(V8=\"\",I8,V8)),\"\")","v":1338},1338,{"$f":"IFERROR(IF(W9=\"\",Апрель[[#This Row],[Показание счетчика моточасов  спецоборудования на конец дня, м/ч]],Апрель[[#This Row],[Показание счетчика моточасов  спецоборудования на конец дня, м/ч]]+1)-Апрель[[#This Row],[Показание счетчика моточасов спецоборудования на начало дня, м/ч]],\"\")","v":0},null,{"$f":"IF(Апрель[[#This Row],[Работа спецоборудования за день, м/ч]]=\"\",\"\",Апрель[[#This Row],[Работа спецоборудования за день, м/ч]]*$Z$2)","v":0},{"$f":"IFERROR(IF(VLOOKUP([Дата],S$2:U$3,3),IFERROR(IF(U9=\"\",Апрель[[#This Row],[Выдано топливо, литр]],Апрель[[#This Row],[Выдано топливо, литр]]+U9)+Апрель[[#This Row],[Остаток топлива в баке на начало дня, литр]]-Апрель[[#This Row],[Фактический расход топлива, литр]],\"\"),\"\"),\"\")","v":350},{"$f":"IFERROR(ROUND((Апрель[[#This Row],[Пройдено за день, км]]*0.01*$Y$2+Апрель[[#This Row],[Расход топлива на работу спецоборудования, литр]]),3)+X9,\"\")","v":0},{"$f":"IFERROR(IF(Апрель[[#Totals],[Выдано топливо, литр]]=0,0,(ROUND(Апрель[[#This Row],[Расход топлива по норме, литр]]/IF(DAY([Дата])<=18,$W$2,$W$3),0)))+Y9,)","v":0},{"$f":"IFERROR(IF(Апрель[[#Totals],[Выдано топливо, литр]]=0,0,(ROUND(Апрель[[#This Row],[Расход топлива по норме, литр]]/VLOOKUP([Дата],S$2:W$3,5),0)))+Y9,)","v":0},null,{"$f":"Апрель[[#This Row],[Дата]]","v":"2018-04-03"},null,null,null,null,null,null,null,{"$f":"Апрель[[#This Row],[Дата]]","v":"2018-04-03"}]
[{"$f":"IFERROR(DATEVALUE((COUNT($A$6:A9)+1)&$P$1&$I$4),\"\")","v":"2018-04-04"},null,23600,23600,{"$f":"IFERROR(Апрель[[#This Row],[Показание одометра машины на конец дня, км]]-Апрель[[#This Row],[Показание одометра машины на начало дня, км]]+T10,\"\")","v":0},{"$f":"IF(Апрель[[#This Row],[Дата]]=\"\",\"\",SUMPRODUCT([1]Апрель!$E$4:$E$153*([1]Апрель!$G$4:$G$153=$O$4)*([1]Апрель!$D$4:$D$153=Апрель[[#This Row],[Дата]])))","v":0},{"$f":"IF(Апрель[[#This Row],[Дата]]=\"\",\"\",M9)","v":350},1338,1338,{"$f":"IFERROR(IF(W10=\"\",Апрель[[#This Row],[Показание счетчика моточасов  спецоборудования на конец дня, м/ч]],Апрель[[#This Row],[Показание счетчика моточасов  спецоборудования на конец дня, м/ч]]+1)-Апрель[[#This Row],[Показание счетчика моточасов спецоборудования на начало дня, м/ч]],\"\")","v":0},null,{"$f":"IF(Апрель[[#This Row],[Работа спецоборудования за день, м/ч]]=\"\",\"\",Апрель[[#This Row],[Работа спецоборудования за день, м/ч]]*$Z$2)","v":0},{"$f":"IFERROR(IF(VLOOKUP([Дата],S$2:U$3,3),IFERROR(IF(U10=\"\",Апрель[[#This Row],[Выдано топливо, литр]],Апрель[[#This Row],[Выдано топливо, литр]]+U10)+Апрель[[#This Row],[Остаток топлива в баке на начало дня, литр]]-Апрель[[#This Row],[Фактический расход топлива, литр]],\"\"),\"\"),\"\")","v":350},{"$f":"IFERROR(ROUND((Апрель[[#This Row],[Пройдено за день, км]]*0.01*$Y$2+Апрель[[#This Row],[Расход топлива на работу спецоборудования, литр]]),3)+X10,\"\")","v":0},{"$f":"IFERROR(IF(Апрель[[#Totals],[Выдано топливо, литр]]=0,0,(ROUND(Апрель[[#This Row],[Расход топлива по норме, литр]]/IF(DAY([Дата])<=18,$W$2,$W$3),0)))+Y10,)","v":0},{"$f":"IFERROR(IF(Апрель[[#Totals],[Выдано топливо, литр]]=0,0,(ROUND(Апрель[[#This Row],[Расход топлива по норме, литр]]/VLOOKUP([Дата],S$2:W$3,5),0)))+Y10,)","v":0},null,{"$f":"Апрель[[#This Row],[Дата]]","v":"2018-04-04"},null,null,null,null,null,null,null,{"$f":"Апрель[[#This Row],[Дата]]","v":"2018-04-04"}]
{"$rows_left_out":31}
{"sheet":"ТС","index":4,"n_rows":33,"n_cols":25,"rows_kept":33,"cut":false,"hidden":false,"merged":[[0,15,2,24],[2,6,2,7],[2,11,2,12]]}
[null,null,null,null,null,null,"Зима :","01.11 - 31.03",null,null,null,"Зима :","01.11 - 31.03",null,null,"Расчет максимальной нормы расхода ДТ (литр/100км)"]
[null,null,null,null,null,null,"Лето:","01.04 - 30.10",null,null,null,"Лето:","01.04 - 30.10"]
[null,null,null,null,null,null,"доп.коэфф-т к норме",null,null,null,null,"доп.коэфф-т к норме"]
["№ п/п","Номер гос.регистрации / Заводской номер","Километраж, км","Спецоборудование, м/ч","Топливо, л","Базовая норма расхода на 100 км","Зима","Лето","Итога норма а/м ЗИМА","Итога норма а/м ЛЕТО","Базовая норма расхода на 1 мото/час","\"Зима\"","\"Лето\"","Итога норма а/м \"ЗИМА\"","Итога норма а/м \"ЛЕТО\"","Норма на 100 км, литров","движение с манипулятором","Тоннаж","Литры","На движение с грузом","Тоннаж1","К-т загрузки","ИТОГ","25% за работу в городе с населением свыше 3 млн. человек","10 % за работу зимой"]
[1,"Норма 1",23190,1306,350,42.6,10,0,{"$f":"F5*(100+G5)%","v":46.860000000000007},{"$f":"F5*(100+H5)%","v":42.6},5,10,0,{"$f":"K5*(100+L5)%","v":5.5},{"$f":"K5*(100+M5)%","v":5},32.200000000000003,{"$f":"R5*S5","v":2.9379999999999997},2.2599999999999998,1.3,{"$f":"U5*V5*S5","v":5.2},8,0.5,{"$f":"P5+Q5+T5","v":40.338000000000008},{"$f":"W5*25%+W5","v":50.422500000000014},{"$f":"W5*10%+X5","v":54.456300000000013}]
[2,"Норма 2",null,null,350,{"$f":"F5-F5*5%","v":40.47},10,0,{"$f":"F6*(100+G6)%","v":44.517000000000003},{"$f":"F6*(100+H6)%","v":40.47},{"$f":"K5-K5*5%","v":4.75},10,0,{"$f":"K6*(100+L6)%","v":5.2250000000000005},{"$f":"K6*(100+M6)%","v":4.75},32.200000000000003,{"$f":"R6*S6","v":2.9379999999999997},2.2599999999999998,1.3,{"$f":"U6*V6*S6","v":5.2},8,0.5,{"$f":"P6+Q6+T6","v":40.338000000000008},{"$f":"W6*25%+W6","v":50.422500000000014},{"$f":"W6*10%+X6","v":54.456300000000013}]
[3,"Норма 3",null,null,350,{"$f":"F5-F5*10%","v":38.340000000000003},10,0,{"$f":"F7*(100+G7)%","v":42.174000000000007},38.340000000000003,{"$f":"K5-K5*10%","v":4.5},10,0,{"$f":"K7*(100+L7)%","v":4.95},{"$f":"K7*(100+M7)%","v":4.5},32.200000000000003,{"$f":"R7*S7","v":2.9379999999999997},2.2599999999999998,1.3,{"$f":"U7*V7*S7","v":5.2},8,0.5,{"$f":"P7+Q7+T7","v":40.338000000000008},{"$f":"W7*25%+W7","v":50.422500000000014},{"$f":"W7*10%+X7","v":54.456300000000013}]
[4,"Переход 1",null,null,350,46.86,10,0,{"$f":"F8*(100+G8)%","v":51.546000000000006},{"$f":"F8*(100+H8)%","v":46.86},5.5,10,0,{"$f":"K8*(100+L8)%","v":6.0500000000000007},{"$f":"K8*(100+M8)%","v":5.5},null,{"$f":"R8*S8","v":0},null,null,{"$f":"U8*V8*S8","v":0},null,null,{"$f":"P8+Q8+T8","v":0},{"$f":"W8*25%+W8","v":0},{"$f":"W8*10%+X8","v":0}]
[5,"Переход 2",null,null,350,{"$f":"F8-F8*5%","v":44.516999999999996},10,0,{"$f":"F9*(100+G9)%","v":48.968699999999998},{"$f":"F9*(100+H9)%","v":44.516999999999996},{"$f":"K8-K8*5%","v":5.2249999999999996},10,0,{"$f":"K9*(100+L9)%","v":5.7475000000000005},{"$f":"K9*(100+M9)%","v":5.2249999999999996},null,{"$f":"R9*S9","v":0},null,null,{"$f":"U9*V9*S9","v":0},null,null,{"$f":"P9+Q9+T9","v":0},{"$f":"W9*25%+W9","v":0},{"$f":"W9*10%+X9","v":0}]
[6,"Переход 3",null,null,350,{"$f":"F8-F8*10%","v":42.173999999999999},10,0,{"$f":"F10*(100+G10)%","v":46.391400000000004},42.173999999999999,{"$f":"K8-K8*10%","v":4.95},10,0,{"$f":"K10*(100+L10)%","v":5.4450000000000003},{"$f":"K10*(100+M10)%","v":4.95},null,{"$f":"R10*S10","v":0},null,null,{"$f":"U10*V10*S10","v":0},null,null,{"$f":"P10+Q10+T10","v":0},{"$f":"W10*25%+W10","v":0},{"$f":"W10*10%+X10","v":0}]
{"$rows_left_out":24}
{"sheet":"Сотрудники","index":5,"n_rows":11,"n_cols":2,"rows_kept":11,"cut":false,"hidden":false,"merged":[]}
[null,"Ф.И.О."]
[null,"Зяблов А.А"]
[null,"Ильин А.Г."]
[null,"Ильин Е.Н."]
[null,"Ильичев Ю.Ф."]
[null,"Кобалян М.В."]
[null,"Лагутенко А.А."]
[null,"Малышев О.С."]
[null,"Никляев В.А."]
[null,"Сергеев Д.О."]
{"$rows_left_out":1}