{"text_format":"1","workbook":"xlsx","n_sheets":3,"sheets":["Июль","ТС","Сотрудники"],"not_rendered":{"charts":0,"images":0,"macros":1,"external_links":0,"defined_names":4,"comments":0,"pivot_tables":0},"unopened":[],"bounds":{"document_bytes":16777216,"sheet_cells":100000,"rows_first":2000,"rows_last":500,"rows_between":2000,"halvings":0,"cell_chars":16384,"cell_head_chars":4096},"cells_cut":0,"cells_raw":0,"read":"whole","date_system":"1900"}

{"sheet":"Июль","index":0,"n_rows":40,"n_cols":29,"rows_kept":40,"cut":false,"hidden":false,"merged":[[1,0,1,15],[2,0,2,15],[3,14,3,15]]}
[null,null,null,null,null,null,null,null,null,null,null,null,null,null,null,"Июль",null,null,null,-3,null,null,null,"Экономия","Базовая норма расхода на 100 км","Базовая норма расхода на 1 мото/час",null,{"$f":"(MID(CELL(\"filename\",A1),SEARCH(\"]\",CELL(\"filename\",A1))+1,31))","v":"Июль"}]
["Общество с ограниченной ответственностью  \"Втормет Царицыно\"",null,null,null,null,null,null,null,null,null,null,null,null,null,null,null,null,"1-я пол.",{"$f":"INDIRECT(TEXT(A7-1,\"ММММ\")&\"!T3\")+1","v":{"$error":"#REF!"}},"2018-07-15",{"$f":"ТС!E5","v":500},{"$f":"SUMIFS(Июль[Выдано топливо, литр],Июль[Дата],\">=\"&$S$2,#REF!,\"<=\"&$T$2)+IF(MONTH(T2)<>MONTH(S2),INDIRECT(TEXT(A7-1,\"ММММ\")&\"!F38\")-SUM(INDIRECT(TEXT(A7-1,\"ММММ\")&\"!V3:V2\")))+SUMIFS($U$7:$U$37,Июль[Дата],\">=\"&$S$2,Июль[Дата],\"<=\"&$T$2)+IF(MONTH(T2)<>MONTH(S2),INDIRECT(TEXT(A7-1,\"ММММ\")&\"!F38\")-SUM(INDIRECT(TEXT(A7-1,\"ММММ\")&\"!V3:V2\")))","v":{"$error":"#REF!"}},{"$f":"IF(V2=0,0,(SUMIFS(N7:N37,A7:A37,\">=\"&S2,A7:A37,\"<=\"&T2)+SUMIFS(INDIRECT(TEXT(A7-1,\"ММММ\")&\"!N7:N37\"),INDIRECT(TEXT(A7-1,\"ММММ\")&\"!A7:A37\"),\">=\"&S2))/(V2-U2+IF(MONTH(T2)=MONTH(S2),G7,INDEX(INDIRECT(TEXT(A7-1,\"ММММ\")&\"!G7:G37\"),DAY(S2)))))","v":{"$error":"#REF!"}},{"$f":"SUMIFS(Июль[Отклонение от нормы (Перерасход(+), экономия(-)), литр],Июль[Дата],\">=\"&$S$2,Июль[Дата],\"<=\"&$T$2)","v":0},{"$f":"IF(Y4=\"Зима\",VLOOKUP(Z4,Расчет[[Номер гос.регистрации / Заводской номер]:[Итога норма а/м \"ЛЕТО\"]],8,FALSE),VLOOKUP(Z4,Расчет[[Номер гос.регистрации / Заводской номер]:[Итога норма а/м \"ЛЕТО\"]],9,FALSE))","v":46.86},{"$f":"IF(Y4=\"Зима\",VLOOKUP(Z4,Расчет[[Номер гос.регистрации / Заводской номер]:[Итога норма а/м \"ЛЕТО\"]],13,FALSE),VLOOKUP(Z4,Расчет[[Номер гос.регистрации / Заводской номер]:[Итога норма а/м \"ЛЕТО\"]],14,FALSE))","v":5.5},null,{"$f":"INDIRECT(P1&\"!G7\")","v":500}]
["Отчет водителя ломовоза с манипулятором",null,null,null,null,null,null,null,null,null,null,null,null,null,null,null,null,"2-я пол.",{"$f":"T2+1","v":"2018-07-16"},{"$f":"INDEX(Июль[Дата],COUNT(Июль[Дата]))-T1","v":"2018-08-03"},{"$f":"ТС!E6","v":500},{"$f":"SUMIFS(Июль[Выдано топливо, литр],Июль[Дата],\">=\"&$S$3,#REF!,\"<=\"&$T$3)+IF(MONTH(T3)<>MONTH(S3),SUMIFS(INDIRECT(TEXT(T3,\"ММММ\")&\"[Выдано топливо, литр]\"),INDIRECT(TEXT(T3,\"ММММ\")&\"[Дата]\"),\">=\"&$S$3,INDIRECT(TEXT(T3,\"ММММ\")&\"[Дата]\"),\"<=\"&$T$3))+SUMIFS($U$7:$U$37,Июль[Дата],\">=\"&$S$3,Июль[Дата],\"<=\"&$T$3)+IF(MONTH(T3)<>MONTH(S3),SUMIFS(INDIRECT(TEXT(T3,\"ММММ\")&\"[Выдано топливо, литр]\"),INDIRECT(TEXT(T3,\"ММММ\")&\"[Дата]\"),\">=\"&$S$3,INDIRECT(TEXT(T3,\"ММММ\")&\"[Дата]\"),\"<=\"&$T$3))","v":{"$error":"#REF!"}},{"$f":"IF(V3=0,0,(SUMIFS(N7:N37,A7:A37,\">=\"&S3,A7:A37,\"<=\"&T3)+SUMIFS(INDIRECT(TEXT(A7-1,\"ММММ\")&\"!N7:N37\"),INDIRECT(TEXT(A7-1,\"ММММ\")&\"!A7:A37\"),\">=\"&S3))/(V3-U3+IF(MONTH(T3)=MONTH(S3),G7,INDEX(INDIRECT(TEXT(A7-1,\"ММММ\")&\"!G7:G37\"),DAY(S3)))))","v":{"$error":"#REF!"}},{"$f":"SUMIFS(Июль[Отклонение от нормы (Перерасход(+), экономия(-)), литр],Июль[Дата],\">=\"&$S$3,Июль[Дата],\"<=\"&$T$3)","v":0},null,null,null,{"$f":"INDIRECT(P1&\"!G7\")","v":500}]
[null,null,null,null,null,null,null,"за",2018,null,null,null,null,null,{"$f":"#REF!","v":{"$error":"#REF!"}},null,null,null,{"$f":"IF(INDEX(Июль[Дата],COUNT(Июль[Дата]))=T3,\"\",T3+1)","v":"2018-08-04"},null,null,null,{"$f":"IFERROR(IF(S4=\"\",\"\",INDIRECT(TEXT(A7+40,\"ММММ\")&\"!W2\")),)","v":0},null,"Лето","Норма 1"]
[]
["Дата","ФИО водителя","Показание одометра машины на начало дня, км","Показание одометра машины на конец дня, км","Пройдено за день, км","Выдано топливо, литр","Остаток топлива в баке на начало дня, литр","Показание счетчика моточасов спецоборудования на начало дня, м/ч","Показание счетчика моточасов  спецоборудования на конец дня, м/ч","Работа спецоборудования за день, м/ч","Количество ходок","Расход топлива на работу спецоборудования, литр","Остаток топлива в баке на конец дня, литр","Расход топлива по норме, литр","Фактический расход топлива, литр","Отклонение от нормы (Перерасход(+), экономия(-)), литр",null,"Дата","Обнуление одометра, км","Пройдено за день, км","Выдано топливо, литр","Обнуление счетчика моточасов спецоборудования, м/ч","Работа спецоборудования за день, м/ч","Расход топлива по норме, литр","Фактический расход топлива, литр","Дата"]
["2018-07-01","Кобалян М.В.",220024,220036,12,0,500,945,946,1,1,{"$f":"IF(Июль[[#This Row],[Работа спецоборудования за день, м/ч]]=\"\",\"\",Июль[[#This Row],[Работа спецоборудования за день, м/ч]]*$Z$2)","v":5.5},{"$f":"IF($T$2=[Дата],VLOOKUP([Дата],S$2:U$3,3),IF($T$3=[Дата],VLOOKUP([Дата],S$2:U$3,3),INDIRECT($P$1&\"!F8\")+INDIRECT($P$1&\"!U8\")+INDIRECT($P$1&\"!G8\")-INDIRECT($P$1&\"!O88\")))","v":450},{"$f":"IFERROR(ROUND((Июль[[#This Row],[Пройдено за день, км]]*0.01*$Y$2+Июль[[#This Row],[Расход топлива на работу спецоборудования, литр]]),3)+X7,\"\")","v":11.122999999999999},{"$f":"IF(Июль[[#This Row],[Дата]]=\"\",\"\",IFERROR(ROUND(Июль[[#This Row],[Расход топлива по норме, литр]]/VLOOKUP([Дата],S$2:W$4,5),0)+Y7,))","v":0},{"$f":"IFERROR(Июль[[#This Row],[Фактический расход топлива, литр]]-Июль[[#This Row],[Расход топлива по норме, литр]],\"\")","v":-11.122999999999999},null,{"$f":"Июль[[#This Row],[Дата]]","v":"2018-07-01"},null,null,-50,null,null,null,null,{"$f":"Июль[[#This Row],[Дата]]","v":"2018-07-01"}]
["2018-07-02","Кобалян М.В.",220036,220071,35,0,450,946,947,1,1,{"$f":"IF(Июль[[#This Row],[Работа спецоборудования за день, м/ч]]=\"\",\"\",Июль[[#This Row],[Работа спецоборудования за день, м/ч]]*$Z$2)","v":5.5},{"$f":"IF($T$2=[Дата],VLOOKUP([Дата],S$2:U$3,3),IF($T$3=[Дата],VLOOKUP([Дата],S$2:U$3,3),INDIRECT($P$1&\"!F8\")+INDIRECT($P$1&\"!U8\")+INDIRECT($P$1&\"!G8\")-INDIRECT($P$1&\"!O88\")))","v":450},{"$f":"IFERROR(ROUND((Июль[[#This Row],[Пройдено за день, км]]*0.01*$Y$2+Июль[[#This Row],[Расход топлива на работу спецоборудования, литр]]),3)+X8,\"\")","v":21.901},{"$f":"IF(Июль[[#This Row],[Дата]]=\"\",\"\",IFERROR(ROUND(Июль[[#This Row],[Расход топлива по норме, литр]]/VLOOKUP([Дата],S$2:W$4,5),0)+Y8,))","v":0},{"$f":"IFERROR(Июль[[#This Row],[Фактический расход топлива, литр]]-Июль[[#This Row],[Расход топлива по норме, литр]],\"\")","v":-21.901},null,{"$f":"Июль[[#This Row],[Дата]]","v":"2018-07-02"},null,null,null,null,null,null,null,{"$f":"Июль[[#This Row],[Дата]]","v":"2018-07-02"},null,{"$f":"IF(U8=\"\",Июль[[#This Row],[Остаток топлива в баке на начало дня, литр]],Июль[[#This Row],[Выдано топливо, литр]]+U8+Июль[[#This Row],[Остаток топлива в баке на начало дня, литр]]-Июль[[#This Row],[Фактический расход топлива, литр]])","v":450},{"$f":"SUMIFS(Июль[Выдано топливо, литр],Июль[Дата],\">=\"&$S$2,Июль[Дата],\"<=\"&$T$2)+IF(MONTH(T2)<>MONTH(S2),INDIRECT(TEXT(A7-1,\"ММММ\")&\"!F38\")-SUM(INDIRECT(TEXT(A7-1,\"ММММ\")&\"!V3:V2\")))","v":{"$error":"#REF!"}}]
["2018-07-03","Малышев О.С.",220071,220293,222,0,450,947,950,3,2,{"$f":"IF(Июль[[#This Row],[Работа спецоборудования за день, м/ч]]=\"\",\"\",Июль[[#This Row],[Работа спецоборудования за день, м/ч]]*$Z$2)","v":16.5},{"$f":"IF($T$2=[Дата],VLOOKUP([Дата],S$2:U$3,3),IF($T$3=[Дата],VLOOKUP([Дата],S$2:U$3,3),INDIRECT($P$1&\"!F8\")+INDIRECT($P$1&\"!U8\")+INDIRECT($P$1&\"!G8\")-INDIRECT($P$1&\"!O88\")))","v":450},{"$f":"IFERROR(ROUND((Июль[[#This Row],[Пройдено за день, км]]*0.01*$Y$2+Июль[[#This Row],[Расход топлива на работу спецоборудования, литр]]),3)+X9,\"\")","v":120.529},{"$f":"IF(Июль[[#This Row],[Дата]]=\"\",\"\",IFERROR(ROUND(Июль[[#This Row],[Расход топлива по норме, литр]]/VLOOKUP([Дата],S$2:W$4,5),0)+Y9,))","v":0},{"$f":"IFERROR(Июль[[#This Row],[Фактический расход топлива, литр]]-Июль[[#This Row],[Расход топлива по норме, литр]],\"\")","v":-120.529},null,{"$f":"Июль[[#This Row],[Дата]]","v":"2018-07-03"},null,null,150,null,null,null,null,{"$f":"Июль[[#This Row],[Дата]]","v":"2018-07-03"}]
["2018-07-04","Малышев О.С.",220293,220423,130,0,450,950,953,3,3,{"$f":"IF(Июль[[#This Row],[Работа спецоборудования за день, м/ч]]=\"\",\"\",Июль[[#This Row],[Работа спецоборудования за день, м/ч]]*$Z$2)","v":16.5},{"$f":"IF($T$2=[Дата],VLOOKUP([Дата],S$2:U$3,3),IF($T$3=[Дата],VLOOKUP([Дата],S$2:U$3,3),INDIRECT($P$1&\"!F8\")+INDIRECT($P$1&\"!U8\")+INDIRECT($P$1&\"!G8\")-INDIRECT($P$1&\"!O88\")))","v":450},{"$f":"IFERROR(ROUND((Июль[[#This Row],[Пройдено за день, км]]*0.01*$Y$2+Июль[[#This Row],[Расход топлива на работу спецоборудования, литр]]),3)+X10,\"\")","v":77.418000000000006},{"$f":"IF(Июль[[#This Row],[Дата]]=\"\",\"\",IFERROR(ROUND(Июль[[#This Row],[Расход топлива по норме, литр]]/VLOOKUP([Дата],S$2:W$4,5),0)+Y10,))","v":0},{"$f":"IFERROR(Июль[[#This Row],[Фактический расход топлива, литр]]-Июль[[#This Row],[Расход топлива по норме, литр]],\"\")","v":-77.418000000000006},null,{"$f":"Июль[[#This Row],[Дата]]","v":"2018-07-04"},null,null,350,null,null,null,null,{"$f":"Июль[[#This Row],[Дата]]","v":"2018-07-04"}]
["2018-07-05","Малышев О.С.",220423,220525,102,0,450,953,957,4,3,{"$f":"IF(Июль[[#This Row],[Работа спецоборудования за день, м/ч]]=\"\",\"\",Июль[[#This Row],[Работа спецоборудования за день, м/ч]]*$Z$2)","v":22},{"$f":"IF($T$2=[Дата],VLOOKUP([Дата],S$2:U$3,3),IF($T$3=[Дата],VLOOKUP([Дата],S$2:U$3,3),INDIRECT($P$1&\"!F8\")+INDIRECT($P$1&\"!U8\")+INDIRECT($P$1&\"!G8\")-INDIRECT($P$1&\"!O88\")))","v":450},{"$f":"IFERROR(ROUND((Июль[[#This Row],[Пройдено за день, км]]*0.01*$Y$2+Июль[[#This Row],[Расход топлива на работу спецоборудования, литр]]),3)+X11,\"\")","v":69.796999999999997},{"$f":"IF(Июль[[#This Row],[Дата]]=\"\",\"\",IFERROR(ROUND(Июль[[#This Row],[Расход топлива по норме, литр]]/VLOOKUP([Дата],S$2:W$4,5),0)+Y11,))","v":0},{"$f":"IFERROR(Июль[[#This Row],[Фактический расход топлива, литр]]-Июль[[#This Row],[Расход топлива по норме, литр]],\"\")","v":-69.796999999999997},null,{"$f":"Июль[[#This Row],[Дата]]","v":"2018-07-05"},null,null,null,null,null,null,null,{"$f":"Июль[[#This Row],[Дата]]","v":"2018-07-05"}]
["2018-07-06","Малышев О.С.",220525,220646,121,0,450,957,960,3,2,{"$f":"IF(Июль[[#This Row],[Работа спецоборудования за день, м/ч]]=\"\",\"\",Июль[[#This Row],[Работа спецоборудования за день, м/ч]]*$Z$2)","v":16.5},{"$f":"IF($T$2=[Дата],VLOOKUP([Дата],S$2:U$3,3),IF($T$3=[Дата],VLOOKUP([Дата],S$2:U$3,3),INDIRECT($P$1&\"!F8\")+INDIRECT($P$1&\"!U8\")+INDIRECT($P$1&\"!G8\")-INDIRECT($P$1&\"!O88\")))","v":450},{"$f":"IFERROR(ROUND((Июль[[#This Row],[Пройдено за день, км]]*0.01*$Y$2+Июль[[#This Row],[Расход топлива на работу спецоборудования, литр]]),3)+X12,\"\")","v":73.200999999999993},{"$f":"IF(Июль[[#This Row],[Дата]]=\"\",\"\",IFERROR(ROUND(Июль[[#This Row],[Расход топлива по норме, литр]]/VLOOKUP([Дата],S$2:W$4,5),0)+Y12,))","v":0},{"$f":"IFERROR(Июль[[#This Row],[Фактический расход топлива, литр]]-Июль[[#This Row],[Расход топлива по норме, литр]],\"\")","v":-73.200999999999993},null,{"$f":"Июль[[#This Row],[Дата]]","v":"2018-07-06"},null,null,null,null,null,null,null,{"$f":"Июль[[#This Row],[Дата]]","v":"2018-07-06"}]
["2018-07-07","Малышев О.С.",220646,220730,84,0,450,960,963,3,2,{"$f":"IF(Июль[[#This Row],[Работа спецоборудования за день, м/ч]]=\"\",\"\",Июль[[#This Row],[Работа спецоборудования за день, м/ч]]*$Z$2)","v":16.5},{"$f":"IF($T$2=[Дата],VLOOKUP([Дата],S$2:U$3,3),IF($T$3=[Дата],VLOOKUP([Дата],S$2:U$3,3),INDIRECT($P$1&\"!F8\")+INDIRECT($P$1&\"!U8\")+INDIRECT($P$1&\"!G8\")-INDIRECT($P$1&\"!O88\")))","v":450},{"$f":"IFERROR(ROUND((Июль[[#This Row],[Пройдено за день, км]]*0.01*$Y$2+Июль[[#This Row],[Расход топлива на работу спецоборудования, литр]]),3)+X13,\"\")","v":55.862000000000002},{"$f":"IF(Июль[[#This Row],[Дата]]=\"\",\"\",IFERROR(ROUND(Июль[[#This Row],[Расход топлива по норме, литр]]/VLOOKUP([Дата],S$2:W$4,5),0)+Y13,))","v":0},{"$f":"IFERROR(Июль[[#This Row],[Фактический расход топлива, литр]]-Июль[[#This Row],[Расход топлива по норме, литр]],\"\")","v":-55.862000000000002},null,{"$f":"Июль[[#This Row],[Дата]]","v":"2018-07-07"},null,null,null,null,null,null,null,{"$f":"Июль[[#This Row],[Дата]]","v":"2018-07-07"}]
["2018-07-08","Малышев О.С.",220730,220879,149,0,450,963,965,2,1,{"$f":"IF(Июль[[#This Row],[Работа спецоборудования за день, м/ч]]=\"\",\"\",Июль[[#This Row],[Работа спецоборудования за день, м/ч]]*$Z$2)","v":11},{"$f":"IF($T$2=[Дата],VLOOKUP([Дата],S$2:U$3,3),IF($T$3=[Дата],VLOOKUP([Дата],S$2:U$3,3),INDIRECT($P$1&\"!F8\")+INDIRECT($P$1&\"!U8\")+INDIRECT($P$1&\"!G8\")-INDIRECT($P$1&\"!O88\")))","v":450},{"$f":"IFERROR(ROUND((Июль[[#This Row],[Пройдено за день, км]]*0.01*$Y$2+Июль[[#This Row],[Расход топлива на работу спецоборудования, литр]]),3)+X14,\"\")","v":80.820999999999998},{"$f":"IF(Июль[[#This Row],[Дата]]=\"\",\"\",IFERROR(ROUND(Июль[[#This Row],[Расход топлива по норме, литр]]/VLOOKUP([Дата],S$2:W$4,5),0)+Y14,))","v":0},{"$f":"IFERROR(Июль[[#This Row],[Фактический расход топлива, литр]]-Июль[[#This Row],[Расход топлива по норме, литр]],\"\")","v":-80.820999999999998},null,{"$f":"Июль[[#This Row],[Дата]]","v":"2018-07-08"},null,null,null,null,null,null,null,{"$f":"Июль[[#This Row],[Дата]]","v":"2018-07-08"}]
["2018-07-09","Малышев О.С.",220879,221022,143,0,450,965,970,5,3,{"$f":"IF(Июль[[#This Row],[Работа спецоборудования за день, м/ч]]=\"\",\"\",Июль[[#This Row],[Работа спецоборудования за день, м/ч]]*$Z$2)","v":27.5},{"$f":"IF($T$2=[Дата],VLOOKUP([Дата],S$2:U$3,3),IF($T$3=[Дата],VLOOKUP([Дата],S$2:U$3,3),INDIRECT($P$1&\"!F8\")+INDIRECT($P$1&\"!U8\")+INDIRECT($P$1&\"!G8\")-INDIRECT($P$1&\"!O88\")))","v":450},{"$f":"IFERROR(ROUND((Июль[[#This Row],[Пройдено за день, км]]*0.01*$Y$2+Июль[[#This Row],[Расход топлива на работу спецоборудования, литр]]),3)+X15,\"\")","v":94.51},{"$f":"IF(Июль[[#This Row],[Дата]]=\"\",\"\",IFERROR(ROUND(Июль[[#This Row],[Расход топлива по норме, литр]]/VLOOKUP([Дата],S$2:W$4,5),0)+Y15,))","v":0},{"$f":"IFERROR(Июль[[#This Row],[Фактический расход топлива, литр]]-Июль[[#This Row],[Расход топлива по норме, литр]],\"\")","v":-94.51},null,{"$f":"Июль[[#This Row],[Дата]]","v":"2018-07-09"},null,null,null,null,null,null,null,{"$f":"Июль[[#This Row],[Дата]]","v":"2018-07-09"}]
["2018-07-10","Малышев О.С.",221022,221195,173,0,450,970,972,2,3,{"$f":"IF(Июль[[#This Row],[Работа спецоборудования за день, м/ч]]=\"\",\"\",Июль[[#This Row],[Работа спецоборудования за день, м/ч]]*$Z$2)","v":11},{"$f":"IF($T$2=[Дата],VLOOKUP([Дата],S$2:U$3,3),IF($T$3=[Дата],VLOOKUP([Дата],S$2:U$3,3),INDIRECT($P$1&\"!F8\")+INDIRECT($P$1&\"!U8\")+INDIRECT($P$1&\"!G8\")-INDIRECT($P$1&\"!O88\")))","v":450},{"$f":"IFERROR(ROUND((Июль[[#This Row],[Пройдено за день, км]]*0.01*$Y$2+Июль[[#This Row],[Расход топлива на работу спецоборудования, литр]]),3)+X16,\"\")","v":92.067999999999998},{"$f":"IF(Июль[[#This Row],[Дата]]=\"\",\"\",IFERROR(ROUND(Июль[[#This Row],[Расход топлива по норме, литр]]/VLOOKUP([Дата],S$2:W$4,5),0)+Y16,))","v":0},{"$f":"IFERROR(Июль[[#This Row],[Фактический расход топлива, литр]]-Июль[[#This Row],[Расход топлива по норме, литр]],\"\")","v":-92.067999999999998},null,{"$f":"Июль[[#This Row],[Дата]]","v":"2018-07-10"},null,null,null,null,null,null,null,{"$f":"Июль[[#This Row],[Дата]]","v":"2018-07-10"}]
["2018-07-11","Малышев О.С.",221195,221339,144,0,450,972,975,3,4,{"$f":"IF(Июль[[#This Row],[Работа спецоборудования за день, м/ч]]=\"\",\"\",Июль[[#This Row],[Работа спецоборудования за день, м/ч]]*$Z$2)","v":16.5},{"$f":"IF($T$2=[Дата],VLOOKUP([Дата],S$2:U$3,3),IF($T$3=[Дата],VLOOKUP([Дата],S$2:U$3,3),INDIRECT($P$1&\"!F8\")+INDIRECT($P$1&\"!U8\")+INDIRECT($P$1&\"!G8\")-INDIRECT($P$1&\"!O88\")))","v":450},{"$f":"IFERROR(ROUND((Июль[[#This Row],[Пройдено за день, км]]*0.01*$Y$2+Июль[[#This Row],[Расход топлива на работу спецоборудования, литр]]),3)+X17,\"\")","v":83.977999999999994},{"$f":"IF(Июль[[#This Row],[Дата]]=\"\",\"\",IFERROR(ROUND(Июль[[#This Row],[Расход топлива по норме, литр]]/VLOOKUP([Дата],S$2:W$4,5),0)+Y17,))","v":0},{"$f":"IFERROR(Июль[[#This Row],[Фактический расход топлива, литр]]-Июль[[#This Row],[Расход топлива по норме, литр]],\"\")","v":-83.977999999999994},null,{"$f":"Июль[[#This Row],[Дата]]","v":"2018-07-11"},null,null,145,null,null,null,null,{"$f":"Июль[[#This Row],[Дата]]","v":"2018-07-11"}]
["2018-07-12",null,221339,null,-221339,0,595,975,null,-975,null,{"$f":"IF(Июль[[#This Row],[Работа спецоборудования за день, м/ч]]=\"\",\"\",Июль[[#This Row],[Работа спецоборудования за день, м/ч]]*$Z$2)","v":-5362.5},{"$f":"IF($T$2=[Дата],VLOOKUP([Дата],S$2:U$3,3),IF($T$3=[Дата],VLOOKUP([Дата],S$2:U$3,3),INDIRECT($P$1&\"!F8\")+INDIRECT($P$1&\"!U8\")+INDIRECT($P$1&\"!G8\")-INDIRECT($P$1&\"!O88\")))","v":450},{"$f":"IFERROR(ROUND((Июль[[#This Row],[Пройдено за день, км]]*0.01*$Y$2+Июль[[#This Row],[Расход топлива на работу спецоборудования, литр]]),3)+X18,\"\")","v":-109081.955},{"$f":"IF(Июль[[#This Row],[Дата]]=\"\",\"\",IFERROR(ROUND(Июль[[#This Row],[Расход топлива по норме, литр]]/VLOOKUP([Дата],S$2:W$4,5),0)+Y18,))","v":0},{"$f":"IFERROR(Июль[[#This Row],[Фактический расход топлива, литр]]-Июль[[#This Row],[Расход топлива по норме, литр]],\"\")","v":109081.955},null,{"$f":"Июль[[#This Row],[Дата]]","v":"2018-07-12"},null,null,null,null,null,null,null,{"$f":"Июль[[#This Row],[Дата]]","v":"2018-07-12"}]
["2018-07-13",null,0,null,0,0,449,0,null,0,null,{"$f":"IF(Июль[[#This Row],[Работа спецоборудования за день, м/ч]]=\"\",\"\",Июль[[#This Row],[Работа спецоборудования за день, м/ч]]*$Z$2)","v":0},{"$f":"IF($T$2=[Дата],VLOOKUP([Дата],S$2:U$3,3),IF($T$3=[Дата],VLOOKUP([Дата],S$2:U$3,3),INDIRECT($P$1&\"!F8\")+INDIRECT($P$1&\"!U8\")+INDIRECT($P$1&\"!G8\")-INDIRECT($P$1&\"!O88\")))","v":450},{"$f":"IFERROR(ROUND((Июль[[#This Row],[Пройдено за день, км]]*0.01*$Y$2+Июль[[#This Row],[Расход топлива на работу спецоборудования, литр]]),3)+X19,\"\")","v":0},{"$f":"IF(Июль[[#This Row],[Дата]]=\"\",\"\",IFERROR(ROUND(Июль[[#This Row],[Расход топлива по норме, литр]]/VLOOKUP([Дата],S$2:W$4,5),0)+Y19,))","v":0},{"$f":"IFERROR(Июль[[#This Row],[Фактический расход топлива, литр]]-Июль[[#This Row],[Расход топлива по норме, литр]],\"\")","v":0},null,{"$f":"Июль[[#This Row],[Дата]]","v":"2018-07-13"},null,null,null,null,null,null,null,{"$f":"Июль[[#This Row],[Дата]]","v":"2018-07-13"}]
["2018-07-14",null,0,null,0,0,449,0,null,0,null,{"$f":"IF(Июль[[#This Row],[Работа спецоборудования за день, м/ч]]=\"\",\"\",Июль[[#This Row],[Работа спецоборудования за день, м/ч]]*$Z$2)","v":0},{"$f":"IF($T$2=[Дата],VLOOKUP([Дата],S$2:U$3,3),IF($T$3=[Дата],VLOOKUP([Дата],S$2:U$3,3),INDIRECT($P$1&\"!F8\")+INDIRECT($P$1&\"!U8\")+INDIRECT($P$1&\"!G8\")-INDIRECT($P$1&\"!O88\")))","v":450},{"$f":"IFERROR(ROUND((Июль[[#This Row],[Пройдено за день, км]]*0.01*$Y$2+Июль[[#This Row],[Расход топлива на работу спецоборудования, литр]]),3)+X20,\"\")","v":0},{"$f":"IF(Июль[[#This Row],[Дата]]=\"\",\"\",IFERROR(ROUND(Июль[[#This Row],[Расход топлива по норме, литр]]/VLOOKUP([Дата],S$2:W$4,5),0)+Y20,))","v":0},{"$f":"IFERROR(Июль[[#This Row],[Фактический расход топлива, литр]]-Июль[[#This Row],[Расход топлива по норме, литр]],\"\")","v":0},null,{"$f":"Июль[[#This Row],[Дата]]","v":"2018-07-14"},null,null,null,null,null,null,null,{"$f":"Июль[[#This Row],[Дата]]","v":"2018-07-14"}]
{"$rows_left_out":21}
{"sheet":"ТС","index":1,"n_rows":33,"n_cols":25,"rows_kept":33,"cut":false,"hidden":false,"merged":[[0,15,2,24],[2,6,2,7],[2,11,2,12]]}
[null,null,null,null,null,null,"Зима :","01.11 - 31.03",null,null,null,"Зима :","01.11 - 31.03",null,null,"Расчет максимальной нормы расхода ДТ (литр/100км)"]
[null,null,null,null,null,null,"Лето:","01.04 - 30.10",null,null,null,"Лето:","01.04 - 30.10"]
[null,null,null,null,null,null,"доп.коэфф-т к норме",null,null,null,null,"доп.коэфф-т к норме"]
["№ п/п","Номер гос.регистрации / Заводской номер","Километраж, км","Спецоборудование, м/ч","Топливо, л","Базовая норма расхода на 100 км","Зима","Лето","Итога норма а/м ЗИМА","Итога норма а/м ЛЕТО","Базовая норма расхода на 1 мото/час","\"Зима\"","\"Лето\"","Итога норма а/м \"ЗИМА\"","Итога норма а/м \"ЛЕТО\"","Норма на 100 км, литров","движение с манипулятором","Тоннаж","Литры","На движение с грузом","Тоннаж1","К-т загрузки","ИТОГ","25% за работу в городе с населением свыше 3 млн. человек","10 % за работу зимой"]
[1,"Норма 1",209024,620,500,46.86,10,0,{"$f":"F5*(100+G5)%","v":51.546000000000006},{"$f":"F5*(100+H5)%","v":46.86},5.5,10,0,{"$f":"K5*(100+L5)%","v":6.0500000000000007},{"$f":"K5*(100+M5)%","v":5.5},32.200000000000003,{"$f":"R5*S5","v":2.9379999999999997},2.2599999999999998,1.3,{"$f":"U5*V5*S5","v":5.2},8,0.5,{"$f":"P5+Q5+T5","v":40.338000000000008},{"$f":"W5*25%+W5","v":50.422500000000014},{"$f":"W5*10%+X5","v":54.456300000000013}]
[2,"Норма 2",null,null,500,{"$f":"F5-F5*5%","v":44.516999999999996},10,0,{"$f":"F6*(100+G6)%","v":48.968699999999998},{"$f":"F6*(100+H6)%","v":44.516999999999996},{"$f":"K5-K5*5%","v":5.2249999999999996},10,0,{"$f":"K6*(100+L6)%","v":5.7475000000000005},{"$f":"K6*(100+M6)%","v":5.2249999999999996},32.200000000000003,{"$f":"R6*S6","v":2.9379999999999997},2.2599999999999998,1.3,{"$f":"U6*V6*S6","v":5.2},8,0.5,{"$f":"P6+Q6+T6","v":40.338000000000008},{"$f":"W6*25%+W6","v":50.422500000000014},{"$f":"W6*10%+X6","v":54.456300000000013}]
[3,"Норма 3",null,null,500,{"$f":"F5-F5*10%","v":42.173999999999999},10,0,{"$f":"F7*(100+G7)%","v":46.391400000000004},42.173999999999999,{"$f":"K5-K5*10%","v":4.95},10,0,{"$f":"K7*(100+L7)%","v":5.4450000000000003},{"$f":"K7*(100+M7)%","v":4.95},32.200000000000003,{"$f":"R7*S7","v":2.9379999999999997},2.2599999999999998,1.3,{"$f":"U7*V7*S7","v":5.2},8,0.5,{"$f":"P7+Q7+T7","v":40.338000000000008},{"$f":"W7*25%+W7","v":50.422500000000014},{"$f":"W7*10%+X7","v":54.456300000000013}]
[4,"Переход 1",null,null,500,46.86,10,0,{"$f":"F8*(100+G8)%","v":51.546000000000006},{"$f":"F8*(100+H8)%","v":46.86},5.5,10,0,{"$f":"K8*(100+L8)%","v":6.0500000000000007},{"$f":"K8*(100+M8)%","v":5.5},null,{"$f":"R8*S8","v":0},null,null,{"$f":"U8*V8*S8","v":0},null,null,{"$f":"P8+Q8+T8","v":0},{"$f":"W8*25%+W8","v":0},{"$f":"W8*10%+X8","v":0}]
[5,"Переход 2",null,null,500,{"$f":"F8-F8*5%","v":44.516999999999996},10,0,{"$f":"F9*(100+G9)%","v":48.968699999999998},{"$f":"F9*(100+H9)%","v":44.516999999999996},{"$f":"K8-K8*5%","v":5.2249999999999996},10,0,{"$f":"K9*(100+L9)%","v":5.7475000000000005},{"$f":"K9*(100+M9)%","v":5.2249999999999996},null,{"$f":"R9*S9","v":0},null,null,{"$f":"U9*V9*S9","v":0},null,null,{"$f":"P9+Q9+T9","v":0},{"$f":"W9*25%+W9","v":0},{"$f":"W9*10%+X9","v":0}]
[6,"Переход 3",null,null,500,{"$f":"F8-F8*10%","v":42.173999999999999},10,0,{"$f":"F10*(100+G10)%","v":46.391400000000004},42.173999999999999,{"$f":"K8-K8*10%","v":4.95},10,0,{"$f":"K10*(100+L10)%","v":5.4450000000000003},{"$f":"K10*(100+M10)%","v":4.95},null,{"$f":"R10*S10","v":0},null,null,{"$f":"U10*V10*S10","v":0},null,null,{"$f":"P10+Q10+T10","v":0},{"$f":"W10*25%+W10","v":0},{"$f":"W10*10%+X10","v":0}]
[]
[null,"Зима"]
[null,"Лето"]
[]
[null,"Январь"]
[null,"Февраль"]
[null,"Март"]
[null,"Апрель"]
[null,"Май"]
[null,"Июнь"]
{"$rows_left_out":14}
{"sheet":"Сотрудники","index":2,"n_rows":11,"n_cols":2,"rows_kept":11,"cut":false,"hidden":false,"merged":[]}
[null,"Ф.И.О."]
[null,"Зяблов А.А"]
[null,"Ильин А.Г."]
[null,"Ильин Е.Н."]
[null,"Ильичев Ю.Ф."]
[null,"Кобалян М.В."]
[null,"Лагутенко А.А."]
[null,"Малышев О.С."]
[null,"Никляев В.А."]
[null,"Сергеев Д.О."]
[null,"Ястребов Е.В."]