{"text_format":"1","workbook":"xlsx","n_sheets":2,"sheets":["Расчет","Движение мц"],"not_rendered":{"charts":0,"images":0,"macros":1,"external_links":0,"defined_names":10,"comments":0,"pivot_tables":0},"unopened":[],"bounds":{"document_bytes":16777216,"sheet_cells":100000,"rows_first":2000,"rows_last":500,"rows_between":2000,"halvings":0,"cell_chars":16384,"cell_head_chars":4096},"cells_cut":0,"cells_raw":0,"read":"whole","date_system":"1900"}

{"sheet":"Расчет","index":0,"n_rows":242,"n_cols":50,"rows_kept":242,"cut":false,"hidden":false,"merged":[]}
[null,null,null,null,null,null,null,null,null,null,null,null,null,null,null,null,null,null,null,null,"Расчет",null,"по расходованию медикаментов в дневном стационаре ОГАУЗ ИГДП №2 ",{"$f":"#REF!","v":{"$error":"#REF!"}},null,null,null,null,null,null,null,null,null,null,null,"Стационар"]
[null,null,null,null,null,null,null,null,null,null,null,null,null,null,null,null,null,null,null,null,null,null,"по расходованию спирта и ИМН  в ОГАУЗ «ИГДП №2»",{"$f":"EOMONTH(X1,0)","v":{"$error":"#REF!"}}]
[]
[null,null,null,null,{"$f":"IF(ISERROR(VLOOKUP(\"ДОСТАВКА ПРОСРОЧЕНА!\",Главная_tb[Информация],1,)=\"ДОСТАВКА ПросроченА!\"),\"\",\"Есть заказы с просроченной доставкой!\")","v":""}]
[]
[]
[]
[]
[null,null,"Дата","Наименование","Операция","Место","Поставщик","Информация","Заказ","Дата поставки","Номер акта","Остаток на складе","Приход","Расход","Остаток","Кому выдано","Единицы","Группа",null,null,null,null,"Наименование","Единицы","Группа","Дата остатка","Начальный остаток","Остаток на отч. период","Приход за период","Расход за период","Наличие за период","Движение за период","Приход общий","Расход общий","Наличие общее",null,null,"Наименование","Единицы","Группа","Дата остатка","Начальный остаток","Остаток на отч. период","Приход за период","Расход за период","Наличие за период","Движение за период","Приход общий","Расход общий","Наличие общее"]
[null,null,"2018-07-31","Азопирам (200 опред.)","Начальный остаток","Склад",null,"",null,null,null,0,30,null,30,null,"комп.","Расходники",{"$f":"IF(E10<>\"Заказано у поставщика\",\"\",IFERROR(IF(MATCH(D10&G10&\"Получено от поставщика\",D83:D2102&G83:G2102&E83:E2102,),\"Доставка получена!\"),IF(Главная_tb[[#This Row],[Дата поставки]],IF(Главная_tb[[#This Row],[Дата поставки]]<TODAY(),\"Доставка просрочена!\",\"Доставка в пути!\"),\"\")))","v":""},null,null,null,"Адреналин гидрохлорид (р-р, 0,1%, 1 мл.)","уп.","Медикаменты","",0,0,0,0,0,0,0,0,0,null,null,"Адреналин гидрохлорид (р-р, 0,1%, 1 мл.)","уп.","Медикаменты","",0,0,0,0,0,0,0,0,0]
[null,null,"2018-07-31","Бинт (нест.)","Начальный остаток","Склад",null,"",null,null,null,0,69,null,69,null,"шт.","Расходники",null,null,null,null,"АДС","доз.","Вакцина","",0,0,0,0,0,0,0,0,0,null,null,"АДС","доз.","Вакцина","",0,0,0,0,0,0,0,0,0]
[null,null,"2018-07-31","Бинт (стер.)","Начальный остаток","Склад",null,"",null,null,null,0,81,null,81,null,"шт.","Расходники",null,null,null,null,"АДС-М","доз.","Вакцина","2018-07-31",280,280,0,0,280,560,0,0,280,null,null,"АДС-М","доз.","Вакцина","",0,0,0,0,0,0,0,0,0]
[null,null,"2018-07-31","Вата (нест. 250 гр.)","Начальный остаток","Склад",null,"",null,null,null,0,5500,null,5500,null,"гр.","Расходники",null,null,null,null,"Азитромицин (таб., 125 мг, №6)","уп.","Медикаменты","",0,0,0,0,0,0,0,0,0,null,null,"Азитромицин (таб., 125 мг, №6)","уп.","Медикаменты","",0,0,0,0,0,0,0,0,0]
[null,null,"2018-07-31","Вата (нест. 100 гр.)","Начальный остаток","Склад",null,"",null,null,null,0,1500,null,1500,null,"гр.","Расходники",null,null,null,null,"Азопирам (200 опред.)","комп.","Расходники","2018-07-31",30,30,0,0,30,60,0,0,30,null,null,"Азопирам (200 опред.)","комп.","Расходники","",0,0,0,0,0,0,0,0,0]
[null,null,"2018-07-31","Вата (стер. 100 гр.)","Начальный остаток","Склад",null,"",null,null,null,0,2000,null,2000,null,"гр.","Расходники",null,null,null,null,"АКДС","доз.","Вакцина","2018-07-31",300,300,0,0,300,600,0,0,300,null,null,"АКДС","доз.","Вакцина","",0,0,0,0,0,0,0,0,0]
[null,null,"2018-07-31","Перчатки (стер, латекс.)","Начальный остаток","Склад",null,"",null,null,null,0,350,null,350,null,"пар.","Расходники",null,null,null,null,"АКДС-Гепатит В","доз.","Вакцина","2018-07-31",240,240,0,0,240,480,0,0,240,null,null,"АКДС-Гепатит В","доз.","Вакцина","",0,0,0,0,0,0,0,0,0]
[null,null,"2018-07-31","Перчатки (нестер, латекс.)","Начальный остаток","Склад",null,"",null,null,null,0,3050,null,3050,null,"пар.","Расходники",null,null,null,null,"Актовегин (р-р, 5 мл., №5)","амп.","Медикаменты","",0,0,0,0,0,0,0,0,0,null,null,"Актовегин (р-р, 5 мл., №5)","амп.","Медикаменты","",0,0,0,0,0,0,0,0,0]
[null,null,"2018-07-31","Салфетка спиртовая (стер., 60х100 мм., 70%)","Начальный остаток","Склад",null,"",null,null,null,0,2650,null,2650,null,"шт.","Расходники",null,null,null,null,"АКТ-Хиб","доз.","Вакцина","",0,0,0,0,0,0,0,0,0,null,null,"АКТ-Хиб","доз.","Вакцина","",0,0,0,0,0,0,0,0,0]
[null,null,"2018-07-31","Шпатель (стер.)","Начальный остаток","Склад",null,"",null,null,null,0,16200,null,16200,null,"шт.","Расходники",null,null,null,null,"Аллерген из библиотечной пыли для диагностики","комп.","Аллергены","",0,0,0,0,0,0,0,0,0,null,null,"Аллерген из библиотечной пыли для диагностики","комп.","Аллергены","",0,0,0,0,0,0,0,0,0]
[null,null,"2018-07-31","Бонадерм - крем для рук восстанавливающий (100 мл.)","Начальный остаток","Склад",null,"",null,null,null,0,42,null,42,null,"шт.","Расходники",null,null,null,null,"Аллерген из дафнии для диагностики","комп.","Аллергены","",0,0,0,0,0,0,0,0,0,null,null,"Аллерген из дафнии для диагностики","комп.","Аллергены","",0,0,0,0,0,0,0,0,0]
[null,null,"2018-07-31","Бонадерм-Ультра (100 мл., с распыляющей насадкой)","Начальный остаток","Склад",null,"",null,null,null,0,85,null,85,null,"шт.","Дезсредства",null,null,null,null,"Аллерген из домашней пыли для диагностики","комп.","Аллергены","",0,0,0,0,0,0,0,0,0,null,null,"Аллерген из домашней пыли для диагностики","комп.","Аллергены","",0,0,0,0,0,0,0,0,0]
[null,null,"2018-07-31","Бонадерм-Ультра (50 мл., с распыляющей насадкой)","Начальный остаток","Склад",null,"",null,null,null,0,81,null,81,null,"шт.","Дезсредства",null,null,null,null,"Аллерген из клеща Dermatophagoides pteronissinus для диагностики и лечения","комп.","Аллергены","",0,0,0,0,0,0,0,0,0,null,null,"Аллерген из клеща Dermatophagoides pteronissinus для диагностики и лечения","комп.","Аллергены","",0,0,0,0,0,0,0,0,0]
[null,null,"2018-07-31","Бонадерм-ИП салфетки (100 шт.)","Начальный остаток","Склад",null,"",null,null,null,0,80,null,80,null,"уп.","Дезсредства",null,null,null,null,"Аллерген из пера подушек для диагностики и лечения","комп.","Аллергены","",0,0,0,0,0,0,0,0,0,null,null,"Аллерген из пера подушек для диагностики и лечения","комп.","Аллергены","",0,0,0,0,0,0,0,0,0]
[null,null,"2018-07-31","Бонадерм-гель (100 мл.)","Начальный остаток","Склад",null,"",null,null,null,0,183,null,183,null,"шт.","Дезсредства",null,null,null,null,"Аллерген из перхоти лошади для диагностики","комп.","Аллергены","",0,0,0,0,0,0,0,0,0,null,null,"Аллерген из перхоти лошади для диагностики","комп.","Аллергены","",0,0,0,0,0,0,0,0,0]
[null,null,"2018-07-31","Бонацид (с распылителем, 0,5 л.)","Начальный остаток","Склад",null,"",null,null,null,0,3,null,3,null,"фл.","Дезсредства",null,null,null,null,"Аллерген из пыльцы березы висячей для диагностики и лечения","комп.","Аллергены","",0,0,0,0,0,0,0,0,0,null,null,"Аллерген из пыльцы березы висячей для диагностики и лечения","комп.","Аллергены","",0,0,0,0,0,0,0,0,0]
[null,null,"2018-07-31","Бумага УЗИ сканер (20 м.)","Начальный остаток","Склад",null,"",null,null,null,0,10,null,10,null,"уп.","Расходники",null,null,null,null,"Аллерген из пыльцы клена ясенелистного для диагностики и лечения","комп.","Аллергены","",0,0,0,0,0,0,0,0,0,null,null,"Аллерген из пыльцы клена ясенелистного для диагностики и лечения","комп.","Аллергены","",0,0,0,0,0,0,0,0,0]
[null,null,"2018-07-31","Бумага для спирографа Микролаб viasys (110*12*12)","Начальный остаток","Склад",null,"",null,null,null,0,5,null,5,null,"уп.","Расходники",null,null,null,null,"Аллерген из пыльцы лебеды татарской для диагностики и лечения","комп.","Аллергены","",0,0,0,0,0,0,0,0,0,null,null,"Аллерген из пыльцы лебеды татарской для диагностики и лечения","комп.","Аллергены","",0,0,0,0,0,0,0,0,0]
[null,null,"2018-07-31","Гель для УЗИ (1 л.)","Начальный остаток","Склад",null,"",null,null,null,0,2,null,2,null,"фл.","Расходники",null,null,null,null,"Аллерген из пыльцы луговых трав для диагностики и лечения","комп.","Аллергены","",0,0,0,0,0,0,0,0,0,null,null,"Аллерген из пыльцы луговых трав для диагностики и лечения","комп.","Аллергены","",0,0,0,0,0,0,0,0,0]
[null,null,"2018-07-31","Гель для УЗИ (5 л.)","Начальный остаток","Склад",null,"",null,null,null,0,2,null,2,null,"кан.","Расходники",null,null,null,null,"Аллерген из пыльцы одуванчика лекарственного для диагностики и лечения","комп.","Аллергены","",0,0,0,0,0,0,0,0,0,null,null,"Аллерген из пыльцы одуванчика лекарственного для диагностики и лечения","комп.","Аллергены","",0,0,0,0,0,0,0,0,0]
[null,null,"2018-07-31","Литосептин","Начальный остаток","Склад",null,"",null,null,null,0,132,null,132,null,"л.","Дезсредства",null,null,null,null,"Аллерген из пыльцы полыни горькой для диагностики и лечения","комп.","Аллергены","",0,0,0,0,0,0,0,0,0,null,null,"Аллерген из пыльцы полыни горькой для диагностики и лечения","комп.","Аллергены","",0,0,0,0,0,0,0,0,0]
[null,null,"2018-07-31","ОДС-14","Начальный остаток","Склад",null,"",null,null,null,0,3,null,3,null,"л.","Дезсредства",null,null,null,null,"Аллерген эпидермальный из шерсти кошки для диагностики","комп.","Аллергены","",0,0,0,0,0,0,0,0,0,null,null,"Аллерген эпидермальный из шерсти кошки для диагностики","комп.","Аллергены","",0,0,0,0,0,0,0,0,0]
[null,null,"2018-07-31","Экобак","Начальный остаток","Склад",null,"",null,null,null,0,21,null,21,null,"л.","Дезсредства",null,null,null,null,"Аллерген эпидермальный из шерсти собаки для диагностики","комп.","Аллергены","",0,0,0,0,0,0,0,0,0,null,null,"Аллерген эпидермальный из шерсти собаки для диагностики","комп.","Аллергены","",0,0,0,0,0,0,0,0,0]
[null,null,"2018-07-31","Зеркало гинекологическое \"Куско\"","Начальный остаток","Склад",null,"",null,null,null,0,100,null,100,null,"шт.","Расходники",null,null,null,null,"Альгавак М","доз.","Вакцина","",0,0,0,0,0,0,0,0,0,null,null,"Альгавак М","доз.","Вакцина","",0,0,0,0,0,0,0,0,0]
[null,null,"2018-07-31","Ложка Фолькмана","Начальный остаток","Склад",null,"",null,null,null,0,100,null,100,null,"шт.","Расходники",null,null,null,null,"Амброксол (р-р, 7,5 мг./1 мл., 100 мл.)","фл.","Медикаменты","",0,0,0,0,0,0,0,0,0,null,null,"Амброксол (р-р, 7,5 мг./1 мл., 100 мл.)","фл.","Медикаменты","",0,0,0,0,0,0,0,0,0]
[null,null,"2018-07-31","Маска медицинская трёхслойная, одноразовая","Начальный остаток","Склад",null,"",null,null,null,0,400,null,400,null,"шт.","Расходники",null,null,null,null,"Аммиака раствор (10%, 40 мл.)","фл.","Медикаменты","",0,0,0,0,0,0,0,0,0,null,null,"Аммиака раствор (10%, 40 мл.)","фл.","Медикаменты","",0,0,0,0,0,0,0,0,0]
[null,null,"2018-07-31","Мундштук картонный одноразовый","Начальный остаток","Склад",null,"",null,null,null,0,250,null,250,null,"шт.","Расходники",null,null,null,null,"Баллон Политцера с оливами","набор","Многоразовые расходники","",0,0,0,0,0,0,0,0,0,null,null,"Баллон Политцера с оливами","набор","Многоразовые расходники","",0,0,0,0,0,0,0,0,0]
[null,null,"2018-07-31","МДГР","Начальный остаток","Склад",null,"",null,null,null,0,25,null,25,null,"л.","Дезсредства",null,null,null,null,"Берет медицинский (однораз.)","шт.","Расходники","2018-07-31",100,100,0,0,100,200,0,0,100,null,null,"Берет медицинский (однораз.)","шт.","Расходники","",0,0,0,0,0,0,0,0,0]
[null,null,"2018-07-31","Скальпель (однораз., хир., стер.)","Начальный остаток","Склад",null,"",null,null,null,0,100,null,100,null,"шт.","Расходники",null,null,null,null,"Беродуал (р-р флакон/кап. по 20 мл.)","фл.","Медикаменты","",0,0,0,0,0,0,0,0,0,null,null,"Беродуал (р-р флакон/кап. по 20 мл.)","фл.","Медикаменты","",0,0,0,0,0,0,0,0,0]
[null,null,"2018-07-31","Полотенце бумажное","Начальный остаток","Склад",null,"",null,null,null,0,110,null,110,null,"уп.","Расходники",null,null,null,null,"Би Вак полио","доз.","Вакцина","2018-07-31",400,400,0,0,400,800,0,0,400,null,null,"Би Вак полио","доз.","Вакцина","",0,0,0,0,0,0,0,0,0]
[null,null,"2018-07-31","Проклин антисептик (1 л. с триггером, экспресс)","Начальный остаток","Склад",null,"",null,null,null,0,17,null,17,null,"л.","Дезсредства",null,null,null,null,"Бинт (нест.)","шт.","Расходники","2018-07-31",69,69,0,9,60,138,0,9,60,null,null,"Бинт (нест.)","шт.","Расходники","",0,0,0,0,0,0,0,0,0]
[null,null,"2018-07-31","Проклин антисептик (1 л.  УМР)","Начальный остаток","Склад",null,"",null,null,null,0,112,null,112,null,"л.","Дезсредства",null,null,null,null,"Бинт (стер.)","шт.","Расходники","2018-07-31",81,81,0,2,79,162,0,2,79,null,null,"Бинт (стер.)","шт.","Расходники","",0,0,0,0,0,0,0,0,0]
[null,null,"2018-07-31","Салфетка (спанлейс, 30х40 см., 100 шт.)","Начальный остаток","Склад",null,"",null,null,null,0,95,null,95,null,"уп.","Расходники",null,null,null,null,"Бинт (фикс., 4 см х 4 м.)","шт.","Расходники","",0,0,0,0,0,0,0,0,0,null,null,"Бинт (фикс., 4 см х 4 м.)","шт.","Расходники","",0,0,0,0,0,0,0,0,0]
[null,null,"2018-07-31","Шапочка медицинская (нест.)","Начальный остаток","Склад",null,"",null,null,null,0,696,null,696,null,"шт.","Расходники",null,null,null,null,"Бинт (фикс., 6 см х 4 м.)","шт.","Расходники","",0,0,0,0,0,0,0,0,0,null,null,"Бинт (фикс., 6 см х 4 м.)","шт.","Расходники","",0,0,0,0,0,0,0,0,0]
[null,null,"2018-07-31","Берет медицинский (однораз.)","Начальный остаток","Склад",null,"",null,null,null,0,100,null,100,null,"шт.","Расходники",null,null,null,null,"Бонадерм - крем для рук восстанавливающий (100 мл.)","шт.","Расходники","2018-07-31",42,42,0,1,41,84,0,1,41,null,null,"Бонадерм - крем для рук восстанавливающий (100 мл.)","шт.","Расходники","",0,0,0,0,0,0,0,0,0]
[null,null,"2018-07-31","Салфетка (стер., 14х16 см., №10)","Начальный остаток","Склад",null,"",null,null,null,0,100,null,100,null,"уп.","Расходники",null,null,null,null,"Бонадерм-гель (100 мл.)","шт.","Дезсредства","2018-07-31",183,183,0,1,182,366,0,1,182,null,null,"Бонадерм-гель (100 мл.)","шт.","Дезсредства","",0,0,0,0,0,0,0,0,0]
[null,null,"2018-07-31","Крафт-пакеты (пакеты упаковочные для стерилизации СтериТ)","Начальный остаток","Склад",null,"",null,null,null,0,600,null,600,null,"шт.","Расходники",null,null,null,null,"Бонадерм-ИП салфетки (100 шт.)","уп.","Дезсредства","2018-07-31",80,80,0,0,80,160,0,0,80,null,null,"Бонадерм-ИП салфетки (100 шт.)","уп.","Дезсредства","",0,0,0,0,0,0,0,0,0]
[null,null,"2018-07-31","Септолит-Форте (1 л.)","Начальный остаток","Склад",null,"",null,null,null,0,1,null,1,null,"шт.","Дезсредства",null,null,null,null,"Бонадерм-Ультра (100 мл., с распыляющей насадкой)","шт.","Дезсредства","2018-07-31",85,85,0,0,85,170,0,0,85,null,null,"Бонадерм-Ультра (100 мл., с распыляющей насадкой)","шт.","Дезсредства","",0,0,0,0,0,0,0,0,0]
[null,null,"2018-07-31","Спирт этиловый (70%)","Начальный остаток","Склад",null,"",null,null,null,0,900,null,900,null,"мл.","Спирт",null,null,null,null,"Бонадерм-Ультра (50 мл., с распыляющей насадкой)","шт.","Дезсредства","2018-07-31",81,81,0,1,80,162,0,1,80,null,null,"Бонадерм-Ультра (50 мл., с распыляющей насадкой)","шт.","Дезсредства","",0,0,0,0,0,0,0,0,0]
[null,null,"2018-07-31","Спирт этиловый (95%)","Начальный остаток","Склад",null,"",null,null,null,0,2400,null,2400,null,"мл.","Спирт",null,null,null,null,"Бонацид (с распылителем, 0,5 л.)","фл.","Дезсредства","2018-07-31",3,3,0,0,3,6,0,0,3,null,null,"Бонацид (с распылителем, 0,5 л.)","фл.","Дезсредства","",0,0,0,0,0,0,0,0,0]
[null,null,"2018-07-31","Винпоцетин (таб., 5 мг., №50)","Начальный остаток","ДС",null,"",null,null,null,0,2600,null,2600,null,"таб.","Медикаменты",null,null,null,null,"Бриллиантовый зеленый (флак., 1%, 10 мл.)","фл.","Медикаменты","",0,0,0,0,0,0,0,0,0,null,null,"Бриллиантовый зеленый (флак., 1%, 10 мл.)","фл.","Медикаменты","",0,0,0,0,0,0,0,0,0]
[null,null,"2018-07-31","Винпоцетин-АКОС (амп., 2 мл., №10)","Начальный остаток","ДС",null,"",null,null,null,0,200,null,200,null,"амп.","Медикаменты",null,null,null,null,"Бромгексин (таб., 4 мг., № 50)","таб.","Медикаменты","",0,0,0,0,0,0,0,0,0,null,null,"Бромгексин (таб., 4 мг., № 50)","таб.","Медикаменты","",0,0,0,0,0,0,0,0,0]
[null,null,"2018-07-31","Глицин (таб., 100 мг., №50)","Начальный остаток","ДС",null,"",null,null,null,0,500,null,500,null,"таб.","Медикаменты",null,null,null,null,"Бромгексин (таб., 8 мг., № 20)","таб.","Медикаменты","",0,0,0,0,0,0,0,0,0,null,null,"Бромгексин (таб., 8 мг., № 20)","таб.","Медикаменты","",0,0,0,0,0,0,0,0,0]
[null,null,"2018-07-31","Кавинтон (амп., 10 мг., 2,0, №10)","Начальный остаток","ДС",null,"",null,null,null,0,20,null,20,null,"амп.","Медикаменты",null,null,null,null,"Бубо-кок","доз.","Вакцина","2018-07-31",130,130,0,0,130,260,0,0,130,null,null,"Бубо-кок","доз.","Вакцина","",0,0,0,0,0,0,0,0,0]
[null,null,"2018-07-31","Кальция хлорид (10%, 5,0 №10)","Начальный остаток","ДС",null,"",null,null,null,0,30,null,30,null,"амп.","Медикаменты",null,null,null,null,"Бумага для спирографа Микролаб viasys (110*12*12)","уп.","Расходники","2018-07-31",5,5,0,0,5,10,0,0,5,null,null,"Бумага для спирографа Микролаб viasys (110*12*12)","уп.","Расходники","",0,0,0,0,0,0,0,0,0]
[null,null,"2018-07-31","Мексидол (таб., 125 мг., №50)","Начальный остаток","ДС",null,"",null,null,null,0,1050,null,1050,null,"амп.","Медикаменты",null,null,null,null,"Бумага УЗИ сканер (20 м.)","рул.","Расходники","2018-07-31",10,10,0,0,10,20,0,0,10,null,null,"Бумага УЗИ сканер (20 м.)","рул.","Расходники","",0,0,0,0,0,0,0,0,0]
[null,null,"2018-07-31","Метронидазол (таб., 0,2 мг., №10)","Начальный остаток","ДС",null,"",null,null,null,0,34,null,34,null,"таб.","Медикаменты",null,null,null,null,"Бумага ЭКГ (110 мм. х 30 мм.)","рул.","Расходники","",0,0,0,0,0,0,0,0,0,null,null,"Бумага ЭКГ (110 мм. х 30 мм.)","рул.","Расходники","",0,0,0,0,0,0,0,0,0]
[null,null,"2018-07-31","Омепразол (капс., 20 мг., №30)","Начальный остаток","ДС",null,"",null,null,null,0,90,null,90,null,"капс.","Медикаменты",null,null,null,null,"Бумага ЭКГ (80 мм. х 70 мм., 300 л.)","пач.","Расходники","",0,0,0,0,0,0,0,0,0,null,null,"Бумага ЭКГ (80 мм. х 70 мм., 300 л.)","пач.","Расходники","",0,0,0,0,0,0,0,0,0]
[null,null,"2018-07-31","Пантогам (таб., 250 мг., №50)","Начальный остаток","ДС",null,"",null,null,null,0,150,null,150,null,"таб.","Медикаменты",null,null,null,null,"БЦЖ","доз.","Вакцина","2018-07-31",30,30,0,0,30,60,0,0,30,null,null,"БЦЖ","доз.","Вакцина","",0,0,0,0,0,0,0,0,0]
[null,null,"2018-07-31","Пирацетам (амп., 20%, 5 мл., №10)","Начальный остаток","ДС",null,"",null,null,null,0,560,null,560,null,"амп.","Медикаменты",null,null,null,null,"БЦЖ-М","доз.","Вакцина","2018-07-31",5,5,0,0,5,10,0,0,5,null,null,"БЦЖ-М","доз.","Вакцина","",0,0,0,0,0,0,0,0,0]
[null,null,"2018-07-31","Пирацетам (капсулы 0,4 г. №60)","Начальный остаток","ДС",null,"",null,null,null,0,900,null,900,null,"капс.","Медикаменты",null,null,null,null,"Вазелиновое масло (100 мл.)","шт.","Медикаменты","",0,0,0,0,0,0,0,0,0,null,null,"Вазелиновое масло (100 мл.)","шт.","Медикаменты","",0,0,0,0,0,0,0,0,0]
{"$rows_left_out":183}
{"sheet":"Движение мц","index":1,"n_rows":108,"n_cols":7,"rows_kept":108,"cut":false,"hidden":false,"merged":[]}
["Дата с","Дата по","Маркер","МЦ"]
["2018-08-01","2018-08-03","Группы","Расходники"]
[]
[]
[]
[]
[]
[]
[]
[]
[]
[]
[]
[]
[null,"Дата операции","Операция","Наименование МЦ","Приход","Отпуск","Получатель"]
[null,"2018-08-01","Операции со складом","Маска медицинская трёхслойная, одноразовая",null,50,"Ксенофонтова"]
[null,"2018-08-01","Операции со складом","Перчатки (нестер, латекс.)",null,500,"Процедурный кабинет"]
[null,"2018-08-01","Операции со складом","Бонадерм - крем для рук восстанавливающий (100 мл.)",null,1,"Процедурный кабинет"]
[null,"2018-08-01","Операции со складом","Салфетка спиртовая (стер., 60х100 мм., 70%)",null,650,"Процедурный кабинет"]
[null,"2018-08-02","Операции со складом","Перчатки (нестер, латекс.)",null,50,"УЗС"]
["МЦ","2018-08-02","Операции со складом","Шприц (1 мл.)",null,200,"ДШО"]
["Группы","2018-08-02","Операции со складом","Шприц (1 мл.)",null,100,"Прививочный кабинет"]
["Группы_итог","2018-08-02","Операции со складом","Шприц (2 мл.)",null,200,"Процедурный кабинет"]
["Получатели"]
[]
[]
["Группы накладных"]
["Дезсредства"]
["Медикаменты"]
["Растворы"]
["Расходники"]
["Спирт"]
[]
[]
[]
[]
[]
[]
["Выдано"]
["19 кабинет"]
["1-е педиатрическое отделение"]
["2-е педиатрическое отделение"]
["Аллергологический кабинет"]
["Гинекологический кабинет"]
["Главная медсестра"]
["ДШО"]
["КДЛ"]
["Ксенофонтова"]
["Лор кабинет"]
["ОВЛ"]
["Офтальмологический кабинет"]
["Прививочный кабинет"]
["Процедурный кабинет"]
["УЗС"]
["Хирургический кабинет"]
[]
[]
[]
[]
[]
{"$rows_left_out":48}