{"text_format":"1","workbook":"xlsx","n_sheets":2,"sheets":["данные","Вывод части таблицы"],"not_rendered":{"charts":0,"images":0,"macros":1,"external_links":0,"defined_names":0,"comments":0,"pivot_tables":0},"unopened":[],"bounds":{"document_bytes":16777216,"sheet_cells":100000,"rows_first":2000,"rows_last":500,"rows_between":2000,"halvings":0,"cell_chars":16384,"cell_head_chars":4096},"cells_cut":0,"cells_raw":0,"read":"whole","date_system":"1900"}

{"sheet":"данные","index":0,"n_rows":96,"n_cols":22,"rows_kept":96,"cut":false,"hidden":false,"merged":[]}
[null,null,null,1,2,3,4,null,1,2,3,4,null,1,2,3,4,null,1,2,3,4]
[null,null,"drugoenazvanie",3,2,1,2,"nuznoenazvanie",1,3,5,10,"trejtenazvanie",2,5,7,8,"pjatoenazvanie",1,3,5,10]
[null,null,"drugoenazvanie",4,4,5,4,"nuznoenazvanie",2,6,10,20,"trejtenazvanie",5,6,8,11,"pjatoenazvanie",1,3,5,10]
[null,null,"drugoenazvanie",5,6,9,6,"nuznoenazvanie",3,9,15,30,"trejtenazvanie",8,7,9,14,"pjatoenazvanie",1,3,5,10]
[null,null,"drugoenazvanie",6,8,13,8,"nuznoenazvanie",4,12,20,40,"trejtenazvanie",11,8,10,17,"pjatoenazvanie",1,3,5,10]
[null,null,"drugoenazvanie",7,10,17,10,"nuznoenazvanie",5,15,25,50,"trejtenazvanie",14,9,11,20,"pjatoenazvanie",1,3,5,10]
[null,null,"drugoenazvanie",8,12,21,12,"nuznoenazvanie",6,18,30,60,"trejtenazvanie",17,10,12,23,"pjatoenazvanie",1,3,5,10]
[null,null,"drugoenazvanie",9,14,25,14,"nuznoenazvanie",7,21,35,70,"trejtenazvanie",20,11,13,26,"pjatoenazvanie",1,3,5,10]
[null,null,"drugoenazvanie",10,16,29,16,"nuznoenazvanie",8,24,40,80,"trejtenazvanie",23,12,14,29,"pjatoenazvanie",1,3,5,10]
[null,null,"drugoenazvanie",11,18,33,18,"nuznoenazvanie",9,27,45,90,"trejtenazvanie",26,13,15,32,"pjatoenazvanie",1,3,5,10]
[null,null,"drugoenazvanie",12,20,37,20,"nuznoenazvanie",10,30,50,100,"trejtenazvanie",29,14,16,35,"pjatoenazvanie",1,3,5,10]
[null,null,"drugoenazvanie",13,22,41,22,"nuznoenazvanie",11,33,55,110,"trejtenazvanie",32,15,17,38,"pjatoenazvanie",1,3,5,10]
[null,null,"drugoenazvanie",14,24,45,24,"nuznoenazvanie",12,36,60,120,"trejtenazvanie",35,16,18,41,"pjatoenazvanie",1,3,5,10]
[null,null,"drugoenazvanie",15,26,49,26,"nuznoenazvanie",13,39,65,130,"trejtenazvanie",38,17,19,44,"pjatoenazvanie",1,3,5,10]
[null,null,"drugoenazvanie",16,28,53,28,"nuznoenazvanie",14,42,70,140,"trejtenazvanie",41,18,20,47,"pjatoenazvanie",1,3,5,10]
[null,null,"drugoenazvanie",17,30,57,30,"nuznoenazvanie",15,45,75,150,"trejtenazvanie",44,19,21,50,"pjatoenazvanie",1,3,5,10]
[null,null,"drugoenazvanie",18,32,61,32,"nuznoenazvanie",16,48,80,160,"trejtenazvanie",47,20,22,53,"pjatoenazvanie",1,3,5,10]
[null,null,"drugoenazvanie",19,34,65,34,"nuznoenazvanie",17,51,85,170,"trejtenazvanie",50,21,23,56,"pjatoenazvanie",1,3,5,10]
[null,null,"drugoenazvanie",20,36,69,36,"nuznoenazvanie",18,54,90,180,"trejtenazvanie",53,22,24,59,"pjatoenazvanie",1,3,5,10]
[null,null,"drugoenazvanie",21,38,73,38,"nuznoenazvanie",19,57,95,190,"trejtenazvanie",56,23,25,62,"pjatoenazvanie",1,3,5,10]
[null,null,"drugoenazvanie",22,40,77,40,"nuznoenazvanie",20,60,100,200,"trejtenazvanie",59,24,26,65,"pjatoenazvanie",1,3,5,10]
[null,null,"drugoenazvanie",23,42,81,42,"nuznoenazvanie",21,63,105,210,"trejtenazvanie",62,25,27,68,"pjatoenazvanie",1,3,5,10]
[null,null,"drugoenazvanie",24,44,85,44,"nuznoenazvanie",22,66,110,220,"trejtenazvanie",65,26,28,71,"pjatoenazvanie",1,3,5,10]
[null,null,"drugoenazvanie",25,46,89,46,"nuznoenazvanie",23,69,115,230,"trejtenazvanie",68,27,29,74,"pjatoenazvanie",1,3,5,10]
[null,null,"drugoenazvanie",26,48,93,48,"nuznoenazvanie",24,72,120,240,"trejtenazvanie",71,28,30,77,"pjatoenazvanie",1,3,5,10]
[null,null,"drugoenazvanie",26,48,93,48,"nuznoenazvanie",0,0,0,0,"trejtenazvanie",74,29,31,80,"pjatoenazvanie",1,3,5,10]
[null,null,"drugoenazvanie",26,48,93,48,"nuznoenazvanie",-24,-72,-120,-240,"trejtenazvanie",77,30,32,83,"pjatoenazvanie",1,3,5,10]
[null,null,"drugoenazvanie",26,48,93,48,"nuznoenazvanie",-48,-144,-240,-480,"trejtenazvanie",80,31,33,86,"pjatoenazvanie",1,3,5,10]
[null,null,"drugoenazvanie",26,48,93,48,"nuznoenazvanie",-72,-216,-360,-720,"trejtenazvanie",83,32,34,89,"pjatoenazvanie",1,3,5,10]
[null,null,"drugoenazvanie",26,48,93,48,"nuznoenazvanie",-96,-288,-480,-960,"trejtenazvanie",86,33,35,92,"pjatoenazvanie",1,3,5,10]
{"$rows_left_out":67}
{"sheet":"Вывод части таблицы","index":1,"n_rows":40,"n_cols":13,"rows_kept":40,"cut":false,"hidden":false,"merged":[]}
["nuznoenazvanie",39,null,1,2,3,4,null,null,1,2,3,4]
[null,{"$f":"MATCH(\"我\",данные!C:C)-B1+1","v":58},{"$f":"$A$1","v":"nuznoenazvanie"},{"$f":"INDEX(данные!$A:$V,$B$2+ROW()-2,$B$3+D$1)","v":3},{"$f":"INDEX(данные!$A:$V,$B$2+ROW()-2,$B$3+E$1)","v":-2088},{"$f":"INDEX(данные!$A:$V,$B$2+ROW()-2,$B$3+F$1)","v":-3480},{"$f":"INDEX(данные!$A:$V,$B$2+ROW()-2,$B$3+G$1)","v":-6960},null,null,{"$f":"SUMIF(данные!D$1:$V$1,J$1,INDEX(данные!D:$V,$B$2+ROW()-2,))-D2","v":197},{"$f":"SUMIF(данные!E$1:$V$1,K$1,INDEX(данные!E:$V,$B$2+ROW()-2,))-E2","v":112},{"$f":"SUMIF(данные!F$1:$V$1,L$1,INDEX(данные!F:$V,$B$2+ROW()-2,))-F2","v":161},{"$f":"SUMIF(данные!G$1:$V$1,M$1,INDEX(данные!G:$V,$B$2+ROW()-2,))-G2","v":234}]
[null,{"$f":"MATCH(A1,данные!2:2,)","v":8},{"$f":"$A$1","v":"nuznoenazvanie"},{"$f":"INDEX(данные!$A:$V,$B$2+ROW()-2,$B$3+D$1)","v":2},{"$f":"INDEX(данные!$A:$V,$B$2+ROW()-2,$B$3+E$1)","v":-2088},{"$f":"INDEX(данные!$A:$V,$B$2+ROW()-2,$B$3+F$1)","v":-3480},{"$f":"INDEX(данные!$A:$V,$B$2+ROW()-2,$B$3+G$1)","v":-6960},null,null,{"$f":"SUMIF(данные!D$1:$V$1,J$1,INDEX(данные!D:$V,$B$2+ROW()-2,))-D3","v":200},{"$f":"SUMIF(данные!E$1:$V$1,K$1,INDEX(данные!E:$V,$B$2+ROW()-2,))-E3","v":113},{"$f":"SUMIF(данные!F$1:$V$1,L$1,INDEX(данные!F:$V,$B$2+ROW()-2,))-F3","v":162},{"$f":"SUMIF(данные!G$1:$V$1,M$1,INDEX(данные!G:$V,$B$2+ROW()-2,))-G3","v":237}]
[null,null,"nuznoenazvanie",{"$f":"INDEX(данные!$A:$V,$B$2+ROW()-2,$B$3+D$1)","v":1},{"$f":"INDEX(данные!$A:$V,$B$2+ROW()-2,$B$3+E$1)","v":-2088},{"$f":"INDEX(данные!$A:$V,$B$2+ROW()-2,$B$3+F$1)","v":-3480},{"$f":"INDEX(данные!$A:$V,$B$2+ROW()-2,$B$3+G$1)","v":-6960},null,null,{"$f":"SUMIF(данные!D$1:$V$1,J$1,INDEX(данные!D:$V,$B$2+ROW()-2,))-D4","v":203},{"$f":"SUMIF(данные!E$1:$V$1,K$1,INDEX(данные!E:$V,$B$2+ROW()-2,))-E4","v":114},{"$f":"SUMIF(данные!F$1:$V$1,L$1,INDEX(данные!F:$V,$B$2+ROW()-2,))-F4","v":163},{"$f":"SUMIF(данные!G$1:$V$1,M$1,INDEX(данные!G:$V,$B$2+ROW()-2,))-G4","v":240}]
[null,null,"nuznoenazvanie",{"$f":"INDEX(данные!$A:$V,$B$2+ROW()-2,$B$3+D$1)","v":0},{"$f":"INDEX(данные!$A:$V,$B$2+ROW()-2,$B$3+E$1)","v":0},{"$f":"INDEX(данные!$A:$V,$B$2+ROW()-2,$B$3+F$1)","v":0},{"$f":"INDEX(данные!$A:$V,$B$2+ROW()-2,$B$3+G$1)","v":0},null,null,{"$f":"SUMIF(данные!D$1:$V$1,J$1,INDEX(данные!D:$V,$B$2+ROW()-2,))-D5","v":206},{"$f":"SUMIF(данные!E$1:$V$1,K$1,INDEX(данные!E:$V,$B$2+ROW()-2,))-E5","v":115},{"$f":"SUMIF(данные!F$1:$V$1,L$1,INDEX(данные!F:$V,$B$2+ROW()-2,))-F5","v":164},{"$f":"SUMIF(данные!G$1:$V$1,M$1,INDEX(данные!G:$V,$B$2+ROW()-2,))-G5","v":243}]
[null,null,"nuznoenazvanie",{"$f":"INDEX(данные!$A:$V,$B$2+ROW()-2,$B$3+D$1)","v":0},{"$f":"INDEX(данные!$A:$V,$B$2+ROW()-2,$B$3+E$1)","v":0},{"$f":"INDEX(данные!$A:$V,$B$2+ROW()-2,$B$3+F$1)","v":0},{"$f":"INDEX(данные!$A:$V,$B$2+ROW()-2,$B$3+G$1)","v":0},null,null,{"$f":"SUMIF(данные!D$1:$V$1,J$1,INDEX(данные!D:$V,$B$2+ROW()-2,))-D6","v":209},{"$f":"SUMIF(данные!E$1:$V$1,K$1,INDEX(данные!E:$V,$B$2+ROW()-2,))-E6","v":116},{"$f":"SUMIF(данные!F$1:$V$1,L$1,INDEX(данные!F:$V,$B$2+ROW()-2,))-F6","v":165},{"$f":"SUMIF(данные!G$1:$V$1,M$1,INDEX(данные!G:$V,$B$2+ROW()-2,))-G6","v":246}]
[null,null,"nuznoenazvanie",{"$f":"INDEX(данные!$A:$V,$B$2+ROW()-2,$B$3+D$1)","v":0},{"$f":"INDEX(данные!$A:$V,$B$2+ROW()-2,$B$3+E$1)","v":0},{"$f":"INDEX(данные!$A:$V,$B$2+ROW()-2,$B$3+F$1)","v":0},{"$f":"INDEX(данные!$A:$V,$B$2+ROW()-2,$B$3+G$1)","v":0},null,null,{"$f":"SUMIF(данные!D$1:$V$1,J$1,INDEX(данные!D:$V,$B$2+ROW()-2,))-D7","v":212},{"$f":"SUMIF(данные!E$1:$V$1,K$1,INDEX(данные!E:$V,$B$2+ROW()-2,))-E7","v":117},{"$f":"SUMIF(данные!F$1:$V$1,L$1,INDEX(данные!F:$V,$B$2+ROW()-2,))-F7","v":166},{"$f":"SUMIF(данные!G$1:$V$1,M$1,INDEX(данные!G:$V,$B$2+ROW()-2,))-G7","v":249}]
[null,null,"nuznoenazvanie",{"$f":"INDEX(данные!$A:$V,$B$2+ROW()-2,$B$3+D$1)","v":0},{"$f":"INDEX(данные!$A:$V,$B$2+ROW()-2,$B$3+E$1)","v":0},{"$f":"INDEX(данные!$A:$V,$B$2+ROW()-2,$B$3+F$1)","v":0},{"$f":"INDEX(данные!$A:$V,$B$2+ROW()-2,$B$3+G$1)","v":0},null,null,{"$f":"SUMIF(данные!D$1:$V$1,J$1,INDEX(данные!D:$V,$B$2+ROW()-2,))-D8","v":215},{"$f":"SUMIF(данные!E$1:$V$1,K$1,INDEX(данные!E:$V,$B$2+ROW()-2,))-E8","v":118},{"$f":"SUMIF(данные!F$1:$V$1,L$1,INDEX(данные!F:$V,$B$2+ROW()-2,))-F8","v":167},{"$f":"SUMIF(данные!G$1:$V$1,M$1,INDEX(данные!G:$V,$B$2+ROW()-2,))-G8","v":252}]
[null,null,"nuznoenazvanie",{"$f":"INDEX(данные!$A:$V,$B$2+ROW()-2,$B$3+D$1)","v":0},{"$f":"INDEX(данные!$A:$V,$B$2+ROW()-2,$B$3+E$1)","v":0},{"$f":"INDEX(данные!$A:$V,$B$2+ROW()-2,$B$3+F$1)","v":0},{"$f":"INDEX(данные!$A:$V,$B$2+ROW()-2,$B$3+G$1)","v":0},null,null,{"$f":"SUMIF(данные!D$1:$V$1,J$1,INDEX(данные!D:$V,$B$2+ROW()-2,))-D9","v":218},{"$f":"SUMIF(данные!E$1:$V$1,K$1,INDEX(данные!E:$V,$B$2+ROW()-2,))-E9","v":119},{"$f":"SUMIF(данные!F$1:$V$1,L$1,INDEX(данные!F:$V,$B$2+ROW()-2,))-F9","v":168},{"$f":"SUMIF(данные!G$1:$V$1,M$1,INDEX(данные!G:$V,$B$2+ROW()-2,))-G9","v":255}]
[null,null,"nuznoenazvanie",{"$f":"INDEX(данные!$A:$V,$B$2+ROW()-2,$B$3+D$1)","v":0},{"$f":"INDEX(данные!$A:$V,$B$2+ROW()-2,$B$3+E$1)","v":0},{"$f":"INDEX(данные!$A:$V,$B$2+ROW()-2,$B$3+F$1)","v":0},{"$f":"INDEX(данные!$A:$V,$B$2+ROW()-2,$B$3+G$1)","v":0},null,null,{"$f":"SUMIF(данные!D$1:$V$1,J$1,INDEX(данные!D:$V,$B$2+ROW()-2,))-D10","v":221},{"$f":"SUMIF(данные!E$1:$V$1,K$1,INDEX(данные!E:$V,$B$2+ROW()-2,))-E10","v":120},{"$f":"SUMIF(данные!F$1:$V$1,L$1,INDEX(данные!F:$V,$B$2+ROW()-2,))-F10","v":169},{"$f":"SUMIF(данные!G$1:$V$1,M$1,INDEX(данные!G:$V,$B$2+ROW()-2,))-G10","v":258}]
[null,null,"nuznoenazvanie",{"$f":"INDEX(данные!$A:$V,$B$2+ROW()-2,$B$3+D$1)","v":0},{"$f":"INDEX(данные!$A:$V,$B$2+ROW()-2,$B$3+E$1)","v":0},{"$f":"INDEX(данные!$A:$V,$B$2+ROW()-2,$B$3+F$1)","v":0},{"$f":"INDEX(данные!$A:$V,$B$2+ROW()-2,$B$3+G$1)","v":0},null,null,{"$f":"SUMIF(данные!D$1:$V$1,J$1,INDEX(данные!D:$V,$B$2+ROW()-2,))-D11","v":224},{"$f":"SUMIF(данные!E$1:$V$1,K$1,INDEX(данные!E:$V,$B$2+ROW()-2,))-E11","v":121},{"$f":"SUMIF(данные!F$1:$V$1,L$1,INDEX(данные!F:$V,$B$2+ROW()-2,))-F11","v":170},{"$f":"SUMIF(данные!G$1:$V$1,M$1,INDEX(данные!G:$V,$B$2+ROW()-2,))-G11","v":261}]
[null,null,"nuznoenazvanie",{"$f":"INDEX(данные!$A:$V,$B$2+ROW()-2,$B$3+D$1)","v":0},{"$f":"INDEX(данные!$A:$V,$B$2+ROW()-2,$B$3+E$1)","v":0},{"$f":"INDEX(данные!$A:$V,$B$2+ROW()-2,$B$3+F$1)","v":0},{"$f":"INDEX(данные!$A:$V,$B$2+ROW()-2,$B$3+G$1)","v":0},null,null,{"$f":"SUMIF(данные!D$1:$V$1,J$1,INDEX(данные!D:$V,$B$2+ROW()-2,))-D12","v":227},{"$f":"SUMIF(данные!E$1:$V$1,K$1,INDEX(данные!E:$V,$B$2+ROW()-2,))-E12","v":122},{"$f":"SUMIF(данные!F$1:$V$1,L$1,INDEX(данные!F:$V,$B$2+ROW()-2,))-F12","v":171},{"$f":"SUMIF(данные!G$1:$V$1,M$1,INDEX(данные!G:$V,$B$2+ROW()-2,))-G12","v":264}]
[null,null,"nuznoenazvanie",{"$f":"INDEX(данные!$A:$V,$B$2+ROW()-2,$B$3+D$1)","v":0},{"$f":"INDEX(данные!$A:$V,$B$2+ROW()-2,$B$3+E$1)","v":0},{"$f":"INDEX(данные!$A:$V,$B$2+ROW()-2,$B$3+F$1)","v":0},{"$f":"INDEX(данные!$A:$V,$B$2+ROW()-2,$B$3+G$1)","v":0},null,null,{"$f":"SUMIF(данные!D$1:$V$1,J$1,INDEX(данные!D:$V,$B$2+ROW()-2,))-D13","v":230},{"$f":"SUMIF(данные!E$1:$V$1,K$1,INDEX(данные!E:$V,$B$2+ROW()-2,))-E13","v":123},{"$f":"SUMIF(данные!F$1:$V$1,L$1,INDEX(данные!F:$V,$B$2+ROW()-2,))-F13","v":172},{"$f":"SUMIF(данные!G$1:$V$1,M$1,INDEX(данные!G:$V,$B$2+ROW()-2,))-G13","v":267}]
[null,null,"nuznoenazvanie",{"$f":"INDEX(данные!$A:$V,$B$2+ROW()-2,$B$3+D$1)","v":0},{"$f":"INDEX(данные!$A:$V,$B$2+ROW()-2,$B$3+E$1)","v":0},{"$f":"INDEX(данные!$A:$V,$B$2+ROW()-2,$B$3+F$1)","v":0},{"$f":"INDEX(данные!$A:$V,$B$2+ROW()-2,$B$3+G$1)","v":0},null,null,{"$f":"SUMIF(данные!D$1:$V$1,J$1,INDEX(данные!D:$V,$B$2+ROW()-2,))-D14","v":233},{"$f":"SUMIF(данные!E$1:$V$1,K$1,INDEX(данные!E:$V,$B$2+ROW()-2,))-E14","v":124},{"$f":"SUMIF(данные!F$1:$V$1,L$1,INDEX(данные!F:$V,$B$2+ROW()-2,))-F14","v":173},{"$f":"SUMIF(данные!G$1:$V$1,M$1,INDEX(данные!G:$V,$B$2+ROW()-2,))-G14","v":270}]
[null,null,"nuznoenazvanie",{"$f":"INDEX(данные!$A:$V,$B$2+ROW()-2,$B$3+D$1)","v":0},{"$f":"INDEX(данные!$A:$V,$B$2+ROW()-2,$B$3+E$1)","v":0},{"$f":"INDEX(данные!$A:$V,$B$2+ROW()-2,$B$3+F$1)","v":0},{"$f":"INDEX(данные!$A:$V,$B$2+ROW()-2,$B$3+G$1)","v":0},null,null,{"$f":"SUMIF(данные!D$1:$V$1,J$1,INDEX(данные!D:$V,$B$2+ROW()-2,))-D15","v":236},{"$f":"SUMIF(данные!E$1:$V$1,K$1,INDEX(данные!E:$V,$B$2+ROW()-2,))-E15","v":125},{"$f":"SUMIF(данные!F$1:$V$1,L$1,INDEX(данные!F:$V,$B$2+ROW()-2,))-F15","v":174},{"$f":"SUMIF(данные!G$1:$V$1,M$1,INDEX(данные!G:$V,$B$2+ROW()-2,))-G15","v":273}]
[null,null,"nuznoenazvanie",{"$f":"INDEX(данные!$A:$V,$B$2+ROW()-2,$B$3+D$1)","v":0},{"$f":"INDEX(данные!$A:$V,$B$2+ROW()-2,$B$3+E$1)","v":0},{"$f":"INDEX(данные!$A:$V,$B$2+ROW()-2,$B$3+F$1)","v":0},{"$f":"INDEX(данные!$A:$V,$B$2+ROW()-2,$B$3+G$1)","v":0},null,null,{"$f":"SUMIF(данные!D$1:$V$1,J$1,INDEX(данные!D:$V,$B$2+ROW()-2,))-D16","v":239},{"$f":"SUMIF(данные!E$1:$V$1,K$1,INDEX(данные!E:$V,$B$2+ROW()-2,))-E16","v":126},{"$f":"SUMIF(данные!F$1:$V$1,L$1,INDEX(данные!F:$V,$B$2+ROW()-2,))-F16","v":175},{"$f":"SUMIF(данные!G$1:$V$1,M$1,INDEX(данные!G:$V,$B$2+ROW()-2,))-G16","v":276}]
[null,null,"nuznoenazvanie",{"$f":"INDEX(данные!$A:$V,$B$2+ROW()-2,$B$3+D$1)","v":0},{"$f":"INDEX(данные!$A:$V,$B$2+ROW()-2,$B$3+E$1)","v":0},{"$f":"INDEX(данные!$A:$V,$B$2+ROW()-2,$B$3+F$1)","v":0},{"$f":"INDEX(данные!$A:$V,$B$2+ROW()-2,$B$3+G$1)","v":0},null,null,{"$f":"SUMIF(данные!D$1:$V$1,J$1,INDEX(данные!D:$V,$B$2+ROW()-2,))-D17","v":242},{"$f":"SUMIF(данные!E$1:$V$1,K$1,INDEX(данные!E:$V,$B$2+ROW()-2,))-E17","v":127},{"$f":"SUMIF(данные!F$1:$V$1,L$1,INDEX(данные!F:$V,$B$2+ROW()-2,))-F17","v":176},{"$f":"SUMIF(данные!G$1:$V$1,M$1,INDEX(данные!G:$V,$B$2+ROW()-2,))-G17","v":279}]
[null,null,"nuznoenazvanie",{"$f":"INDEX(данные!$A:$V,$B$2+ROW()-2,$B$3+D$1)","v":0},{"$f":"INDEX(данные!$A:$V,$B$2+ROW()-2,$B$3+E$1)","v":0},{"$f":"INDEX(данные!$A:$V,$B$2+ROW()-2,$B$3+F$1)","v":0},{"$f":"INDEX(данные!$A:$V,$B$2+ROW()-2,$B$3+G$1)","v":0},null,null,{"$f":"SUMIF(данные!D$1:$V$1,J$1,INDEX(данные!D:$V,$B$2+ROW()-2,))-D18","v":245},{"$f":"SUMIF(данные!E$1:$V$1,K$1,INDEX(данные!E:$V,$B$2+ROW()-2,))-E18","v":128},{"$f":"SUMIF(данные!F$1:$V$1,L$1,INDEX(данные!F:$V,$B$2+ROW()-2,))-F18","v":177},{"$f":"SUMIF(данные!G$1:$V$1,M$1,INDEX(данные!G:$V,$B$2+ROW()-2,))-G18","v":282}]
[null,null,"nuznoenazvanie",{"$f":"INDEX(данные!$A:$V,$B$2+ROW()-2,$B$3+D$1)","v":0},{"$f":"INDEX(данные!$A:$V,$B$2+ROW()-2,$B$3+E$1)","v":0},{"$f":"INDEX(данные!$A:$V,$B$2+ROW()-2,$B$3+F$1)","v":0},{"$f":"INDEX(данные!$A:$V,$B$2+ROW()-2,$B$3+G$1)","v":0},null,null,{"$f":"SUMIF(данные!D$1:$V$1,J$1,INDEX(данные!D:$V,$B$2+ROW()-2,))-D19","v":248},{"$f":"SUMIF(данные!E$1:$V$1,K$1,INDEX(данные!E:$V,$B$2+ROW()-2,))-E19","v":129},{"$f":"SUMIF(данные!F$1:$V$1,L$1,INDEX(данные!F:$V,$B$2+ROW()-2,))-F19","v":178},{"$f":"SUMIF(данные!G$1:$V$1,M$1,INDEX(данные!G:$V,$B$2+ROW()-2,))-G19","v":285}]
[null,null,"nuznoenazvanie",{"$f":"INDEX(данные!$A:$V,$B$2+ROW()-2,$B$3+D$1)","v":-600},{"$f":"INDEX(данные!$A:$V,$B$2+ROW()-2,$B$3+E$1)","v":-1800},{"$f":"INDEX(данные!$A:$V,$B$2+ROW()-2,$B$3+F$1)","v":-3000},{"$f":"INDEX(данные!$A:$V,$B$2+ROW()-2,$B$3+G$1)","v":-6000},null,null,{"$f":"SUMIF(данные!D$1:$V$1,J$1,INDEX(данные!D:$V,$B$2+ROW()-2,))-D20","v":251},{"$f":"SUMIF(данные!E$1:$V$1,K$1,INDEX(данные!E:$V,$B$2+ROW()-2,))-E20","v":130},{"$f":"SUMIF(данные!F$1:$V$1,L$1,INDEX(данные!F:$V,$B$2+ROW()-2,))-F20","v":179},{"$f":"SUMIF(данные!G$1:$V$1,M$1,INDEX(данные!G:$V,$B$2+ROW()-2,))-G20","v":288}]
[null,null,"nuznoenazvanie",{"$f":"INDEX(данные!$A:$V,$B$2+ROW()-2,$B$3+D$1)","v":-600},{"$f":"INDEX(данные!$A:$V,$B$2+ROW()-2,$B$3+E$1)","v":-1800},{"$f":"INDEX(данные!$A:$V,$B$2+ROW()-2,$B$3+F$1)","v":-3000},{"$f":"INDEX(данные!$A:$V,$B$2+ROW()-2,$B$3+G$1)","v":-6000},null,null,{"$f":"SUMIF(данные!D$1:$V$1,J$1,INDEX(данные!D:$V,$B$2+ROW()-2,))-D21","v":254},{"$f":"SUMIF(данные!E$1:$V$1,K$1,INDEX(данные!E:$V,$B$2+ROW()-2,))-E21","v":131},{"$f":"SUMIF(данные!F$1:$V$1,L$1,INDEX(данные!F:$V,$B$2+ROW()-2,))-F21","v":180},{"$f":"SUMIF(данные!G$1:$V$1,M$1,INDEX(данные!G:$V,$B$2+ROW()-2,))-G21","v":291}]
[null,null,"nuznoenazvanie",{"$f":"INDEX(данные!$A:$V,$B$2+ROW()-2,$B$3+D$1)","v":-600},{"$f":"INDEX(данные!$A:$V,$B$2+ROW()-2,$B$3+E$1)","v":-1800},{"$f":"INDEX(данные!$A:$V,$B$2+ROW()-2,$B$3+F$1)","v":-3000},{"$f":"INDEX(данные!$A:$V,$B$2+ROW()-2,$B$3+G$1)","v":-6000},null,null,{"$f":"SUMIF(данные!D$1:$V$1,J$1,INDEX(данные!D:$V,$B$2+ROW()-2,))-D22","v":257},{"$f":"SUMIF(данные!E$1:$V$1,K$1,INDEX(данные!E:$V,$B$2+ROW()-2,))-E22","v":132},{"$f":"SUMIF(данные!F$1:$V$1,L$1,INDEX(данные!F:$V,$B$2+ROW()-2,))-F22","v":181},{"$f":"SUMIF(данные!G$1:$V$1,M$1,INDEX(данные!G:$V,$B$2+ROW()-2,))-G22","v":294}]
[null,null,"nuznoenazvanie",{"$f":"INDEX(данные!$A:$V,$B$2+ROW()-2,$B$3+D$1)","v":-600},{"$f":"INDEX(данные!$A:$V,$B$2+ROW()-2,$B$3+E$1)","v":-1800},{"$f":"INDEX(данные!$A:$V,$B$2+ROW()-2,$B$3+F$1)","v":-3000},{"$f":"INDEX(данные!$A:$V,$B$2+ROW()-2,$B$3+G$1)","v":-6000},null,null,{"$f":"SUMIF(данные!D$1:$V$1,J$1,INDEX(данные!D:$V,$B$2+ROW()-2,))-D23","v":260},{"$f":"SUMIF(данные!E$1:$V$1,K$1,INDEX(данные!E:$V,$B$2+ROW()-2,))-E23","v":133},{"$f":"SUMIF(данные!F$1:$V$1,L$1,INDEX(данные!F:$V,$B$2+ROW()-2,))-F23","v":182},{"$f":"SUMIF(данные!G$1:$V$1,M$1,INDEX(данные!G:$V,$B$2+ROW()-2,))-G23","v":297}]
[null,null,"nuznoenazvanie",{"$f":"INDEX(данные!$A:$V,$B$2+ROW()-2,$B$3+D$1)","v":-600},{"$f":"INDEX(данные!$A:$V,$B$2+ROW()-2,$B$3+E$1)","v":-1800},{"$f":"INDEX(данные!$A:$V,$B$2+ROW()-2,$B$3+F$1)","v":-3000},{"$f":"INDEX(данные!$A:$V,$B$2+ROW()-2,$B$3+G$1)","v":-6000},null,null,{"$f":"SUMIF(данные!D$1:$V$1,J$1,INDEX(данные!D:$V,$B$2+ROW()-2,))-D24","v":263},{"$f":"SUMIF(данные!E$1:$V$1,K$1,INDEX(данные!E:$V,$B$2+ROW()-2,))-E24","v":134},{"$f":"SUMIF(данные!F$1:$V$1,L$1,INDEX(данные!F:$V,$B$2+ROW()-2,))-F24","v":183},{"$f":"SUMIF(данные!G$1:$V$1,M$1,INDEX(данные!G:$V,$B$2+ROW()-2,))-G24","v":300}]
[null,null,"nuznoenazvanie",{"$f":"INDEX(данные!$A:$V,$B$2+ROW()-2,$B$3+D$1)","v":-600},{"$f":"INDEX(данные!$A:$V,$B$2+ROW()-2,$B$3+E$1)","v":-1800},{"$f":"INDEX(данные!$A:$V,$B$2+ROW()-2,$B$3+F$1)","v":-3000},{"$f":"INDEX(данные!$A:$V,$B$2+ROW()-2,$B$3+G$1)","v":-6000},null,null,{"$f":"SUMIF(данные!D$1:$V$1,J$1,INDEX(данные!D:$V,$B$2+ROW()-2,))-D25","v":266},{"$f":"SUMIF(данные!E$1:$V$1,K$1,INDEX(данные!E:$V,$B$2+ROW()-2,))-E25","v":135},{"$f":"SUMIF(данные!F$1:$V$1,L$1,INDEX(данные!F:$V,$B$2+ROW()-2,))-F25","v":184},{"$f":"SUMIF(данные!G$1:$V$1,M$1,INDEX(данные!G:$V,$B$2+ROW()-2,))-G25","v":303}]
[null,null,"nuznoenazvanie",{"$f":"INDEX(данные!$A:$V,$B$2+ROW()-2,$B$3+D$1)","v":-600},{"$f":"INDEX(данные!$A:$V,$B$2+ROW()-2,$B$3+E$1)","v":-1800},{"$f":"INDEX(данные!$A:$V,$B$2+ROW()-2,$B$3+F$1)","v":-3000},{"$f":"INDEX(данные!$A:$V,$B$2+ROW()-2,$B$3+G$1)","v":-6000},null,null,{"$f":"SUMIF(данные!D$1:$V$1,J$1,INDEX(данные!D:$V,$B$2+ROW()-2,))-D26","v":269},{"$f":"SUMIF(данные!E$1:$V$1,K$1,INDEX(данные!E:$V,$B$2+ROW()-2,))-E26","v":136},{"$f":"SUMIF(данные!F$1:$V$1,L$1,INDEX(данные!F:$V,$B$2+ROW()-2,))-F26","v":185},{"$f":"SUMIF(данные!G$1:$V$1,M$1,INDEX(данные!G:$V,$B$2+ROW()-2,))-G26","v":306}]
[null,null,"nuznoenazvanie",{"$f":"INDEX(данные!$A:$V,$B$2+ROW()-2,$B$3+D$1)","v":-600},{"$f":"INDEX(данные!$A:$V,$B$2+ROW()-2,$B$3+E$1)","v":-1800},{"$f":"INDEX(данные!$A:$V,$B$2+ROW()-2,$B$3+F$1)","v":-3000},{"$f":"INDEX(данные!$A:$V,$B$2+ROW()-2,$B$3+G$1)","v":-6000},null,null,{"$f":"SUMIF(данные!D$1:$V$1,J$1,INDEX(данные!D:$V,$B$2+ROW()-2,))-D27","v":272},{"$f":"SUMIF(данные!E$1:$V$1,K$1,INDEX(данные!E:$V,$B$2+ROW()-2,))-E27","v":137},{"$f":"SUMIF(данные!F$1:$V$1,L$1,INDEX(данные!F:$V,$B$2+ROW()-2,))-F27","v":186},{"$f":"SUMIF(данные!G$1:$V$1,M$1,INDEX(данные!G:$V,$B$2+ROW()-2,))-G27","v":309}]
[null,null,"nuznoenazvanie",{"$f":"INDEX(данные!$A:$V,$B$2+ROW()-2,$B$3+D$1)","v":-600},{"$f":"INDEX(данные!$A:$V,$B$2+ROW()-2,$B$3+E$1)","v":-1800},{"$f":"INDEX(данные!$A:$V,$B$2+ROW()-2,$B$3+F$1)","v":-3000},{"$f":"INDEX(данные!$A:$V,$B$2+ROW()-2,$B$3+G$1)","v":-6000},null,null,{"$f":"SUMIF(данные!D$1:$V$1,J$1,INDEX(данные!D:$V,$B$2+ROW()-2,))-D28","v":275},{"$f":"SUMIF(данные!E$1:$V$1,K$1,INDEX(данные!E:$V,$B$2+ROW()-2,))-E28","v":138},{"$f":"SUMIF(данные!F$1:$V$1,L$1,INDEX(данные!F:$V,$B$2+ROW()-2,))-F28","v":187},{"$f":"SUMIF(данные!G$1:$V$1,M$1,INDEX(данные!G:$V,$B$2+ROW()-2,))-G28","v":312}]
[null,null,"nuznoenazvanie",{"$f":"INDEX(данные!$A:$V,$B$2+ROW()-2,$B$3+D$1)","v":-600},{"$f":"INDEX(данные!$A:$V,$B$2+ROW()-2,$B$3+E$1)","v":-1800},{"$f":"INDEX(данные!$A:$V,$B$2+ROW()-2,$B$3+F$1)","v":-3000},{"$f":"INDEX(данные!$A:$V,$B$2+ROW()-2,$B$3+G$1)","v":-6000},null,null,{"$f":"SUMIF(данные!D$1:$V$1,J$1,INDEX(данные!D:$V,$B$2+ROW()-2,))-D29","v":278},{"$f":"SUMIF(данные!E$1:$V$1,K$1,INDEX(данные!E:$V,$B$2+ROW()-2,))-E29","v":139},{"$f":"SUMIF(данные!F$1:$V$1,L$1,INDEX(данные!F:$V,$B$2+ROW()-2,))-F29","v":188},{"$f":"SUMIF(данные!G$1:$V$1,M$1,INDEX(данные!G:$V,$B$2+ROW()-2,))-G29","v":315}]
[null,null,"nuznoenazvanie",{"$f":"INDEX(данные!$A:$V,$B$2+ROW()-2,$B$3+D$1)","v":-600},{"$f":"INDEX(данные!$A:$V,$B$2+ROW()-2,$B$3+E$1)","v":-1800},{"$f":"INDEX(данные!$A:$V,$B$2+ROW()-2,$B$3+F$1)","v":-3000},{"$f":"INDEX(данные!$A:$V,$B$2+ROW()-2,$B$3+G$1)","v":-6000},null,null,{"$f":"SUMIF(данные!D$1:$V$1,J$1,INDEX(данные!D:$V,$B$2+ROW()-2,))-D30","v":281},{"$f":"SUMIF(данные!E$1:$V$1,K$1,INDEX(данные!E:$V,$B$2+ROW()-2,))-E30","v":140},{"$f":"SUMIF(данные!F$1:$V$1,L$1,INDEX(данные!F:$V,$B$2+ROW()-2,))-F30","v":189},{"$f":"SUMIF(данные!G$1:$V$1,M$1,INDEX(данные!G:$V,$B$2+ROW()-2,))-G30","v":318}]
{"$rows_left_out":10}