{"text_format":"1","workbook":"xlsx","n_sheets":2,"sheets":["Лист1","Лист2"],"not_rendered":{"charts":0,"images":0,"macros":1,"external_links":0,"defined_names":2,"comments":0,"pivot_tables":0},"unopened":[],"bounds":{"document_bytes":16777216,"sheet_cells":100000,"rows_first":2000,"rows_last":500,"rows_between":2000,"halvings":0,"cell_chars":16384,"cell_head_chars":4096},"cells_cut":0,"cells_raw":0,"read":"whole","date_system":"1900"}

{"sheet":"Лист1","index":0,"n_rows":65,"n_cols":19,"rows_kept":65,"cut":false,"hidden":false,"merged":[[6,0,6,4],[6,10,6,18],[6,5,6,9]]}
[]
[null,null,null,null,null,null,null,null,null,null,null,"Расход труб, шт.",{"$f":"SUBTOTAL(9,E9:E830)/12050","v":57.008298755186722},12050,{"$f":"N2*N3*M2","v":274780},"в пересчете на кг"]
[null,null,null,null,null,null,null,null,"Формулы до 999 стороки",null,null,"Использ.",{"$f":"((SUBTOTAL(9,M9:M830)+SUBTOTAL(9,O9:O830)+SUBTOTAL(9,Q9:Q830)+SUBTOTAL(9,S9:S830)+SUBTOTAL(9,G9:G830)))/(SUBTOTAL(9,E9:E830))","v":0.94837033262974013},0.4,{"$f":"O2*M3","v":260593.19999999998}]
[null,null,null,null,null,null,null,null,null,null,null,"Отход.",{"$f":"((SUBTOTAL(9,J9:J830))/(SUBTOTAL(9,E9:E830)))","v":5.1629667370259848E-2},null,{"$f":"O2*M4","v":14186.800000000001}]
[null,null,null,null,null,null,null,null,null,null,null,"Невозвр. отх.",{"$f":"((SUBTOTAL(9,G9:G830))/(SUBTOTAL(9,E9:E830)))","v":7.0310794089817308E-4},null,{"$f":"O2*M5","v":193.2}]
[]
["Входной контроль",null,null,null,null,"Вычисляемые параметры",null,null,null,null,"Раскрой"]
["Завод","Входн.№ ПСК","Зав. №","Серт. №","Длина трубы, мм","Невозв. отх., % (вход. в исп.)","Рез, мм","Исп., %","Остаток, %","Остаток, мм","Номер раскроя","Сегмент #1","Длина сегмента, мм","Сегмент #2","Длина сегмента, мм","Сегмент #3","Длина сегмента, мм","Сегмент #4","Длина сегмента, мм"]
["ЗМЗ",501,435,601,12150,{"$f":"G9/E9","v":1.1522633744855968E-3},{"$f":"(COUNTA(L9,N9,P9,R9)*7)","v":14},{"$f":"(M9+G9+O9+Q9+S9)/E9","v":0.98880658436213997},{"$f":"J9/E9","v":1.1193415637860082E-2},{"$f":"(E9-G9)-M9-O9-Q9-S9","v":136},1,"СД2.ВС: С-17.1-1",7500,"СД2.ВС: С-1.21-1",4500]
["ЗМЗ",502,436,602,12050,5.8091286307053946E-4,7,0.99643153526970951,3.5684647302904565E-3,43,2,"СД2.ВС: С-17.1-2",12000]
["ЗМЗ",503,437,603,12050,5.8091286307053946E-4,7,0.74746887966804976,0.25253112033195019,3043,3,"СД2.ВС: С-17.1-3",9000]
[null,null,null,null,12050,1.1618257261410789E-3,14,0.99701244813278012,2.9875518672199172E-3,36,4,"СД2.ВС: С-1.1-1",4500,"СД2.ВС: С-1.2-1",7500]
[null,null,null,null,12050,5.8091286307053946E-4,7,0.99643153526970951,3.5684647302904565E-3,43,5,"СД2.ВС: С-1.1-2",12000]
[null,null,null,null,12050,5.8091286307053946E-4,7,0.99643153526970951,3.5684647302904565E-3,43,6,"СД2.ВС: С-1.1-3",12000]
[null,null,null,null,12050,5.8091286307053946E-4,7,0.99643153526970951,3.5684647302904565E-3,43,7,"СД2.ВС: С-1.2-2",12000]
[null,null,null,null,12050,5.8091286307053946E-4,7,0.74746887966804976,0.25253112033195019,3043,8,"СД2.ВС: С-1.2-3",9000]
[null,null,null,null,12050,1.1618257261410789E-3,14,0.99701244813278012,2.9875518672199172E-3,36,9,"СД2.ВС: С-1.3-1",4500,"СД2.ВС: С-1.4-1",7500]
[null,null,null,null,12050,5.8091286307053946E-4,7,0.99643153526970951,3.5684647302904565E-3,43,10,"СД2.ВС: С-1.3-2",12000]
[null,null,null,null,12050,5.8091286307053946E-4,7,0.99643153526970951,3.5684647302904565E-3,43,11,"СД2.ВС: С-1.3-3",12000]
[null,null,null,null,12050,5.8091286307053946E-4,7,0.99643153526970951,3.5684647302904565E-3,43,12,"СД2.ВС: С-1.4-2",12000]
[null,null,null,null,12050,5.8091286307053946E-4,7,0.74746887966804976,0.25253112033195019,3043,13,"СД2.ВС: С-1.4-3",9000]
[null,null,null,null,12050,1.1618257261410789E-3,14,0.99701244813278012,2.9875518672199172E-3,36,14,"СД2.ВС: С-1.5-1",4500,"СД2.ВС: С-1.6-1",7500]
[null,null,null,null,12050,5.8091286307053946E-4,7,0.99643153526970951,3.5684647302904565E-3,43,15,"СД2.ВС: С-1.5-2",12000]
[null,null,null,null,12050,5.8091286307053946E-4,7,0.99643153526970951,3.5684647302904565E-3,43,16,"СД2.ВС: С-1.5-3",12000]
[null,null,null,null,12050,5.8091286307053946E-4,7,0.99643153526970951,3.5684647302904565E-3,43,17,"СД2.ВС: С-1.6-2",12000]
[null,null,null,null,12050,5.8091286307053946E-4,7,0.74746887966804976,0.25253112033195019,3043,18,"СД2.ВС: С-1.6-3",9000]
[null,null,null,null,12050,1.1618257261410789E-3,14,0.99701244813278012,2.9875518672199172E-3,36,19,"СД2.ВС: С-1.7-1",4500,"СД2.ВС: С-1.8-1",7500]
[null,null,null,null,12050,5.8091286307053946E-4,7,0.99643153526970951,3.5684647302904565E-3,43,20,"СД2.ВС: С-1.7-2",12000]
[null,null,null,null,12050,5.8091286307053946E-4,7,0.99643153526970951,3.5684647302904565E-3,43,21,"СД2.ВС: С-1.7-3",12000]
[null,null,null,null,12050,5.8091286307053946E-4,7,0.99643153526970951,3.5684647302904565E-3,43,22,"СД2.ВС: С-1.8-2",12000]
{"$rows_left_out":36}
{"sheet":"Лист2","index":1,"n_rows":74,"n_cols":8,"rows_kept":74,"cut":false,"hidden":false,"merged":[]}
["Сегмент ","Длина сегмента, мм","Номер раскроя","Завод","Входн.№ ПСК","Зав. №","Серт. №"]
[{"$f":"INDEX(Лист1!$K$9:$R$68,H2,COUNTIFS(Лист2!$C$1:$C2,Лист2!$C2)*2)","v":"СД2.ВС: С-17.1-1"},{"$f":"INDEX(Лист1!$L$9:$S$68,H2,COUNTIFS(Лист2!$C$1:$C2,Лист2!$C2)*2)","v":7500},{"$f":"LOOKUP(ROW()-2,MMULT(TRANSPOSE(MMULT((Лист1!$L$9:$R$68<>\"\")*ISODD(COLUMN($L$8:$R$8)),{1;1;1;1;1;1;1}))*(ROW(Лист1!$L$9:$L$68)>TRANSPOSE(ROW(Лист1!$L$9:$L$68))),ROW(Лист1!$L$9:$L$68)^0),Лист1!$K$9:$K$68)","v":1},{"$f":"INDEX(Лист1!A9:A68,$H2)","v":"ЗМЗ"},{"$f":"INDEX(Лист1!B9:B68,$H2)","v":501},{"$f":"INDEX(Лист1!C9:C68,$H2)","v":435},{"$f":"INDEX(Лист1!D9:D68,$H2)","v":601},{"$f":"MATCH(Лист2!C2,Лист1!$K$9:$K$68,)","v":1}]
[{"$f":"INDEX(Лист1!$K$9:$R$68,H3,COUNTIFS(Лист2!$C$1:$C3,Лист2!$C3)*2)","v":"СД2.ВС: С-1.21-1"},{"$f":"INDEX(Лист1!$L$9:$S$68,H3,COUNTIFS(Лист2!$C$1:$C3,Лист2!$C3)*2)","v":4500},{"$f":"LOOKUP(ROW()-2,MMULT(TRANSPOSE(MMULT((Лист1!$L$9:$R$68<>\"\")*ISODD(COLUMN($L$8:$R$8)),{1;1;1;1;1;1;1}))*(ROW(Лист1!$L$9:$L$68)>TRANSPOSE(ROW(Лист1!$L$9:$L$68))),ROW(Лист1!$L$9:$L$68)^0),Лист1!$K$9:$K$68)","v":1},{"$f":"INDEX(Лист1!A10:A69,$H3)","v":"ЗМЗ"},{"$f":"INDEX(Лист1!B10:B69,$H3)","v":502},{"$f":"INDEX(Лист1!C10:C69,$H3)","v":436},{"$f":"INDEX(Лист1!D10:D69,$H3)","v":602},{"$f":"MATCH(Лист2!C3,Лист1!$K$9:$K$68,)","v":1}]
[{"$f":"INDEX(Лист1!$K$9:$R$68,H4,COUNTIFS(Лист2!$C$1:$C4,Лист2!$C4)*2)","v":"СД2.ВС: С-17.1-2"},{"$f":"INDEX(Лист1!$L$9:$S$68,H4,COUNTIFS(Лист2!$C$1:$C4,Лист2!$C4)*2)","v":12000},{"$f":"LOOKUP(ROW()-2,MMULT(TRANSPOSE(MMULT((Лист1!$L$9:$R$68<>\"\")*ISODD(COLUMN($L$8:$R$8)),{1;1;1;1;1;1;1}))*(ROW(Лист1!$L$9:$L$68)>TRANSPOSE(ROW(Лист1!$L$9:$L$68))),ROW(Лист1!$L$9:$L$68)^0),Лист1!$K$9:$K$68)","v":2},{"$f":"INDEX(Лист1!A11:A70,$H4)","v":0},{"$f":"INDEX(Лист1!B11:B70,$H4)","v":0},{"$f":"INDEX(Лист1!C11:C70,$H4)","v":0},{"$f":"INDEX(Лист1!D11:D70,$H4)","v":0},{"$f":"MATCH(Лист2!C4,Лист1!$K$9:$K$68,)","v":2}]
[{"$f":"INDEX(Лист1!$K$9:$R$68,H5,COUNTIFS(Лист2!$C$1:$C5,Лист2!$C5)*2)","v":"СД2.ВС: С-17.1-3"},{"$f":"INDEX(Лист1!$L$9:$S$68,H5,COUNTIFS(Лист2!$C$1:$C5,Лист2!$C5)*2)","v":9000},{"$f":"LOOKUP(ROW()-2,MMULT(TRANSPOSE(MMULT((Лист1!$L$9:$R$68<>\"\")*ISODD(COLUMN($L$8:$R$8)),{1;1;1;1;1;1;1}))*(ROW(Лист1!$L$9:$L$68)>TRANSPOSE(ROW(Лист1!$L$9:$L$68))),ROW(Лист1!$L$9:$L$68)^0),Лист1!$K$9:$K$68)","v":3},{"$f":"INDEX(Лист1!A12:A71,$H5)","v":0},{"$f":"INDEX(Лист1!B12:B71,$H5)","v":0},{"$f":"INDEX(Лист1!C12:C71,$H5)","v":0},{"$f":"INDEX(Лист1!D12:D71,$H5)","v":0},{"$f":"MATCH(Лист2!C5,Лист1!$K$9:$K$68,)","v":3}]
[{"$f":"INDEX(Лист1!$K$9:$R$68,H6,COUNTIFS(Лист2!$C$1:$C6,Лист2!$C6)*2)","v":"СД2.ВС: С-1.1-1"},{"$f":"INDEX(Лист1!$L$9:$S$68,H6,COUNTIFS(Лист2!$C$1:$C6,Лист2!$C6)*2)","v":4500},{"$f":"LOOKUP(ROW()-2,MMULT(TRANSPOSE(MMULT((Лист1!$L$9:$R$68<>\"\")*ISODD(COLUMN($L$8:$R$8)),{1;1;1;1;1;1;1}))*(ROW(Лист1!$L$9:$L$68)>TRANSPOSE(ROW(Лист1!$L$9:$L$68))),ROW(Лист1!$L$9:$L$68)^0),Лист1!$K$9:$K$68)","v":4},{"$f":"INDEX(Лист1!A13:A72,$H6)","v":0},{"$f":"INDEX(Лист1!B13:B72,$H6)","v":0},{"$f":"INDEX(Лист1!C13:C72,$H6)","v":0},{"$f":"INDEX(Лист1!D13:D72,$H6)","v":0},{"$f":"MATCH(Лист2!C6,Лист1!$K$9:$K$68,)","v":4}]
[{"$f":"INDEX(Лист1!$K$9:$R$68,H7,COUNTIFS(Лист2!$C$1:$C7,Лист2!$C7)*2)","v":"СД2.ВС: С-1.2-1"},{"$f":"INDEX(Лист1!$L$9:$S$68,H7,COUNTIFS(Лист2!$C$1:$C7,Лист2!$C7)*2)","v":7500},{"$f":"LOOKUP(ROW()-2,MMULT(TRANSPOSE(MMULT((Лист1!$L$9:$R$68<>\"\")*ISODD(COLUMN($L$8:$R$8)),{1;1;1;1;1;1;1}))*(ROW(Лист1!$L$9:$L$68)>TRANSPOSE(ROW(Лист1!$L$9:$L$68))),ROW(Лист1!$L$9:$L$68)^0),Лист1!$K$9:$K$68)","v":4},{"$f":"INDEX(Лист1!A14:A73,$H7)","v":0},{"$f":"INDEX(Лист1!B14:B73,$H7)","v":0},{"$f":"INDEX(Лист1!C14:C73,$H7)","v":0},{"$f":"INDEX(Лист1!D14:D73,$H7)","v":0},{"$f":"MATCH(Лист2!C7,Лист1!$K$9:$K$68,)","v":4}]
[{"$f":"INDEX(Лист1!$K$9:$R$68,H8,COUNTIFS(Лист2!$C$1:$C8,Лист2!$C8)*2)","v":"СД2.ВС: С-1.1-2"},{"$f":"INDEX(Лист1!$L$9:$S$68,H8,COUNTIFS(Лист2!$C$1:$C8,Лист2!$C8)*2)","v":12000},{"$f":"LOOKUP(ROW()-2,MMULT(TRANSPOSE(MMULT((Лист1!$L$9:$R$68<>\"\")*ISODD(COLUMN($L$8:$R$8)),{1;1;1;1;1;1;1}))*(ROW(Лист1!$L$9:$L$68)>TRANSPOSE(ROW(Лист1!$L$9:$L$68))),ROW(Лист1!$L$9:$L$68)^0),Лист1!$K$9:$K$68)","v":5},{"$f":"INDEX(Лист1!A15:A74,$H8)","v":0},{"$f":"INDEX(Лист1!B15:B74,$H8)","v":0},{"$f":"INDEX(Лист1!C15:C74,$H8)","v":0},{"$f":"INDEX(Лист1!D15:D74,$H8)","v":0},{"$f":"MATCH(Лист2!C8,Лист1!$K$9:$K$68,)","v":5}]
[{"$f":"INDEX(Лист1!$K$9:$R$68,H9,COUNTIFS(Лист2!$C$1:$C9,Лист2!$C9)*2)","v":"СД2.ВС: С-1.1-3"},{"$f":"INDEX(Лист1!$L$9:$S$68,H9,COUNTIFS(Лист2!$C$1:$C9,Лист2!$C9)*2)","v":12000},{"$f":"LOOKUP(ROW()-2,MMULT(TRANSPOSE(MMULT((Лист1!$L$9:$R$68<>\"\")*ISODD(COLUMN($L$8:$R$8)),{1;1;1;1;1;1;1}))*(ROW(Лист1!$L$9:$L$68)>TRANSPOSE(ROW(Лист1!$L$9:$L$68))),ROW(Лист1!$L$9:$L$68)^0),Лист1!$K$9:$K$68)","v":6},{"$f":"INDEX(Лист1!A16:A75,$H9)","v":0},{"$f":"INDEX(Лист1!B16:B75,$H9)","v":0},{"$f":"INDEX(Лист1!C16:C75,$H9)","v":0},{"$f":"INDEX(Лист1!D16:D75,$H9)","v":0},{"$f":"MATCH(Лист2!C9,Лист1!$K$9:$K$68,)","v":6}]
[{"$f":"INDEX(Лист1!$K$9:$R$68,H10,COUNTIFS(Лист2!$C$1:$C10,Лист2!$C10)*2)","v":"СД2.ВС: С-1.2-2"},{"$f":"INDEX(Лист1!$L$9:$S$68,H10,COUNTIFS(Лист2!$C$1:$C10,Лист2!$C10)*2)","v":12000},{"$f":"LOOKUP(ROW()-2,MMULT(TRANSPOSE(MMULT((Лист1!$L$9:$R$68<>\"\")*ISODD(COLUMN($L$8:$R$8)),{1;1;1;1;1;1;1}))*(ROW(Лист1!$L$9:$L$68)>TRANSPOSE(ROW(Лист1!$L$9:$L$68))),ROW(Лист1!$L$9:$L$68)^0),Лист1!$K$9:$K$68)","v":7},{"$f":"INDEX(Лист1!A17:A76,$H10)","v":0},{"$f":"INDEX(Лист1!B17:B76,$H10)","v":0},{"$f":"INDEX(Лист1!C17:C76,$H10)","v":0},{"$f":"INDEX(Лист1!D17:D76,$H10)","v":0},{"$f":"MATCH(Лист2!C10,Лист1!$K$9:$K$68,)","v":7}]
[{"$f":"INDEX(Лист1!$K$9:$R$68,H11,COUNTIFS(Лист2!$C$1:$C11,Лист2!$C11)*2)","v":"СД2.ВС: С-1.2-3"},{"$f":"INDEX(Лист1!$L$9:$S$68,H11,COUNTIFS(Лист2!$C$1:$C11,Лист2!$C11)*2)","v":9000},{"$f":"LOOKUP(ROW()-2,MMULT(TRANSPOSE(MMULT((Лист1!$L$9:$R$68<>\"\")*ISODD(COLUMN($L$8:$R$8)),{1;1;1;1;1;1;1}))*(ROW(Лист1!$L$9:$L$68)>TRANSPOSE(ROW(Лист1!$L$9:$L$68))),ROW(Лист1!$L$9:$L$68)^0),Лист1!$K$9:$K$68)","v":8},{"$f":"INDEX(Лист1!A18:A77,$H11)","v":0},{"$f":"INDEX(Лист1!B18:B77,$H11)","v":0},{"$f":"INDEX(Лист1!C18:C77,$H11)","v":0},{"$f":"INDEX(Лист1!D18:D77,$H11)","v":0},{"$f":"MATCH(Лист2!C11,Лист1!$K$9:$K$68,)","v":8}]
[{"$f":"INDEX(Лист1!$K$9:$R$68,H12,COUNTIFS(Лист2!$C$1:$C12,Лист2!$C12)*2)","v":"СД2.ВС: С-1.3-1"},{"$f":"INDEX(Лист1!$L$9:$S$68,H12,COUNTIFS(Лист2!$C$1:$C12,Лист2!$C12)*2)","v":4500},{"$f":"LOOKUP(ROW()-2,MMULT(TRANSPOSE(MMULT((Лист1!$L$9:$R$68<>\"\")*ISODD(COLUMN($L$8:$R$8)),{1;1;1;1;1;1;1}))*(ROW(Лист1!$L$9:$L$68)>TRANSPOSE(ROW(Лист1!$L$9:$L$68))),ROW(Лист1!$L$9:$L$68)^0),Лист1!$K$9:$K$68)","v":9},{"$f":"INDEX(Лист1!A19:A78,$H12)","v":0},{"$f":"INDEX(Лист1!B19:B78,$H12)","v":0},{"$f":"INDEX(Лист1!C19:C78,$H12)","v":0},{"$f":"INDEX(Лист1!D19:D78,$H12)","v":0},{"$f":"MATCH(Лист2!C12,Лист1!$K$9:$K$68,)","v":9}]
[{"$f":"INDEX(Лист1!$K$9:$R$68,H13,COUNTIFS(Лист2!$C$1:$C13,Лист2!$C13)*2)","v":"СД2.ВС: С-1.4-1"},{"$f":"INDEX(Лист1!$L$9:$S$68,H13,COUNTIFS(Лист2!$C$1:$C13,Лист2!$C13)*2)","v":7500},{"$f":"LOOKUP(ROW()-2,MMULT(TRANSPOSE(MMULT((Лист1!$L$9:$R$68<>\"\")*ISODD(COLUMN($L$8:$R$8)),{1;1;1;1;1;1;1}))*(ROW(Лист1!$L$9:$L$68)>TRANSPOSE(ROW(Лист1!$L$9:$L$68))),ROW(Лист1!$L$9:$L$68)^0),Лист1!$K$9:$K$68)","v":9},{"$f":"INDEX(Лист1!A20:A79,$H13)","v":0},{"$f":"INDEX(Лист1!B20:B79,$H13)","v":0},{"$f":"INDEX(Лист1!C20:C79,$H13)","v":0},{"$f":"INDEX(Лист1!D20:D79,$H13)","v":0},{"$f":"MATCH(Лист2!C13,Лист1!$K$9:$K$68,)","v":9}]
[{"$f":"INDEX(Лист1!$K$9:$R$68,H14,COUNTIFS(Лист2!$C$1:$C14,Лист2!$C14)*2)","v":"СД2.ВС: С-1.3-2"},{"$f":"INDEX(Лист1!$L$9:$S$68,H14,COUNTIFS(Лист2!$C$1:$C14,Лист2!$C14)*2)","v":12000},{"$f":"LOOKUP(ROW()-2,MMULT(TRANSPOSE(MMULT((Лист1!$L$9:$R$68<>\"\")*ISODD(COLUMN($L$8:$R$8)),{1;1;1;1;1;1;1}))*(ROW(Лист1!$L$9:$L$68)>TRANSPOSE(ROW(Лист1!$L$9:$L$68))),ROW(Лист1!$L$9:$L$68)^0),Лист1!$K$9:$K$68)","v":10},{"$f":"INDEX(Лист1!A21:A80,$H14)","v":0},{"$f":"INDEX(Лист1!B21:B80,$H14)","v":0},{"$f":"INDEX(Лист1!C21:C80,$H14)","v":0},{"$f":"INDEX(Лист1!D21:D80,$H14)","v":0},{"$f":"MATCH(Лист2!C14,Лист1!$K$9:$K$68,)","v":10}]
[{"$f":"INDEX(Лист1!$K$9:$R$68,H15,COUNTIFS(Лист2!$C$1:$C15,Лист2!$C15)*2)","v":"СД2.ВС: С-1.3-3"},{"$f":"INDEX(Лист1!$L$9:$S$68,H15,COUNTIFS(Лист2!$C$1:$C15,Лист2!$C15)*2)","v":12000},{"$f":"LOOKUP(ROW()-2,MMULT(TRANSPOSE(MMULT((Лист1!$L$9:$R$68<>\"\")*ISODD(COLUMN($L$8:$R$8)),{1;1;1;1;1;1;1}))*(ROW(Лист1!$L$9:$L$68)>TRANSPOSE(ROW(Лист1!$L$9:$L$68))),ROW(Лист1!$L$9:$L$68)^0),Лист1!$K$9:$K$68)","v":11},{"$f":"INDEX(Лист1!A22:A81,$H15)","v":0},{"$f":"INDEX(Лист1!B22:B81,$H15)","v":0},{"$f":"INDEX(Лист1!C22:C81,$H15)","v":0},{"$f":"INDEX(Лист1!D22:D81,$H15)","v":0},{"$f":"MATCH(Лист2!C15,Лист1!$K$9:$K$68,)","v":11}]
[{"$f":"INDEX(Лист1!$K$9:$R$68,H16,COUNTIFS(Лист2!$C$1:$C16,Лист2!$C16)*2)","v":"СД2.ВС: С-1.4-2"},{"$f":"INDEX(Лист1!$L$9:$S$68,H16,COUNTIFS(Лист2!$C$1:$C16,Лист2!$C16)*2)","v":12000},{"$f":"LOOKUP(ROW()-2,MMULT(TRANSPOSE(MMULT((Лист1!$L$9:$R$68<>\"\")*ISODD(COLUMN($L$8:$R$8)),{1;1;1;1;1;1;1}))*(ROW(Лист1!$L$9:$L$68)>TRANSPOSE(ROW(Лист1!$L$9:$L$68))),ROW(Лист1!$L$9:$L$68)^0),Лист1!$K$9:$K$68)","v":12},{"$f":"INDEX(Лист1!A23:A82,$H16)","v":0},{"$f":"INDEX(Лист1!B23:B82,$H16)","v":0},{"$f":"INDEX(Лист1!C23:C82,$H16)","v":0},{"$f":"INDEX(Лист1!D23:D82,$H16)","v":0},{"$f":"MATCH(Лист2!C16,Лист1!$K$9:$K$68,)","v":12}]
[{"$f":"INDEX(Лист1!$K$9:$R$68,H17,COUNTIFS(Лист2!$C$1:$C17,Лист2!$C17)*2)","v":"СД2.ВС: С-1.4-3"},{"$f":"INDEX(Лист1!$L$9:$S$68,H17,COUNTIFS(Лист2!$C$1:$C17,Лист2!$C17)*2)","v":9000},{"$f":"LOOKUP(ROW()-2,MMULT(TRANSPOSE(MMULT((Лист1!$L$9:$R$68<>\"\")*ISODD(COLUMN($L$8:$R$8)),{1;1;1;1;1;1;1}))*(ROW(Лист1!$L$9:$L$68)>TRANSPOSE(ROW(Лист1!$L$9:$L$68))),ROW(Лист1!$L$9:$L$68)^0),Лист1!$K$9:$K$68)","v":13},{"$f":"INDEX(Лист1!A24:A83,$H17)","v":0},{"$f":"INDEX(Лист1!B24:B83,$H17)","v":0},{"$f":"INDEX(Лист1!C24:C83,$H17)","v":0},{"$f":"INDEX(Лист1!D24:D83,$H17)","v":0},{"$f":"MATCH(Лист2!C17,Лист1!$K$9:$K$68,)","v":13}]
[{"$f":"INDEX(Лист1!$K$9:$R$68,H18,COUNTIFS(Лист2!$C$1:$C18,Лист2!$C18)*2)","v":"СД2.ВС: С-1.5-1"},{"$f":"INDEX(Лист1!$L$9:$S$68,H18,COUNTIFS(Лист2!$C$1:$C18,Лист2!$C18)*2)","v":4500},{"$f":"LOOKUP(ROW()-2,MMULT(TRANSPOSE(MMULT((Лист1!$L$9:$R$68<>\"\")*ISODD(COLUMN($L$8:$R$8)),{1;1;1;1;1;1;1}))*(ROW(Лист1!$L$9:$L$68)>TRANSPOSE(ROW(Лист1!$L$9:$L$68))),ROW(Лист1!$L$9:$L$68)^0),Лист1!$K$9:$K$68)","v":14},{"$f":"INDEX(Лист1!A25:A84,$H18)","v":0},{"$f":"INDEX(Лист1!B25:B84,$H18)","v":0},{"$f":"INDEX(Лист1!C25:C84,$H18)","v":0},{"$f":"INDEX(Лист1!D25:D84,$H18)","v":0},{"$f":"MATCH(Лист2!C18,Лист1!$K$9:$K$68,)","v":14}]
[{"$f":"INDEX(Лист1!$K$9:$R$68,H19,COUNTIFS(Лист2!$C$1:$C19,Лист2!$C19)*2)","v":"СД2.ВС: С-1.6-1"},{"$f":"INDEX(Лист1!$L$9:$S$68,H19,COUNTIFS(Лист2!$C$1:$C19,Лист2!$C19)*2)","v":7500},{"$f":"LOOKUP(ROW()-2,MMULT(TRANSPOSE(MMULT((Лист1!$L$9:$R$68<>\"\")*ISODD(COLUMN($L$8:$R$8)),{1;1;1;1;1;1;1}))*(ROW(Лист1!$L$9:$L$68)>TRANSPOSE(ROW(Лист1!$L$9:$L$68))),ROW(Лист1!$L$9:$L$68)^0),Лист1!$K$9:$K$68)","v":14},{"$f":"INDEX(Лист1!A26:A85,$H19)","v":0},{"$f":"INDEX(Лист1!B26:B85,$H19)","v":0},{"$f":"INDEX(Лист1!C26:C85,$H19)","v":0},{"$f":"INDEX(Лист1!D26:D85,$H19)","v":0},{"$f":"MATCH(Лист2!C19,Лист1!$K$9:$K$68,)","v":14}]
[{"$f":"INDEX(Лист1!$K$9:$R$68,H20,COUNTIFS(Лист2!$C$1:$C20,Лист2!$C20)*2)","v":"СД2.ВС: С-1.5-2"},{"$f":"INDEX(Лист1!$L$9:$S$68,H20,COUNTIFS(Лист2!$C$1:$C20,Лист2!$C20)*2)","v":12000},{"$f":"LOOKUP(ROW()-2,MMULT(TRANSPOSE(MMULT((Лист1!$L$9:$R$68<>\"\")*ISODD(COLUMN($L$8:$R$8)),{1;1;1;1;1;1;1}))*(ROW(Лист1!$L$9:$L$68)>TRANSPOSE(ROW(Лист1!$L$9:$L$68))),ROW(Лист1!$L$9:$L$68)^0),Лист1!$K$9:$K$68)","v":15},{"$f":"INDEX(Лист1!A27:A86,$H20)","v":0},{"$f":"INDEX(Лист1!B27:B86,$H20)","v":0},{"$f":"INDEX(Лист1!C27:C86,$H20)","v":0},{"$f":"INDEX(Лист1!D27:D86,$H20)","v":0},{"$f":"MATCH(Лист2!C20,Лист1!$K$9:$K$68,)","v":15}]
[{"$f":"INDEX(Лист1!$K$9:$R$68,H21,COUNTIFS(Лист2!$C$1:$C21,Лист2!$C21)*2)","v":"СД2.ВС: С-1.5-3"},{"$f":"INDEX(Лист1!$L$9:$S$68,H21,COUNTIFS(Лист2!$C$1:$C21,Лист2!$C21)*2)","v":12000},{"$f":"LOOKUP(ROW()-2,MMULT(TRANSPOSE(MMULT((Лист1!$L$9:$R$68<>\"\")*ISODD(COLUMN($L$8:$R$8)),{1;1;1;1;1;1;1}))*(ROW(Лист1!$L$9:$L$68)>TRANSPOSE(ROW(Лист1!$L$9:$L$68))),ROW(Лист1!$L$9:$L$68)^0),Лист1!$K$9:$K$68)","v":16},{"$f":"INDEX(Лист1!A28:A87,$H21)","v":0},{"$f":"INDEX(Лист1!B28:B87,$H21)","v":0},{"$f":"INDEX(Лист1!C28:C87,$H21)","v":0},{"$f":"INDEX(Лист1!D28:D87,$H21)","v":0},{"$f":"MATCH(Лист2!C21,Лист1!$K$9:$K$68,)","v":16}]
[{"$f":"INDEX(Лист1!$K$9:$R$68,H22,COUNTIFS(Лист2!$C$1:$C22,Лист2!$C22)*2)","v":"СД2.ВС: С-1.6-2"},{"$f":"INDEX(Лист1!$L$9:$S$68,H22,COUNTIFS(Лист2!$C$1:$C22,Лист2!$C22)*2)","v":12000},{"$f":"LOOKUP(ROW()-2,MMULT(TRANSPOSE(MMULT((Лист1!$L$9:$R$68<>\"\")*ISODD(COLUMN($L$8:$R$8)),{1;1;1;1;1;1;1}))*(ROW(Лист1!$L$9:$L$68)>TRANSPOSE(ROW(Лист1!$L$9:$L$68))),ROW(Лист1!$L$9:$L$68)^0),Лист1!$K$9:$K$68)","v":17},{"$f":"INDEX(Лист1!A29:A88,$H22)","v":0},{"$f":"INDEX(Лист1!B29:B88,$H22)","v":0},{"$f":"INDEX(Лист1!C29:C88,$H22)","v":0},{"$f":"INDEX(Лист1!D29:D88,$H22)","v":0},{"$f":"MATCH(Лист2!C22,Лист1!$K$9:$K$68,)","v":17}]
[{"$f":"INDEX(Лист1!$K$9:$R$68,H23,COUNTIFS(Лист2!$C$1:$C23,Лист2!$C23)*2)","v":"СД2.ВС: С-1.6-3"},{"$f":"INDEX(Лист1!$L$9:$S$68,H23,COUNTIFS(Лист2!$C$1:$C23,Лист2!$C23)*2)","v":9000},{"$f":"LOOKUP(ROW()-2,MMULT(TRANSPOSE(MMULT((Лист1!$L$9:$R$68<>\"\")*ISODD(COLUMN($L$8:$R$8)),{1;1;1;1;1;1;1}))*(ROW(Лист1!$L$9:$L$68)>TRANSPOSE(ROW(Лист1!$L$9:$L$68))),ROW(Лист1!$L$9:$L$68)^0),Лист1!$K$9:$K$68)","v":18},{"$f":"INDEX(Лист1!A30:A89,$H23)","v":0},{"$f":"INDEX(Лист1!B30:B89,$H23)","v":0},{"$f":"INDEX(Лист1!C30:C89,$H23)","v":0},{"$f":"INDEX(Лист1!D30:D89,$H23)","v":0},{"$f":"MATCH(Лист2!C23,Лист1!$K$9:$K$68,)","v":18}]
[{"$f":"INDEX(Лист1!$K$9:$R$68,H24,COUNTIFS(Лист2!$C$1:$C24,Лист2!$C24)*2)","v":"СД2.ВС: С-1.7-1"},{"$f":"INDEX(Лист1!$L$9:$S$68,H24,COUNTIFS(Лист2!$C$1:$C24,Лист2!$C24)*2)","v":4500},{"$f":"LOOKUP(ROW()-2,MMULT(TRANSPOSE(MMULT((Лист1!$L$9:$R$68<>\"\")*ISODD(COLUMN($L$8:$R$8)),{1;1;1;1;1;1;1}))*(ROW(Лист1!$L$9:$L$68)>TRANSPOSE(ROW(Лист1!$L$9:$L$68))),ROW(Лист1!$L$9:$L$68)^0),Лист1!$K$9:$K$68)","v":19},{"$f":"INDEX(Лист1!A31:A90,$H24)","v":0},{"$f":"INDEX(Лист1!B31:B90,$H24)","v":0},{"$f":"INDEX(Лист1!C31:C90,$H24)","v":0},{"$f":"INDEX(Лист1!D31:D90,$H24)","v":0},{"$f":"MATCH(Лист2!C24,Лист1!$K$9:$K$68,)","v":19}]
[{"$f":"INDEX(Лист1!$K$9:$R$68,H25,COUNTIFS(Лист2!$C$1:$C25,Лист2!$C25)*2)","v":"СД2.ВС: С-1.8-1"},{"$f":"INDEX(Лист1!$L$9:$S$68,H25,COUNTIFS(Лист2!$C$1:$C25,Лист2!$C25)*2)","v":7500},{"$f":"LOOKUP(ROW()-2,MMULT(TRANSPOSE(MMULT((Лист1!$L$9:$R$68<>\"\")*ISODD(COLUMN($L$8:$R$8)),{1;1;1;1;1;1;1}))*(ROW(Лист1!$L$9:$L$68)>TRANSPOSE(ROW(Лист1!$L$9:$L$68))),ROW(Лист1!$L$9:$L$68)^0),Лист1!$K$9:$K$68)","v":19},{"$f":"INDEX(Лист1!A32:A91,$H25)","v":0},{"$f":"INDEX(Лист1!B32:B91,$H25)","v":0},{"$f":"INDEX(Лист1!C32:C91,$H25)","v":0},{"$f":"INDEX(Лист1!D32:D91,$H25)","v":0},{"$f":"MATCH(Лист2!C25,Лист1!$K$9:$K$68,)","v":19}]
[{"$f":"INDEX(Лист1!$K$9:$R$68,H26,COUNTIFS(Лист2!$C$1:$C26,Лист2!$C26)*2)","v":"СД2.ВС: С-1.7-2"},{"$f":"INDEX(Лист1!$L$9:$S$68,H26,COUNTIFS(Лист2!$C$1:$C26,Лист2!$C26)*2)","v":12000},{"$f":"LOOKUP(ROW()-2,MMULT(TRANSPOSE(MMULT((Лист1!$L$9:$R$68<>\"\")*ISODD(COLUMN($L$8:$R$8)),{1;1;1;1;1;1;1}))*(ROW(Лист1!$L$9:$L$68)>TRANSPOSE(ROW(Лист1!$L$9:$L$68))),ROW(Лист1!$L$9:$L$68)^0),Лист1!$K$9:$K$68)","v":20},{"$f":"INDEX(Лист1!A33:A92,$H26)","v":0},{"$f":"INDEX(Лист1!B33:B92,$H26)","v":0},{"$f":"INDEX(Лист1!C33:C92,$H26)","v":0},{"$f":"INDEX(Лист1!D33:D92,$H26)","v":0},{"$f":"MATCH(Лист2!C26,Лист1!$K$9:$K$68,)","v":20}]
[{"$f":"INDEX(Лист1!$K$9:$R$68,H27,COUNTIFS(Лист2!$C$1:$C27,Лист2!$C27)*2)","v":"СД2.ВС: С-1.7-3"},{"$f":"INDEX(Лист1!$L$9:$S$68,H27,COUNTIFS(Лист2!$C$1:$C27,Лист2!$C27)*2)","v":12000},{"$f":"LOOKUP(ROW()-2,MMULT(TRANSPOSE(MMULT((Лист1!$L$9:$R$68<>\"\")*ISODD(COLUMN($L$8:$R$8)),{1;1;1;1;1;1;1}))*(ROW(Лист1!$L$9:$L$68)>TRANSPOSE(ROW(Лист1!$L$9:$L$68))),ROW(Лист1!$L$9:$L$68)^0),Лист1!$K$9:$K$68)","v":21},{"$f":"INDEX(Лист1!A34:A93,$H27)","v":0},{"$f":"INDEX(Лист1!B34:B93,$H27)","v":0},{"$f":"INDEX(Лист1!C34:C93,$H27)","v":0},{"$f":"INDEX(Лист1!D34:D93,$H27)","v":0},{"$f":"MATCH(Лист2!C27,Лист1!$K$9:$K$68,)","v":21}]
[{"$f":"INDEX(Лист1!$K$9:$R$68,H28,COUNTIFS(Лист2!$C$1:$C28,Лист2!$C28)*2)","v":"СД2.ВС: С-1.8-2"},{"$f":"INDEX(Лист1!$L$9:$S$68,H28,COUNTIFS(Лист2!$C$1:$C28,Лист2!$C28)*2)","v":12000},{"$f":"LOOKUP(ROW()-2,MMULT(TRANSPOSE(MMULT((Лист1!$L$9:$R$68<>\"\")*ISODD(COLUMN($L$8:$R$8)),{1;1;1;1;1;1;1}))*(ROW(Лист1!$L$9:$L$68)>TRANSPOSE(ROW(Лист1!$L$9:$L$68))),ROW(Лист1!$L$9:$L$68)^0),Лист1!$K$9:$K$68)","v":22},{"$f":"INDEX(Лист1!A35:A94,$H28)","v":0},{"$f":"INDEX(Лист1!B35:B94,$H28)","v":0},{"$f":"INDEX(Лист1!C35:C94,$H28)","v":0},{"$f":"INDEX(Лист1!D35:D94,$H28)","v":0},{"$f":"MATCH(Лист2!C28,Лист1!$K$9:$K$68,)","v":22}]
[{"$f":"INDEX(Лист1!$K$9:$R$68,H29,COUNTIFS(Лист2!$C$1:$C29,Лист2!$C29)*2)","v":"СД2.ВС: С-1.8-3"},{"$f":"INDEX(Лист1!$L$9:$S$68,H29,COUNTIFS(Лист2!$C$1:$C29,Лист2!$C29)*2)","v":9000},{"$f":"LOOKUP(ROW()-2,MMULT(TRANSPOSE(MMULT((Лист1!$L$9:$R$68<>\"\")*ISODD(COLUMN($L$8:$R$8)),{1;1;1;1;1;1;1}))*(ROW(Лист1!$L$9:$L$68)>TRANSPOSE(ROW(Лист1!$L$9:$L$68))),ROW(Лист1!$L$9:$L$68)^0),Лист1!$K$9:$K$68)","v":23},{"$f":"INDEX(Лист1!A36:A95,$H29)","v":0},{"$f":"INDEX(Лист1!B36:B95,$H29)","v":0},{"$f":"INDEX(Лист1!C36:C95,$H29)","v":0},{"$f":"INDEX(Лист1!D36:D95,$H29)","v":0},{"$f":"MATCH(Лист2!C29,Лист1!$K$9:$K$68,)","v":23}]
[{"$f":"INDEX(Лист1!$K$9:$R$68,H30,COUNTIFS(Лист2!$C$1:$C30,Лист2!$C30)*2)","v":"СД2.ВС: С-1.9-1"},{"$f":"INDEX(Лист1!$L$9:$S$68,H30,COUNTIFS(Лист2!$C$1:$C30,Лист2!$C30)*2)","v":4500},{"$f":"LOOKUP(ROW()-2,MMULT(TRANSPOSE(MMULT((Лист1!$L$9:$R$68<>\"\")*ISODD(COLUMN($L$8:$R$8)),{1;1;1;1;1;1;1}))*(ROW(Лист1!$L$9:$L$68)>TRANSPOSE(ROW(Лист1!$L$9:$L$68))),ROW(Лист1!$L$9:$L$68)^0),Лист1!$K$9:$K$68)","v":24},{"$f":"INDEX(Лист1!A37:A96,$H30)","v":0},{"$f":"INDEX(Лист1!B37:B96,$H30)","v":0},{"$f":"INDEX(Лист1!C37:C96,$H30)","v":0},{"$f":"INDEX(Лист1!D37:D96,$H30)","v":0},{"$f":"MATCH(Лист2!C30,Лист1!$K$9:$K$68,)","v":24}]
{"$rows_left_out":44}