{"text_format":"1","workbook":"xlsx","n_sheets":4,"sheets":["Калькулятор","Прайс","Основания","Стулья"],"not_rendered":{"charts":0,"images":2,"macros":1,"external_links":0,"defined_names":39,"comments":0,"pivot_tables":0},"unopened":[],"bounds":{"document_bytes":16777216,"sheet_cells":100000,"rows_first":2000,"rows_last":500,"rows_between":2000,"halvings":0,"cell_chars":16384,"cell_head_chars":4096},"cells_cut":0,"cells_raw":0,"read":"whole","date_system":"1900"}

{"sheet":"Калькулятор","index":0,"n_rows":29,"n_cols":8,"rows_kept":29,"cut":false,"hidden":false,"merged":[]}
[]
[null,null,"КАЛЬКУЛЯТОР для рассчета стоимости продукции "]
[]
[null,"Арт. в ИТМ","Столешница","Цена за м2","Кол-во","Площадь, м2","Цена"]
[null,{"$f":"INDEX(Прайс!A2:A17,C5)","v":"001-410"},1,{"$f":"INDEX(столешницы,C5,4)","v":16920},1,{"$f":"D7*E7*E5","v":2},{"$f":"D5*F5","v":33840}]
[null,null,null,"Ширина, м.","Глубина, м."]
[null,null,null,1,2]
[null,null,"Добавить механизм раздвижения стола?","Цена за комп.",null,null,"Цена"]
[null,{"$f":"IF(C9=TRUE,Прайс!A19,\"\")","v":""},false,{"$f":"IFERROR(VLOOKUP(B9,Прайс!A19:D19,4),\"0\")","v":"0"},null,null,{"$f":"D9","v":"0"}]
[null,null,"Основание стола","Цена за комп.","Кол-во",null,"Цена"]
[null,{"$f":"IFERROR(INDEX(Прайс!$A$21:$A$206,MATCH(C11,Прайс!$B$21:$B$206,0)),\"\")","v":""},"",{"$f":"SUMIF(Прайс!$B$1:B600,C11,Прайс!$D$1:D600)","v":0},1,null,{"$f":"D11*E11","v":0}]
[null,null,"Табуреты","Цена за шт.","Кол-во",null,""]
[null,{"$f":"IFERROR(INDEX(Прайс!$A$321:$A$362,MATCH(C13,Прайс!$B$321:$B$362,0)),\"\")","v":""},"",{"$f":"SUMIF(Прайс!$B$1:B600,C13,Прайс!$D$1:D600)","v":0},1,null,{"$f":"D13*E13","v":0}]
[null,null,"Стулья","Цена за шт.","Кол-во",null,"Цена"]
[null,{"$f":"IFERROR(INDEX(Прайс!$A$207:$A$306,MATCH(C15,Прайс!$B$207:$B$306,0)),\"\")","v":""},"",{"$f":"SUMIF(Прайс!$B$1:B600,C15,Прайс!$D$1:D600)","v":0},1,null,{"$f":"D15*E15","v":0}]
[null,null,"Кресла","Цена за шт.","Кол-во",null,"Цена"]
[null,{"$f":"IFERROR(INDEX(Прайс!$A$308:$A$319,MATCH(C17,Прайс!$B$308:$B$319,0)),\"\")","v":""},"",{"$f":"SUMIF(Прайс!$B$1:B600,C17,Прайс!$D$1:D600)","v":0},1,null,{"$f":"D17*E17","v":0}]
[null,null,"Диваны","Цена за шт.","Кол-во",null,"Цена"]
[null,{"$f":"IFERROR(INDEX(Прайс!$A$398:$A$423,MATCH(C19,Прайс!$B$398:$B$423,0)),\"\")","v":""},"",{"$f":"SUMIF(Прайс!$B$1:B600,C19,Прайс!$D$1:D600)","v":0},1,null,{"$f":"D19*E19","v":0}]
[null,null,"Барные стулья и тубареты","Цена за шт.","Кол-во",null,"Цена"]
[null,{"$f":"IFERROR(INDEX(Прайс!$A$364:$A$396,MATCH(C21,Прайс!$B$364:$B$396,0)),\"\")","v":""},"",{"$f":"SUMIF(Прайс!$B$1:B600,C21,Прайс!$D$1:D600)","v":0},1,null,{"$f":"D21*E21","v":0}]
[null,null,"Разное","Цена за шт.","Кол-во",null,"Цена"]
[null,{"$f":"IFERROR(INDEX(Прайс!$A$425:$A$517,MATCH(C23,Прайс!$B$425:$B$517,0)),\"\")","v":""},"",{"$f":"SUMIF(Прайс!$B$1:B600,C23,Прайс!$D$1:D600)","v":0},1,null,{"$f":"D23*E23","v":0}]
[null,null,"Разное","Цена за шт.","Кол-во",null,"Цена"]
[null,{"$f":"IFERROR(INDEX(Прайс!$A$425:$A$517,MATCH(C25,Прайс!$B$425:$B$517,0)),\"\")","v":""},"",{"$f":"SUMIF(Прайс!$B$1:B600,C25,Прайс!$D$1:D600)","v":0},1,null,{"$f":"D25*E25","v":0}]
[null,null,"Разное","Цена за шт.","Кол-во",null,"Цена"]
[null,{"$f":"IFERROR(INDEX(Прайс!$A$425:$A$517,MATCH(C27,Прайс!$B$425:$B$517,0)),\"\")","v":""},"",{"$f":"SUMIF(Прайс!$B$1:B600,C27,Прайс!$D$1:D600)","v":0},1,null,{"$f":"D27*E27","v":0}]
[]
[null,null,null,null,null,"Итоговая стоимость комплекта мебели",{"$f":"G5+G9+G11+G13+G15+G17+G19+G21+G23+G25+G27","v":33840},"руб"]

{"sheet":"Прайс","index":1,"n_rows":517,"n_cols":7,"rows_kept":517,"cut":false,"hidden":false,"merged":[]}
["Арт. в ИТМ","Наименование","Ед. изм","Розничная цена"]
["001-410","Столешница массив 40мм, БУК, без патины","м2",16920]
["001-410п","Столешница массив 40мм, БУК, патина","м2",18274]
["001-411","Столешница массив 40мм, БУК, с окантовкой, без патины","м2",20304]
["001-411п","Столешница массив 40мм, БУК, с окантовкой, патина","м2",21928]
["001-610","Столешница массив 60мм, БУК, без патины","м2",21996]
["001-610п","Столешница массив 60мм, БУК, патина","м2",23756]
["001-810","Столешница массив 80мм, БУК, без патины","м2",27072]
["001-810п","Столешница массив 80мм, БУК, патина","м2",29238]
["001-420","Столешница массив 40мм, СОСНА, без патины","м2",14100]
["001-420п","Столешница массив 40мм, СОСНА, патина","м2",15228]
["001-620","Столешница массив 60мм, СОСНА, без патины","м2",18330,null,null,""]
["001-620п","Столешница массив 60мм, СОСНА, патина","м2",19796]
["001-820","Столешница массив 80мм, СОСНА, без патины","м2",22560]
["001-820п","Столешница массив 80мм, СОСНА, патина","м2",24365]
["001-230","Столешница 22мм, МДФ, без патины","м2",12086]
["001-230п","Столешница 22мм, МДФ, патина","м2",13053]
[]
["002-140","Раздвижной механизм стола, металл","компл.",3960]
[]
["003-110","Основание стола БОГЕМА, Бг1, бук, без патины","компл.",52173]
["003-110п","Основание стола БОГЕМА, Бг1, бук, патина","компл.",56347]
["003-210","Основание стола БОГЕМА, Бг2, бук, без патины","компл.",59433]
["003-210п","Основание стола БОГЕМА, Бг2, бук, патина","компл.",64188]
["003-310","Основание стола БОГЕМА, Бг3, бук, без патины","компл.",53845]
["003-310п","Основание стола БОГЕМА, Бг3, бук, патина","компл.",58153]
["004-110","Основание стола ВИЗИТ, Вз1, бук, без патины","компл.",25832]
["004-110п","Основание стола ВИЗИТ, Вз1, бук, патина","компл.",27899]
["004-111","Основание стола ВИЗИТ, Вз1, бук, более 150х80см, без патины","компл.",33582]
["004-111п","Основание стола ВИЗИТ, Вз1, бук, более 150х80см, патина","компл.",36268]
{"$rows_left_out":488}
{"sheet":"Основания","index":2,"n_rows":185,"n_cols":9,"rows_kept":185,"cut":false,"hidden":false,"merged":[]}
["003-110","Основание стола БОГЕМА, Бг1, бук, без патины","компл.",52173,null,null,{"$f":"IFERROR(INDEX(стлГород,MATCH(ROWS($H$1:$H1),стлИндекс,0)),\"\")","v":"Основание стола БОГЕМА, Бг1, бук, без патины"},{"$f":"IF($I1,COUNTIF($I$1:$I1,TRUE),\"\")","v":1},{"$f":"NOT(ISERROR(SEARCH(Калькулятор!$C$11,$B1)))","v":true}]
["003-110п","Основание стола БОГЕМА, Бг1, бук, патина","компл.",56347,null,null,{"$f":"IFERROR(INDEX(стлГород,MATCH(ROWS($H$1:$H2),стлИндекс,0)),\"\")","v":"Основание стола БОГЕМА, Бг1, бук, патина"},{"$f":"IF($I2,COUNTIF($I$1:$I2,TRUE),\"\")","v":2},{"$f":"NOT(ISERROR(SEARCH(Калькулятор!$C$11,$B2)))","v":true}]
["003-210","Основание стола БОГЕМА, Бг2, бук, без патины","компл.",59433,null,null,{"$f":"IFERROR(INDEX(стлГород,MATCH(ROWS($H$1:$H3),стлИндекс,0)),\"\")","v":"Основание стола БОГЕМА, Бг2, бук, без патины"},{"$f":"IF($I3,COUNTIF($I$1:$I3,TRUE),\"\")","v":3},{"$f":"NOT(ISERROR(SEARCH(Калькулятор!$C$11,$B3)))","v":true}]
["003-210п","Основание стола БОГЕМА, Бг2, бук, патина","компл.",64188,null,null,{"$f":"IFERROR(INDEX(стлГород,MATCH(ROWS($H$1:$H4),стлИндекс,0)),\"\")","v":"Основание стола БОГЕМА, Бг2, бук, патина"},{"$f":"IF($I4,COUNTIF($I$1:$I4,TRUE),\"\")","v":4},{"$f":"NOT(ISERROR(SEARCH(Калькулятор!$C$11,$B4)))","v":true}]
["003-310","Основание стола БОГЕМА, Бг3, бук, без патины","компл.",53845,null,null,{"$f":"IFERROR(INDEX(стлГород,MATCH(ROWS($H$1:$H5),стлИндекс,0)),\"\")","v":"Основание стола БОГЕМА, Бг3, бук, без патины"},{"$f":"IF($I5,COUNTIF($I$1:$I5,TRUE),\"\")","v":5},{"$f":"NOT(ISERROR(SEARCH(Калькулятор!$C$11,$B5)))","v":true}]
["003-310п","Основание стола БОГЕМА, Бг3, бук, патина","компл.",58153,null,null,{"$f":"IFERROR(INDEX(стлГород,MATCH(ROWS($H$1:$H6),стлИндекс,0)),\"\")","v":"Основание стола БОГЕМА, Бг3, бук, патина"},{"$f":"IF($I6,COUNTIF($I$1:$I6,TRUE),\"\")","v":6},{"$f":"NOT(ISERROR(SEARCH(Калькулятор!$C$11,$B6)))","v":true}]
["004-110","Основание стола ВИЗИТ, Вз1, бук, без патины","компл.",25832,null,null,{"$f":"IFERROR(INDEX(стлГород,MATCH(ROWS($H$1:$H7),стлИндекс,0)),\"\")","v":"Основание стола ВИЗИТ, Вз1, бук, без патины"},{"$f":"IF($I7,COUNTIF($I$1:$I7,TRUE),\"\")","v":7},{"$f":"NOT(ISERROR(SEARCH(Калькулятор!$C$11,$B7)))","v":true}]
["004-110п","Основание стола ВИЗИТ, Вз1, бук, патина","компл.",27899,null,null,{"$f":"IFERROR(INDEX(стлГород,MATCH(ROWS($H$1:$H8),стлИндекс,0)),\"\")","v":"Основание стола ВИЗИТ, Вз1, бук, патина"},{"$f":"IF($I8,COUNTIF($I$1:$I8,TRUE),\"\")","v":8},{"$f":"NOT(ISERROR(SEARCH(Калькулятор!$C$11,$B8)))","v":true}]
["004-111","Основание стола ВИЗИТ, Вз1, бук, более 150х80см, без патины","компл.",33582,null,null,{"$f":"IFERROR(INDEX(стлГород,MATCH(ROWS($H$1:$H9),стлИндекс,0)),\"\")","v":"Основание стола ВИЗИТ, Вз1, бук, более 150х80см, без патины"},{"$f":"IF($I9,COUNTIF($I$1:$I9,TRUE),\"\")","v":9},{"$f":"NOT(ISERROR(SEARCH(Калькулятор!$C$11,$B9)))","v":true}]
["004-111п","Основание стола ВИЗИТ, Вз1, бук, более 150х80см, патина","компл.",36268,null,null,{"$f":"IFERROR(INDEX(стлГород,MATCH(ROWS($H$1:$H10),стлИндекс,0)),\"\")","v":"Основание стола ВИЗИТ, Вз1, бук, более 150х80см, патина"},{"$f":"IF($I10,COUNTIF($I$1:$I10,TRUE),\"\")","v":10},{"$f":"NOT(ISERROR(SEARCH(Калькулятор!$C$11,$B10)))","v":true}]
["004-120","Основание стола ВИЗИТ, Вз1, сосна, без патины","компл.",21527,null,null,{"$f":"IFERROR(INDEX(стлГород,MATCH(ROWS($H$1:$H11),стлИндекс,0)),\"\")","v":"Основание стола ВИЗИТ, Вз1, сосна, без патины"},{"$f":"IF($I11,COUNTIF($I$1:$I11,TRUE),\"\")","v":11},{"$f":"NOT(ISERROR(SEARCH(Калькулятор!$C$11,$B11)))","v":true}]
["004-120п","Основание стола ВИЗИТ, Вз1, сосна, патина","компл.",23249,null,null,{"$f":"IFERROR(INDEX(стлГород,MATCH(ROWS($H$1:$H12),стлИндекс,0)),\"\")","v":"Основание стола ВИЗИТ, Вз1, сосна, патина"},{"$f":"IF($I12,COUNTIF($I$1:$I12,TRUE),\"\")","v":12},{"$f":"NOT(ISERROR(SEARCH(Калькулятор!$C$11,$B12)))","v":true}]
["004-121","Основание стола ВИЗИТ, Вз1, сосна, более 150х80см, без патины","компл.",27985,null,null,{"$f":"IFERROR(INDEX(стлГород,MATCH(ROWS($H$1:$H13),стлИндекс,0)),\"\")","v":"Основание стола ВИЗИТ, Вз1, сосна, более 150х80см, без патины"},{"$f":"IF($I13,COUNTIF($I$1:$I13,TRUE),\"\")","v":13},{"$f":"NOT(ISERROR(SEARCH(Калькулятор!$C$11,$B13)))","v":true}]
["004-121п","Основание стола ВИЗИТ, Вз1, сосна, более 150х80см, патина","компл.",30223,null,null,{"$f":"IFERROR(INDEX(стлГород,MATCH(ROWS($H$1:$H14),стлИндекс,0)),\"\")","v":"Основание стола ВИЗИТ, Вз1, сосна, более 150х80см, патина"},{"$f":"IF($I14,COUNTIF($I$1:$I14,TRUE),\"\")","v":14},{"$f":"NOT(ISERROR(SEARCH(Калькулятор!$C$11,$B14)))","v":true}]
["005-110","Основание стола ГОСТЬ, Гс1, бук, без патины","компл.",29293,null,null,{"$f":"IFERROR(INDEX(стлГород,MATCH(ROWS($H$1:$H15),стлИндекс,0)),\"\")","v":"Основание стола ГОСТЬ, Гс1, бук, без патины"},{"$f":"IF($I15,COUNTIF($I$1:$I15,TRUE),\"\")","v":15},{"$f":"NOT(ISERROR(SEARCH(Калькулятор!$C$11,$B15)))","v":true}]
["005-110п","Основание стола ГОСТЬ, Гс1, бук, патина","компл.",31636,null,null,{"$f":"IFERROR(INDEX(стлГород,MATCH(ROWS($H$1:$H16),стлИндекс,0)),\"\")","v":"Основание стола ГОСТЬ, Гс1, бук, патина"},{"$f":"IF($I16,COUNTIF($I$1:$I16,TRUE),\"\")","v":16},{"$f":"NOT(ISERROR(SEARCH(Калькулятор!$C$11,$B16)))","v":true}]
["005-210","Основание стола ГОСТЬ, Гс2, бук, без патины","компл.",21527,null,null,{"$f":"IFERROR(INDEX(стлГород,MATCH(ROWS($H$1:$H17),стлИндекс,0)),\"\")","v":"Основание стола ГОСТЬ, Гс2, бук, без патины"},{"$f":"IF($I17,COUNTIF($I$1:$I17,TRUE),\"\")","v":17},{"$f":"NOT(ISERROR(SEARCH(Калькулятор!$C$11,$B17)))","v":true}]
["005-210п","Основание стола ГОСТЬ, Гс2, бук, патина","компл.",23249,null,null,{"$f":"IFERROR(INDEX(стлГород,MATCH(ROWS($H$1:$H18),стлИндекс,0)),\"\")","v":"Основание стола ГОСТЬ, Гс2, бук, патина"},{"$f":"IF($I18,COUNTIF($I$1:$I18,TRUE),\"\")","v":18},{"$f":"NOT(ISERROR(SEARCH(Калькулятор!$C$11,$B18)))","v":true}]
["005-310","Основание стола ГОСТЬ, Гс3, бук, без патины","компл.",28930,null,null,{"$f":"IFERROR(INDEX(стлГород,MATCH(ROWS($H$1:$H19),стлИндекс,0)),\"\")","v":"Основание стола ГОСТЬ, Гс3, бук, без патины"},{"$f":"IF($I19,COUNTIF($I$1:$I19,TRUE),\"\")","v":19},{"$f":"NOT(ISERROR(SEARCH(Калькулятор!$C$11,$B19)))","v":true}]
["005-310п","Основание стола ГОСТЬ, Гс3, бук, патина","компл.",31244,null,null,{"$f":"IFERROR(INDEX(стлГород,MATCH(ROWS($H$1:$H20),стлИндекс,0)),\"\")","v":"Основание стола ГОСТЬ, Гс3, бук, патина"},{"$f":"IF($I20,COUNTIF($I$1:$I20,TRUE),\"\")","v":20},{"$f":"NOT(ISERROR(SEARCH(Калькулятор!$C$11,$B20)))","v":true}]
["005-410","Основание стола ГОСТЬ, Гс4, бук, без патины","компл.",14532,null,null,{"$f":"IFERROR(INDEX(стлГород,MATCH(ROWS($H$1:$H21),стлИндекс,0)),\"\")","v":"Основание стола ГОСТЬ, Гс4, бук, без патины"},{"$f":"IF($I21,COUNTIF($I$1:$I21,TRUE),\"\")","v":21},{"$f":"NOT(ISERROR(SEARCH(Калькулятор!$C$11,$B21)))","v":true}]
["005-410п","Основание стола ГОСТЬ, Гс4, бук, патина","компл.",15695,null,null,{"$f":"IFERROR(INDEX(стлГород,MATCH(ROWS($H$1:$H22),стлИндекс,0)),\"\")","v":"Основание стола ГОСТЬ, Гс4, бук, патина"},{"$f":"IF($I22,COUNTIF($I$1:$I22,TRUE),\"\")","v":22},{"$f":"NOT(ISERROR(SEARCH(Калькулятор!$C$11,$B22)))","v":true}]
["005-411","Основание стола ГОСТЬ, Гс4, бук, более 150х80см, без патины","компл.",18892,null,null,{"$f":"IFERROR(INDEX(стлГород,MATCH(ROWS($H$1:$H23),стлИндекс,0)),\"\")","v":"Основание стола ГОСТЬ, Гс4, бук, более 150х80см, без патины"},{"$f":"IF($I23,COUNTIF($I$1:$I23,TRUE),\"\")","v":23},{"$f":"NOT(ISERROR(SEARCH(Калькулятор!$C$11,$B23)))","v":true}]
["005-411п","Основание стола ГОСТЬ, Гс4, бук, более 150х80см, патина","компл.",20403,null,null,{"$f":"IFERROR(INDEX(стлГород,MATCH(ROWS($H$1:$H24),стлИндекс,0)),\"\")","v":"Основание стола ГОСТЬ, Гс4, бук, более 150х80см, патина"},{"$f":"IF($I24,COUNTIF($I$1:$I24,TRUE),\"\")","v":24},{"$f":"NOT(ISERROR(SEARCH(Калькулятор!$C$11,$B24)))","v":true}]
["005-420","Основание стола ГОСТЬ, Гс4, сосна, без патины","компл.",12110,null,null,{"$f":"IFERROR(INDEX(стлГород,MATCH(ROWS($H$1:$H25),стлИндекс,0)),\"\")","v":"Основание стола ГОСТЬ, Гс4, сосна, без патины"},{"$f":"IF($I25,COUNTIF($I$1:$I25,TRUE),\"\")","v":25},{"$f":"NOT(ISERROR(SEARCH(Калькулятор!$C$11,$B25)))","v":true}]
["005-420п","Основание стола ГОСТЬ, Гс4, сосна, патина","компл.",13079,null,null,{"$f":"IFERROR(INDEX(стлГород,MATCH(ROWS($H$1:$H26),стлИндекс,0)),\"\")","v":"Основание стола ГОСТЬ, Гс4, сосна, патина"},{"$f":"IF($I26,COUNTIF($I$1:$I26,TRUE),\"\")","v":26},{"$f":"NOT(ISERROR(SEARCH(Калькулятор!$C$11,$B26)))","v":true}]
["005-421","Основание стола ГОСТЬ, Гс4, сосна, более 150х80см, без патины","компл.",15743,null,null,{"$f":"IFERROR(INDEX(стлГород,MATCH(ROWS($H$1:$H27),стлИндекс,0)),\"\")","v":"Основание стола ГОСТЬ, Гс4, сосна, более 150х80см, без патины"},{"$f":"IF($I27,COUNTIF($I$1:$I27,TRUE),\"\")","v":27},{"$f":"NOT(ISERROR(SEARCH(Калькулятор!$C$11,$B27)))","v":true}]
["005-421п","Основание стола ГОСТЬ, Гс4, сосна, более 150х80см, патина","компл.",17002,null,null,{"$f":"IFERROR(INDEX(стлГород,MATCH(ROWS($H$1:$H28),стлИндекс,0)),\"\")","v":"Основание стола ГОСТЬ, Гс4, сосна, более 150х80см, патина"},{"$f":"IF($I28,COUNTIF($I$1:$I28,TRUE),\"\")","v":28},{"$f":"NOT(ISERROR(SEARCH(Калькулятор!$C$11,$B28)))","v":true}]
["005-510","Основание стола ГОСТЬ, Гс5, бук, без патины","компл.",14532,null,null,{"$f":"IFERROR(INDEX(стлГород,MATCH(ROWS($H$1:$H29),стлИндекс,0)),\"\")","v":"Основание стола ГОСТЬ, Гс5, бук, без патины"},{"$f":"IF($I29,COUNTIF($I$1:$I29,TRUE),\"\")","v":29},{"$f":"NOT(ISERROR(SEARCH(Калькулятор!$C$11,$B29)))","v":true}]
["005-510п","Основание стола ГОСТЬ, Гс5, бук, патина","компл.",15695,null,null,{"$f":"IFERROR(INDEX(стлГород,MATCH(ROWS($H$1:$H30),стлИндекс,0)),\"\")","v":"Основание стола ГОСТЬ, Гс5, бук, патина"},{"$f":"IF($I30,COUNTIF($I$1:$I30,TRUE),\"\")","v":30},{"$f":"NOT(ISERROR(SEARCH(Калькулятор!$C$11,$B30)))","v":true}]
{"$rows_left_out":156}
{"sheet":"Стулья","index":3,"n_rows":100,"n_cols":9,"rows_kept":100,"cut":false,"hidden":false,"merged":[]}
["101-011","Стул АРТИСТ, бук, ткань, без патины","шт",12018,null,null,{"$f":"IFERROR(INDEX(стлСтуг,MATCH(ROWS($H$1:$H1),стлСтуи,0)),\"\")","v":"Стул АРТИСТ, бук, ткань, без патины"},{"$f":"IF($I1,COUNTIF($I$1:$I1,TRUE),\"\")","v":1},{"$f":"NOT(ISERROR(SEARCH(Калькулятор!$C$15,$B1)))","v":true}]
["101-011п","Стул АРТИСТ, бук, ткань, патина","шт",12979,null,null,{"$f":"IFERROR(INDEX(стлСтуг,MATCH(ROWS($H$1:$H2),стлСтуи,0)),\"\")","v":"Стул АРТИСТ, бук, ткань, патина"},{"$f":"IF($I2,COUNTIF($I$1:$I2,TRUE),\"\")","v":2},{"$f":"NOT(ISERROR(SEARCH(Калькулятор!$C$15,$B2)))","v":true}]
["102-011","Стул АСТОРИЯ, бук, ткань, без патины","шт",16394,null,null,{"$f":"IFERROR(INDEX(стлСтуг,MATCH(ROWS($H$1:$H3),стлСтуи,0)),\"\")","v":"Стул АСТОРИЯ, бук, ткань, без патины"},{"$f":"IF($I3,COUNTIF($I$1:$I3,TRUE),\"\")","v":3},{"$f":"NOT(ISERROR(SEARCH(Калькулятор!$C$15,$B3)))","v":true}]
["102-011п","Стул АСТОРИЯ, бук, ткань, патина","шт",17706,null,null,{"$f":"IFERROR(INDEX(стлСтуг,MATCH(ROWS($H$1:$H4),стлСтуи,0)),\"\")","v":"Стул АСТОРИЯ, бук, ткань, патина"},{"$f":"IF($I4,COUNTIF($I$1:$I4,TRUE),\"\")","v":4},{"$f":"NOT(ISERROR(SEARCH(Калькулятор!$C$15,$B4)))","v":true}]
["103-011","Стул БОГЕМА, бук, ткань, без патины","шт",14097,null,null,{"$f":"IFERROR(INDEX(стлСтуг,MATCH(ROWS($H$1:$H5),стлСтуи,0)),\"\")","v":"Стул БОГЕМА, бук, ткань, без патины"},{"$f":"IF($I5,COUNTIF($I$1:$I5,TRUE),\"\")","v":5},{"$f":"NOT(ISERROR(SEARCH(Калькулятор!$C$15,$B5)))","v":true}]
["103-011п","Стул БОГЕМА, бук, ткань, патина","шт",15225,null,null,{"$f":"IFERROR(INDEX(стлСтуг,MATCH(ROWS($H$1:$H6),стлСтуи,0)),\"\")","v":"Стул БОГЕМА, бук, ткань, патина"},{"$f":"IF($I6,COUNTIF($I$1:$I6,TRUE),\"\")","v":6},{"$f":"NOT(ISERROR(SEARCH(Калькулятор!$C$15,$B6)))","v":true}]
["135-011","Стул БРИТНИ, бук, ткань, без патины","шт",11330,null,null,{"$f":"IFERROR(INDEX(стлСтуг,MATCH(ROWS($H$1:$H7),стлСтуи,0)),\"\")","v":"Стул БРИТНИ, бук, ткань, без патины"},{"$f":"IF($I7,COUNTIF($I$1:$I7,TRUE),\"\")","v":7},{"$f":"NOT(ISERROR(SEARCH(Калькулятор!$C$15,$B7)))","v":true}]
["135-011п","Стул БРИТНИ, бук, ткань, патина","шт",12236,null,null,{"$f":"IFERROR(INDEX(стлСтуг,MATCH(ROWS($H$1:$H8),стлСтуи,0)),\"\")","v":"Стул БРИТНИ, бук, ткань, патина"},{"$f":"IF($I8,COUNTIF($I$1:$I8,TRUE),\"\")","v":8},{"$f":"NOT(ISERROR(SEARCH(Калькулятор!$C$15,$B8)))","v":true}]
["104-011","Стул ВЕНЕЦИЯ, бук, ткань, без патины","шт",5082,null,null,{"$f":"IFERROR(INDEX(стлСтуг,MATCH(ROWS($H$1:$H9),стлСтуи,0)),\"\")","v":"Стул ВЕНЕЦИЯ, бук, ткань, без патины"},{"$f":"IF($I9,COUNTIF($I$1:$I9,TRUE),\"\")","v":9},{"$f":"NOT(ISERROR(SEARCH(Калькулятор!$C$15,$B9)))","v":true}]
["104-011п","Стул ВЕНЕЦИЯ, бук, ткань, патина","шт",5489,null,null,{"$f":"IFERROR(INDEX(стлСтуг,MATCH(ROWS($H$1:$H10),стлСтуи,0)),\"\")","v":"Стул ВЕНЕЦИЯ, бук, ткань, патина"},{"$f":"IF($I10,COUNTIF($I$1:$I10,TRUE),\"\")","v":10},{"$f":"NOT(ISERROR(SEARCH(Калькулятор!$C$15,$B10)))","v":true}]
["104-012","Стул ВЕНЕЦИЯ, бук, сиденье массив, без патины","шт",5590,null,null,{"$f":"IFERROR(INDEX(стлСтуг,MATCH(ROWS($H$1:$H11),стлСтуи,0)),\"\")","v":"Стул ВЕНЕЦИЯ, бук, сиденье массив, без патины"},{"$f":"IF($I11,COUNTIF($I$1:$I11,TRUE),\"\")","v":11},{"$f":"NOT(ISERROR(SEARCH(Калькулятор!$C$15,$B11)))","v":true}]
["104-012п","Стул ВЕНЕЦИЯ, бук, сиденье массив, патина","шт",6037,null,null,{"$f":"IFERROR(INDEX(стлСтуг,MATCH(ROWS($H$1:$H12),стлСтуи,0)),\"\")","v":"Стул ВЕНЕЦИЯ, бук, сиденье массив, патина"},{"$f":"IF($I12,COUNTIF($I$1:$I12,TRUE),\"\")","v":12},{"$f":"NOT(ISERROR(SEARCH(Калькулятор!$C$15,$B12)))","v":true}]
["104-013","Стул ВЕНЕЦИЯ, бук, плетение, без патины","шт",5082,null,null,{"$f":"IFERROR(INDEX(стлСтуг,MATCH(ROWS($H$1:$H13),стлСтуи,0)),\"\")","v":"Стул ВЕНЕЦИЯ, бук, плетение, без патины"},{"$f":"IF($I13,COUNTIF($I$1:$I13,TRUE),\"\")","v":13},{"$f":"NOT(ISERROR(SEARCH(Калькулятор!$C$15,$B13)))","v":true}]
["104-013п","Стул ВЕНЕЦИЯ, бук, плетение, патина","шт",5489,null,null,{"$f":"IFERROR(INDEX(стлСтуг,MATCH(ROWS($H$1:$H14),стлСтуи,0)),\"\")","v":"Стул ВЕНЕЦИЯ, бук, плетение, патина"},{"$f":"IF($I14,COUNTIF($I$1:$I14,TRUE),\"\")","v":14},{"$f":"NOT(ISERROR(SEARCH(Калькулятор!$C$15,$B14)))","v":true}]
["100-012","Стул ВЕНСКИЙ, бук, сиденье массив, без патины","шт",8220,null,null,{"$f":"IFERROR(INDEX(стлСтуг,MATCH(ROWS($H$1:$H15),стлСтуи,0)),\"\")","v":"Стул ВЕНСКИЙ, бук, сиденье массив, без патины"},{"$f":"IF($I15,COUNTIF($I$1:$I15,TRUE),\"\")","v":15},{"$f":"NOT(ISERROR(SEARCH(Калькулятор!$C$15,$B15)))","v":true}]
["100-012п","Стул ВЕНСКИЙ, бук, сиденье массив, патина","шт",8878,null,null,{"$f":"IFERROR(INDEX(стлСтуг,MATCH(ROWS($H$1:$H16),стлСтуи,0)),\"\")","v":"Стул ВЕНСКИЙ, бук, сиденье массив, патина"},{"$f":"IF($I16,COUNTIF($I$1:$I16,TRUE),\"\")","v":16},{"$f":"NOT(ISERROR(SEARCH(Калькулятор!$C$15,$B16)))","v":true}]
["105-011","Стул ГОСТЬ, бук, ткань, без патины","шт",11148,null,null,{"$f":"IFERROR(INDEX(стлСтуг,MATCH(ROWS($H$1:$H17),стлСтуи,0)),\"\")","v":"Стул ГОСТЬ, бук, ткань, без патины"},{"$f":"IF($I17,COUNTIF($I$1:$I17,TRUE),\"\")","v":17},{"$f":"NOT(ISERROR(SEARCH(Калькулятор!$C$15,$B17)))","v":true}]
["105-011п","Стул ГОСТЬ, бук, ткань, патина","шт",12040,null,null,{"$f":"IFERROR(INDEX(стлСтуг,MATCH(ROWS($H$1:$H18),стлСтуи,0)),\"\")","v":"Стул ГОСТЬ, бук, ткань, патина"},{"$f":"IF($I18,COUNTIF($I$1:$I18,TRUE),\"\")","v":18},{"$f":"NOT(ISERROR(SEARCH(Калькулятор!$C$15,$B18)))","v":true}]
["105-021","Стул ГОСТЬ, сосна, ткань, без патины","шт",9290,null,null,{"$f":"IFERROR(INDEX(стлСтуг,MATCH(ROWS($H$1:$H19),стлСтуи,0)),\"\")","v":"Стул ГОСТЬ, сосна, ткань, без патины"},{"$f":"IF($I19,COUNTIF($I$1:$I19,TRUE),\"\")","v":19},{"$f":"NOT(ISERROR(SEARCH(Калькулятор!$C$15,$B19)))","v":true}]
["105-021п","Стул ГОСТЬ, сосна, ткань, патина","шт",10033,null,null,{"$f":"IFERROR(INDEX(стлСтуг,MATCH(ROWS($H$1:$H20),стлСтуи,0)),\"\")","v":"Стул ГОСТЬ, сосна, ткань, патина"},{"$f":"IF($I20,COUNTIF($I$1:$I20,TRUE),\"\")","v":20},{"$f":"NOT(ISERROR(SEARCH(Калькулятор!$C$15,$B20)))","v":true}]
["106-011","Стул ГОСТЬЯ, бук, ткань, без патины","шт",12863,null,null,{"$f":"IFERROR(INDEX(стлСтуг,MATCH(ROWS($H$1:$H21),стлСтуи,0)),\"\")","v":"Стул ГОСТЬЯ, бук, ткань, без патины"},{"$f":"IF($I21,COUNTIF($I$1:$I21,TRUE),\"\")","v":21},{"$f":"NOT(ISERROR(SEARCH(Калькулятор!$C$15,$B21)))","v":true}]
["106-011п","Стул ГОСТЬЯ, бук, ткань, патина","шт",13892,null,null,{"$f":"IFERROR(INDEX(стлСтуг,MATCH(ROWS($H$1:$H22),стлСтуи,0)),\"\")","v":"Стул ГОСТЬЯ, бук, ткань, патина"},{"$f":"IF($I22,COUNTIF($I$1:$I22,TRUE),\"\")","v":22},{"$f":"NOT(ISERROR(SEARCH(Калькулятор!$C$15,$B22)))","v":true}]
["106-021","Стул ГОСТЬЯ, сосна, ткань, без патины","шт",10719,null,null,{"$f":"IFERROR(INDEX(стлСтуг,MATCH(ROWS($H$1:$H23),стлСтуи,0)),\"\")","v":"Стул ГОСТЬЯ, сосна, ткань, без патины"},{"$f":"IF($I23,COUNTIF($I$1:$I23,TRUE),\"\")","v":23},{"$f":"NOT(ISERROR(SEARCH(Калькулятор!$C$15,$B23)))","v":true}]
["106-021п","Стул ГОСТЬЯ, сосна, ткань, патина","шт",11577,null,null,{"$f":"IFERROR(INDEX(стлСтуг,MATCH(ROWS($H$1:$H24),стлСтуи,0)),\"\")","v":"Стул ГОСТЬЯ, сосна, ткань, патина"},{"$f":"IF($I24,COUNTIF($I$1:$I24,TRUE),\"\")","v":24},{"$f":"NOT(ISERROR(SEARCH(Калькулятор!$C$15,$B24)))","v":true}]
["107-011","Стул ДЕЗИРЕ, бук, ткань, без патины","шт",15104,null,null,{"$f":"IFERROR(INDEX(стлСтуг,MATCH(ROWS($H$1:$H25),стлСтуи,0)),\"\")","v":"Стул ДЕЗИРЕ, бук, ткань, без патины"},{"$f":"IF($I25,COUNTIF($I$1:$I25,TRUE),\"\")","v":25},{"$f":"NOT(ISERROR(SEARCH(Калькулятор!$C$15,$B25)))","v":true}]
["107-011п","Стул ДЕЗИРЕ, бук, ткань, патина","шт",16312,null,null,{"$f":"IFERROR(INDEX(стлСтуг,MATCH(ROWS($H$1:$H26),стлСтуи,0)),\"\")","v":"Стул ДЕЗИРЕ, бук, ткань, патина"},{"$f":"IF($I26,COUNTIF($I$1:$I26,TRUE),\"\")","v":26},{"$f":"NOT(ISERROR(SEARCH(Калькулятор!$C$15,$B26)))","v":true}]
["108-011","Стул ДЕНДИ, бук, ткань, без патины","шт",7623,null,null,{"$f":"IFERROR(INDEX(стлСтуг,MATCH(ROWS($H$1:$H27),стлСтуи,0)),\"\")","v":"Стул ДЕНДИ, бук, ткань, без патины"},{"$f":"IF($I27,COUNTIF($I$1:$I27,TRUE),\"\")","v":27},{"$f":"NOT(ISERROR(SEARCH(Калькулятор!$C$15,$B27)))","v":true}]
["108-011п","Стул ДЕНДИ, бук, ткань, патина","шт",8233,null,null,{"$f":"IFERROR(INDEX(стлСтуг,MATCH(ROWS($H$1:$H28),стлСтуи,0)),\"\")","v":"Стул ДЕНДИ, бук, ткань, патина"},{"$f":"IF($I28,COUNTIF($I$1:$I28,TRUE),\"\")","v":28},{"$f":"NOT(ISERROR(SEARCH(Калькулятор!$C$15,$B28)))","v":true}]
["108-012","Стул ДЕНДИ, бук, сиденье массив, без патины","шт",8385,null,null,{"$f":"IFERROR(INDEX(стлСтуг,MATCH(ROWS($H$1:$H29),стлСтуи,0)),\"\")","v":"Стул ДЕНДИ, бук, сиденье массив, без патины"},{"$f":"IF($I29,COUNTIF($I$1:$I29,TRUE),\"\")","v":29},{"$f":"NOT(ISERROR(SEARCH(Калькулятор!$C$15,$B29)))","v":true}]
["108-012п","Стул ДЕНДИ, бук, сиденье массив, патина","шт",9056,null,null,{"$f":"IFERROR(INDEX(стлСтуг,MATCH(ROWS($H$1:$H30),стлСтуи,0)),\"\")","v":"Стул ДЕНДИ, бук, сиденье массив, патина"},{"$f":"IF($I30,COUNTIF($I$1:$I30,TRUE),\"\")","v":30},{"$f":"NOT(ISERROR(SEARCH(Калькулятор!$C$15,$B30)))","v":true}]
{"$rows_left_out":70}