{"text_format":"1","workbook":"xlsx","n_sheets":2,"sheets":["Ввод данных","База клиентов"],"not_rendered":{"charts":0,"images":2,"macros":1,"external_links":0,"defined_names":5,"comments":1,"pivot_tables":0},"unopened":[],"bounds":{"document_bytes":16777216,"sheet_cells":100000,"rows_first":2000,"rows_last":500,"rows_between":2000,"halvings":0,"cell_chars":16384,"cell_head_chars":4096},"cells_cut":0,"cells_raw":0,"read":"whole","date_system":"1900"}

{"sheet":"Ввод данных","index":0,"n_rows":20,"n_cols":8,"rows_kept":20,"cut":false,"hidden":false,"merged":[[14,2,15,3],[7,5,7,6],[7,1,7,4],[8,0,8,7],[5,1,5,2],[6,1,6,2],[0,5,0,7],[5,5,5,6],[1,5,3,7],[0,1,0,2],[1,1,1,2],[2,1,2,2],[3,1,3,2],[4,1,4,2],[4,5,4,7],[19,2,19,3],[19,5,19,7],[16,2,16,7],[17,2,17,3],[18,2,18,3],[17,5,17,7],[18,5,18,7]]}
["Фамилия:",null,null,"Когда выдан:",null,{"$f":"IF(OR(B1=\"\",B2=\"\",B3=\"\",B4=\"\",B5=\"\",B6=\"\",B7=\"\",B8=\"\",E1=\"\",E2=\"\",E3=\"\",E4=\"\",E5=\"\",E6=\"\",E7=\"\"),\"ВНИМАНИЕ!\",\"Договор заполнен верно\")","v":"ВНИМАНИЕ!"}]
["Имя:",null,null,"Адрес прописки, регистрации:",null,{"$f":"IF(F1=\"Внимание!\",IF(AND(B1=\"\",B2=\"\",B3=\"\",B4=\"\",B5=\"\",B6=\"\",B7=\"\",B8=\"\",E1=\"\",E2=\"\",E3=\"\",E4=\"\",E5=\"\",E6=\"\",E7=\"\"),\"Если Вы раньше пользовались нашими услугами, то начните ввод данных с:\"&CHAR(10)&CHAR(10)&\"НОМЕРА ТЕЛЕФОНА\"&CHAR(10)&\"или\"&CHAR(10)&\"СЕРИИ И НОМЕРА ПАСПОРТА\"&CHAR(10)&\"или\"&CHAR(10)&\"ГОС. НОМЕРА АВТОМОБИЛЯ\",IF(B1=\"\",\"Введите фамилию!\",\"\")&IF(B1=\"\",CHAR(10),\"\")&IF(B2=\"\",\"Введите имя!\",\"\")&IF(B2=\"\",CHAR(10),\"\")&IF(B3=\"\",\"Введите отчество!\",\"\")&IF(B3=\"\",CHAR(10),\"\")&IF(B4=\"\",\"Введите телефон!\",\"\")&IF(B4=\"\",CHAR(10),\"\")&IF(B5=\"\",\"Укажите документ!\",\"\")&IF(B5=\"\",CHAR(10),\"\")&IF(B6=\"\",\"Введите серию документа!\",\"\")&IF(B6=\"\",CHAR(10),\"\")&IF(B7=\"\",\"Введите номер документа!\",\"\")&IF(B7=\"\",CHAR(10),\"\")&IF(B8=\"\",\"Укажите кем выдан документ!\",\"\")&IF(B8=\"\",CHAR(10),\"\")&IF(E1=\"\",\"Укажите когда выдан документ!\",\"\")&IF(E1=\"\",CHAR(10),\"\")&IF(E2=\"\",\"Впишите адрес прописки!\",\"\")&IF(E2=\"\",CHAR(10),\"\")&IF(E3=\"\",\"Впишите адрес фактического проживания!\",\"\")&IF(E3=\"\",CHAR(10),\"\")&IF(E4=\"\",\"Укажите марку автомобиля!\",\"\")&IF(E4=\"\",CHAR(10),\"\")&IF(E5=\"\",\"Укажите модель автомобиля!\",\"\")&IF(E5=\"\",CHAR(10),\"\")&IF(E6=\"\",\"Введите год выпуска автомобиля!\",\"\")&IF(E6=\"\",CHAR(10),\"\")&IF(E7=\"\",\"Впишите гос. номер автомобиля!\",\"\")),\"Благодарим Вас за обращение в нашу компанию!\"&CHAR(10)&\"Счастливого пути и приятного путешествия с командой #ROOFRACKCREW\"&CHAR(10)&\"Будем рады видеть Вас снова =)\"&CHAR(10)&CHAR(10)&CHAR(10)&\"⬇ Нажмите кнопку ЗАПИСАТЬ ⬇\")","v":"Если Вы раньше пользовались нашими услугами, то начните ввод данных с:\n\nНОМЕРА ТЕЛЕФОНА\nили\nСЕРИИ И НОМЕРА ПАСПОРТА\nили\nГОС. НОМЕРА АВТОМОБИЛЯ"}]
["Отчество:",null,null,"Адрес фактического проживания:"]
["Контактный телефон:",null,null,"Марка автомобиля:"]
["Документ:",null,null,"Модель автомобиля:"]
["Серия:",null,null,"Год выпуска автомобиля:",null,"Номер договора:\n(вводится менеджером)"]
["Номер:",null,null,"Гос. номер:",null,{"$f":"IFERROR(INDEX('База клиентов'!A:Q,MATCH(B4,'База клиентов'!D:D,0),17),0)","v":0},"Скидка:\n(вводится менеджером)"]
["Кем выдан:",null,null,null,null,"Оплата:\n(вводится менеджером)"]
["Информация об арендуемом оборудовании заполняется менеджером"]
["Наименование","Модель оборудования","Кол-во","Инвентарный номер","Оценочная стоимость","₽ в сутки","Начало проката","Конец проката"]
["Автобокс:",null,null,null,{"$f":"IFERROR(INDEX(#REF!,MATCH(B11,#REF!,0),2),\"\")","v":""},{"$f":"IFERROR(IF(OR(G11=\"\",H11=\"\"),\"\",INDEX(#REF!,MATCH(B11,#REF!,0),IF(H16<=6,3,IF(AND(H16>6,H16<=13),4,IF(AND(H16>13,H16<=20),5,IF(AND(H16>20,H16<=29),6,IF(AND(H16>29,H16<=39),7,IF(H16=\"Тариф НГ\",9,IF(H16>39,8,1))))))))),\"\")","v":""}]
["Автобагажник:",null,null,null,{"$f":"IFERROR(INDEX(#REF!,MATCH(B12,#REF!,0),IF(LEFT(D12,3)=\"757\",2,IF(LEFT(D12,3)=\"775\",3,IF(LEFT(D12,3)=\"751\",4,IF(LEFT(D12,3)=\"753\",4,IF(LEFT(D12,3)=\"754\",4,2)))))),\"\")","v":""},{"$f":"IFERROR(IF(OR(G12=\"\",H12=\"\"),\"\",INDEX(#REF!,MATCH(B12,#REF!,0),IF(H16<=6,5,IF(AND(H16>6,H16<=13),6,IF(AND(H16>13,H16<=20),7,IF(AND(H16>20,H16<=29),8,IF(AND(H16>29,H16<=39),9,IF(H16=\"Тариф НГ\",11,IF(H16>39,10,1))))))))),\"\")","v":""}]
["Велокрепление:",null,null,{"$f":"IF(B13>0,\"-------------------------\",\"\")","v":""},{"$f":"IFERROR(INDEX(#REF!,MATCH(B13,#REF!,0),2),\"\")","v":""},{"$f":"IFERROR(IF(OR(G13=\"\",H13=\"\"),\"\",INDEX(#REF!,MATCH(B13,#REF!,0),IF(H16<=6,3,IF(AND(H16>6,H16<=13),4,IF(AND(H16>13,H16<=20),5,IF(AND(H16>20,H16<=29),6,IF(AND(H16>29,H16<=39),7,IF(H16=\"Тариф НГ\",9,IF(H16>39,8,1))))))))),\"\")","v":""}]
["Крепление для лыж и сноуборда:",null,null,{"$f":"IF(B14>0,\"-------------------------\",\"\")","v":""},{"$f":"IFERROR(INDEX(#REF!,MATCH(B14,#REF!,0),2),\"\")","v":""},{"$f":"IFERROR(IF(OR(G14=\"\",H14=\"\"),\"\",INDEX(#REF!,MATCH(B14,#REF!,0),IF(H16<=6,3,IF(AND(H16>6,H16<=13),4,IF(AND(H16>13,H16<=20),5,IF(AND(H16>20,H16<=29),6,IF(AND(H16>29,H16<=39),7,IF(H16=\"Тариф НГ\",9,IF(H16>39,8,1))))))))),\"\")","v":""}]
["Внесено:",null,"Калькулятор\nрассчета дней:\n(нужно указать начало проката)",null,"На количество дней:",null,"Залог:"]
["Полная стоимость:",{"$f":"#REF!","v":{"$error":"#REF!"}},null,null,"Дата окончания аренды:",{"$f":"IF(IF(G11>0,G11+F15,IF(G12>0,G12+F15,G13+F15))=0,\"\",IF(G11>0,G11+F15,IF(G12>0,G12+F15,G13+F15)))","v":""},"Кол-во дней:",{"$f":"IF(AND(DATE(YEAR(G11),DAY(12),DAY(1))=G11,DATE(YEAR(H11),DAY(1),DAY(31))=H11),\"Тариф НГ\",IF(AND(DATE(YEAR(G12),DAY(12),DAY(1))=G12,DATE(YEAR(H12),DAY(1),DAY(31))),\"Тариф НГ\",IF(AND(DATE(YEAR(G13),DAY(12),DAY(1))=G13,DATE(YEAR(H13),DAY(1),DAY(31))),\"Тариф НГ\",IF(AND(DATE(YEAR(G14),DAY(12),DAY(1))=G14,DATE(YEAR(H14),DAY(1),DAY(31))),\"Тариф НГ\",IF(B11>0,#REF!,IF(B12>0,#REF!,IF(B13>0,#REF!,IF(B14>0,#REF!,\"\"))))))))","v":""}]
["Комментарий \nк автобоксу:",null,"Доставка"]
["Комментарий \nк автобагажнику:",null,"Услуга:",null,null,"Адрес:"]
["Комментарий \nк велокреплению:",null,"Стоимость:"]
["Откуда узнали о нас:",null,"E-Mail клиента:"]

{"sheet":"База клиентов","index":1,"n_rows":1304,"n_cols":18,"rows_kept":1304,"cut":false,"hidden":false,"merged":[]}
[null,"В аренде",null,"Рассылка",null,"Совпадение"]
["Фамилия","Имя","Отчество","Номер телефона","Документ","Серия паспорта/ВУ","Номер паспорта/В.У","Кем выдан паспорт","Выдан\n(число/месяц/год)","Адрес места прописки, регистрации","Адрес места фактического проживания","Марка авто","Модель авто","Год выпуска авто","Гос номер","Кол-во аренд","Скидка","E-Mail"]
["Остапов","Сергей","Геннадьевич",89991112233,"паспорт","4510","102030","УФМС РФ Москвы по р-ну Рязанский","2014-08-11","Москва, ул. Зарайская д. 1 кв. 1","Москва, ул. Зарайская д. 1 кв. 1","Mitsubishi","ASX",2013,"Н 515 НК 777",1,{"$f":"IF((P3>0)*(P3<4),10%,IF(P3<0,0,IF((P3>3)*(P3<10),15%,IF(P3>=10,20%,0))))","v":0.1},"ostapov.s@ya.ru"]
["Миронов","Антон","Владимирович",89262224411,"паспорт","4500","543987","ОВД Солнечногорского р-на Московской обл.","2000-08-25","МО, г.Химки, пр-т Мельникова, д.10, кв.10","МО, г.Химки, ул.Молодёжная, д.1219, кв.19","Hyundai","Santa Fe",2002,"У 111 ХВ 150",1,0.1]
["Королев","Дмитрий","Семенович",89169991155,"паспорт","4507","240042","ОВД р-на Лианозово гор. Москвы","2001-07-06","Илимская д. 10 кв. 78","Илимская д. 10 кв. 78","MB ","V-250 Bluet",2014,"А 777 ОК 777",1,0.1,"korolev@mail.ru"]
[null,null,null,null,null,null,null,null,null,null,null,null,null,null,null,null,{"$f":"IF((P6>0)*(P6<4),10%,IF(P6<0,0,IF((P6>3)*(P6<10),15%,IF(P6>=10,20%,0))))","v":0}]
[null,null,null,null,null,null,null,null,null,null,null,null,null,null,null,null,0]
[null,null,null,null,null,null,null,null,null,null,null,null,null,null,null,null,0]
[null,null,null,null,null,null,null,null,null,null,null,null,null,null,null,null,0]
[null,null,null,null,null,null,null,null,null,null,null,null,null,null,null,null,0]
[null,null,null,null,null,null,null,null,null,null,null,null,null,null,null,null,0]
[null,null,null,null,null,null,null,null,null,null,null,null,null,null,null,null,0]
[null,null,null,null,null,null,null,null,null,null,null,null,null,null,null,null,0]
[null,null,null,null,null,null,null,null,null,null,null,null,null,null,null,null,0]
[null,null,null,null,null,null,null,null,null,null,null,null,null,null,null,null,0]
[null,null,null,null,null,null,null,null,null,null,null,null,null,null,null,null,0]
[null,null,null,null,null,null,null,null,null,null,null,null,null,null,null,null,0]
[null,null,null,null,null,null,null,null,null,null,null,null,null,null,null,null,0]
[null,null,null,null,null,null,null,null,null,null,null,null,null,null,null,null,0]
[null,null,null,null,null,null,null,null,null,null,null,null,null,null,null,null,0]
[null,null,null,null,null,null,null,null,null,null,null,null,null,null,null,null,0]
[null,null,null,null,null,null,null,null,null,null,null,null,null,null,null,null,0]
[null,null,null,null,null,null,null,null,null,null,null,null,null,null,null,null,0]
[null,null,null,null,null,null,null,null,null,null,null,null,null,null,null,null,0]
[null,null,null,null,null,null,null,null,null,null,null,null,null,null,null,null,0]
[null,null,null,null,null,null,null,null,null,null,null,null,null,null,null,null,0]
[null,null,null,null,null,null,null,null,null,null,null,null,null,null,null,null,0]
[null,null,null,null,null,null,null,null,null,null,null,null,null,null,null,null,0]
[null,null,null,null,null,null,null,null,null,null,null,null,null,null,null,null,0]
[null,null,null,null,null,null,null,null,null,null,null,null,null,null,null,null,0]
[null,null,null,null,null,null,null,null,null,null,null,null,null,null,null,null,0]
[null,null,null,null,null,null,null,null,null,null,null,null,null,null,null,null,0]
[null,null,null,null,null,null,null,null,null,null,null,null,null,null,null,null,0]
[null,null,null,null,null,null,null,null,null,null,null,null,null,null,null,null,0]
[null,null,null,null,null,null,null,null,null,null,null,null,null,null,null,null,0]
[null,null,null,null,null,null,null,null,null,null,null,null,null,null,null,null,0]
[null,null,null,null,null,null,null,null,null,null,null,null,null,null,null,null,0]
[null,null,null,null,null,null,null,null,null,null,null,null,null,null,null,null,0]
[null,null,null,null,null,null,null,null,null,null,null,null,null,null,null,null,0]
[null,null,null,null,null,null,null,null,null,null,null,null,null,null,null,null,0]
[null,null,null,null,null,null,null,null,null,null,null,null,null,null,null,null,0]
[null,null,null,null,null,null,null,null,null,null,null,null,null,null,null,null,0]
[null,null,null,null,null,null,null,null,null,null,null,null,null,null,null,null,0]
[null,null,null,null,null,null,null,null,null,null,null,null,null,null,null,null,0]
[null,null,null,null,null,null,null,null,null,null,null,null,null,null,null,null,0]
[null,null,null,null,null,null,null,null,null,null,null,null,null,null,null,null,0]
[null,null,null,null,null,null,null,null,null,null,null,null,null,null,null,null,0]
[null,null,null,null,null,null,null,null,null,null,null,null,null,null,null,null,0]
[null,null,null,null,null,null,null,null,null,null,null,null,null,null,null,null,0]
[null,null,null,null,null,null,null,null,null,null,null,null,null,null,null,null,0]
[null,null,null,null,null,null,null,null,null,null,null,null,null,null,null,null,0]
[null,null,null,null,null,null,null,null,null,null,null,null,null,null,null,null,0]
[null,null,null,null,null,null,null,null,null,null,null,null,null,null,null,null,0]
[null,null,null,null,null,null,null,null,null,null,null,null,null,null,null,null,0]
[null,null,null,null,null,null,null,null,null,null,null,null,null,null,null,null,0]
[null,null,null,null,null,null,null,null,null,null,null,null,null,null,null,null,0]
[null,null,null,null,null,null,null,null,null,null,null,null,null,null,null,null,0]
[null,null,null,null,null,null,null,null,null,null,null,null,null,null,null,null,0]
[null,null,null,null,null,null,null,null,null,null,null,null,null,null,null,null,0]
[null,null,null,null,null,null,null,null,null,null,null,null,null,null,null,null,0]
[null,null,null,null,null,null,null,null,null,null,null,null,null,null,null,null,{"$f":"IF((P61>0)*(P61<4),10%,IF(P61<0,0,IF((P61>3)*(P61<10),15%,IF(P61>=10,20%,0))))","v":0}]
[null,null,null,null,null,null,null,null,null,null,null,null,null,null,null,null,0]
[null,null,null,null,null,null,null,null,null,null,null,null,null,null,null,null,0]
[null,null,null,null,null,null,null,null,null,null,null,null,null,null,null,null,0]
[null,null,null,null,null,null,null,null,null,null,null,null,null,null,null,null,0]
[null,null,null,null,null,null,null,null,null,null,null,null,null,null,null,null,0]
[null,null,null,null,null,null,null,null,null,null,null,null,null,null,null,null,0]
[null,null,null,null,null,null,null,null,null,null,null,null,null,null,null,null,0]
[null,null,null,null,null,null,null,null,null,null,null,null,null,null,null,null,0]
[null,null,null,null,null,null,null,null,null,null,null,null,null,null,null,null,0]
[null,null,null,null,null,null,null,null,null,null,null,null,null,null,null,null,0]
[null,null,null,null,null,null,null,null,null,null,null,null,null,null,null,null,0]
[null,null,null,null,null,null,null,null,null,null,null,null,null,null,null,null,0]
[null,null,null,null,null,null,null,null,null,null,null,null,null,null,null,null,0]
[null,null,null,null,null,null,null,null,null,null,null,null,null,null,null,null,0]
[null,null,null,null,null,null,null,null,null,null,null,null,null,null,null,null,0]
[null,null,null,null,null,null,null,null,null,null,null,null,null,null,null,null,0]
[null,null,null,null,null,null,null,null,null,null,null,null,null,null,null,null,0]
[null,null,null,null,null,null,null,null,null,null,null,null,null,null,null,null,0]
[null,null,null,null,null,null,null,null,null,null,null,null,null,null,null,null,0]
[null,null,null,null,null,null,null,null,null,null,null,null,null,null,null,null,0]
[null,null,null,null,null,null,null,null,null,null,null,null,null,null,null,null,0]
[null,null,null,null,null,null,null,null,null,null,null,null,null,null,null,null,0]
[null,null,null,null,null,null,null,null,null,null,null,null,null,null,null,null,0]
[null,null,null,null,null,null,null,null,null,null,null,null,null,null,null,null,0]
[null,null,null,null,null,null,null,null,null,null,null,null,null,null,null,null,0]
[null,null,null,null,null,null,null,null,null,null,null,null,null,null,null,null,0]
[null,null,null,null,null,null,null,null,null,null,null,null,null,null,null,null,0]
[null,null,null,null,null,null,null,null,null,null,null,null,null,null,null,null,0]
[null,null,null,null,null,null,null,null,null,null,null,null,null,null,null,null,0]
[null,null,null,null,null,null,null,null,null,null,null,null,null,null,null,null,0]
[null,null,null,null,null,null,null,null,null,null,null,null,null,null,null,null,0]
[null,null,null,null,null,null,null,null,null,null,null,null,null,null,null,null,0]
[null,null,null,null,null,null,null,null,null,null,null,null,null,null,null,null,0]
[null,null,null,null,null,null,null,null,null,null,null,null,null,null,null,null,0]
[null,null,null,null,null,null,null,null,null,null,null,null,null,null,null,null,0]
[null,null,null,null,null,null,null,null,null,null,null,null,null,null,null,null,0]
[null,null,null,null,null,null,null,null,null,null,null,null,null,null,null,null,0]
[null,null,null,null,null,null,null,null,null,null,null,null,null,null,null,null,0]
[null,null,null,null,null,null,null,null,null,null,null,null,null,null,null,null,0]
[null,null,null,null,null,null,null,null,null,null,null,null,null,null,null,null,0]
[null,null,null,null,null,null,null,null,null,null,null,null,null,null,null,null,0]
[null,null,null,null,null,null,null,null,null,null,null,null,null,null,null,null,0]
[null,null,null,null,null,null,null,null,null,null,null,null,null,null,null,null,0]
[null,null,null,null,null,null,null,null,null,null,null,null,null,null,null,null,0]
[null,null,null,null,null,null,null,null,null,null,null,null,null,null,null,null,0]
[null,null,null,null,null,null,null,null,null,null,null,null,null,null,null,null,0]
[null,null,null,null,null,null,null,null,null,null,null,null,null,null,null,null,0]
[null,null,null,null,null,null,null,null,null,null,null,null,null,null,null,null,0]
[null,null,null,null,null,null,null,null,null,null,null,null,null,null,null,null,0]
[null,null,null,null,null,null,null,null,null,null,null,null,null,null,null,null,0]
[null,null,null,null,null,null,null,null,null,null,null,null,null,null,null,null,0]
[null,null,null,null,null,null,null,null,null,null,null,null,null,null,null,null,0]
[null,null,null,null,null,null,null,null,null,null,null,null,null,null,null,null,0]
[null,null,null,null,null,null,null,null,null,null,null,null,null,null,null,null,0]
[null,null,null,null,null,null,null,null,null,null,null,null,null,null,null,null,0]
[null,null,null,null,null,null,null,null,null,null,null,null,null,null,null,null,0]
[null,null,null,null,null,null,null,null,null,null,null,null,null,null,null,null,0]
[null,null,null,null,null,null,null,null,null,null,null,null,null,null,null,null,0]
[null,null,null,null,null,null,null,null,null,null,null,null,null,null,null,null,0]
[null,null,null,null,null,null,null,null,null,null,null,null,null,null,null,null,0]
[null,null,null,null,null,null,null,null,null,null,null,null,null,null,null,null,0]
[null,null,null,null,null,null,null,null,null,null,null,null,null,null,null,null,0]
[null,null,null,null,null,null,null,null,null,null,null,null,null,null,null,null,0]
[null,null,null,null,null,null,null,null,null,null,null,null,null,null,null,null,{"$f":"IF((P125>0)*(P125<4),10%,IF(P125<0,0,IF((P125>3)*(P125<10),15%,IF(P125>=10,20%,0))))","v":0}]
[null,null,null,null,null,null,null,null,null,null,null,null,null,null,null,null,0]
[null,null,null,null,null,null,null,null,null,null,null,null,null,null,null,null,0]
[null,null,null,null,null,null,null,null,null,null,null,null,null,null,null,null,0]
[null,null,null,null,null,null,null,null,null,null,null,null,null,null,null,null,0]
[null,null,null,null,null,null,null,null,null,null,null,null,null,null,null,null,0]
[null,null,null,null,null,null,null,null,null,null,null,null,null,null,null,null,0]
[null,null,null,null,null,null,null,null,null,null,null,null,null,null,null,null,0]
[null,null,null,null,null,null,null,null,null,null,null,null,null,null,null,null,0]
[null,null,null,null,null,null,null,null,null,null,null,null,null,null,null,null,0]
[null,null,null,null,null,null,null,null,null,null,null,null,null,null,null,null,0]
[null,null,null,null,null,null,null,null,null,null,null,null,null,null,null,null,0]
[null,null,null,null,null,null,null,null,null,null,null,null,null,null,null,null,0]
[null,null,null,null,null,null,null,null,null,null,null,null,null,null,null,null,0]
[null,null,null,null,null,null,null,null,null,null,null,null,null,null,null,null,0]
[null,null,null,null,null,null,null,null,null,null,null,null,null,null,null,null,0]
[null,null,null,null,null,null,null,null,null,null,null,null,null,null,null,null,0]
[null,null,null,null,null,null,null,null,null,null,null,null,null,null,null,null,0]
[null,null,null,null,null,null,null,null,null,null,null,null,null,null,null,null,0]
[null,null,null,null,null,null,null,null,null,null,null,null,null,null,null,null,0]
[null,null,null,null,null,null,null,null,null,null,null,null,null,null,null,null,0]
[null,null,null,null,null,null,null,null,null,null,null,null,null,null,null,null,0]
[null,null,null,null,null,null,null,null,null,null,null,null,null,null,null,null,0]
[null,null,null,null,null,null,null,null,null,null,null,null,null,null,null,null,0]
[null,null,null,null,null,null,null,null,null,null,null,null,null,null,null,null,0]
[null,null,null,null,null,null,null,null,null,null,null,null,null,null,null,null,0]
[null,null,null,null,null,null,null,null,null,null,null,null,null,null,null,null,0]
[null,null,null,null,null,null,null,null,null,null,null,null,null,null,null,null,0]
[null,null,null,null,null,null,null,null,null,null,null,null,null,null,null,null,0]
[null,null,null,null,null,null,null,null,null,null,null,null,null,null,null,null,0]
[null,null,null,null,null,null,null,null,null,null,null,null,null,null,null,null,0]
[null,null,null,null,null,null,null,null,null,null,null,null,null,null,null,null,0]
[null,null,null,null,null,null,null,null,null,null,null,null,null,null,null,null,0]
[null,null,null,null,null,null,null,null,null,null,null,null,null,null,null,null,0]
[null,null,null,null,null,null,null,null,null,null,null,null,null,null,null,null,0]
[null,null,null,null,null,null,null,null,null,null,null,null,null,null,null,null,0]
[null,null,null,null,null,null,null,null,null,null,null,null,null,null,null,null,0]
[null,null,null,null,null,null,null,null,null,null,null,null,null,null,null,null,0]
[null,null,null,null,null,null,null,null,null,null,null,null,null,null,null,null,0]
[null,null,null,null,null,null,null,null,null,null,null,null,null,null,null,null,0]
[null,null,null,null,null,null,null,null,null,null,null,null,null,null,null,null,0]
[null,null,null,null,null,null,null,null,null,null,null,null,null,null,null,null,0]
[null,null,null,null,null,null,null,null,null,null,null,null,null,null,null,null,0]
[null,null,null,null,null,null,null,null,null,null,null,null,null,null,null,null,0]
[null,null,null,null,null,null,null,null,null,null,null,null,null,null,null,null,0]
[null,null,null,null,null,null,null,null,null,null,null,null,null,null,null,null,0]
[null,null,null,null,null,null,null,null,null,null,null,null,null,null,null,null,0]
[null,null,null,null,null,null,null,null,null,null,null,null,null,null,null,null,0]
[null,null,null,null,null,null,null,null,null,null,null,null,null,null,null,null,0]
[null,null,null,null,null,null,null,null,null,null,null,null,null,null,null,null,0]
[null,null,null,null,null,null,null,null,null,null,null,null,null,null,null,null,0]
[null,null,null,null,null,null,null,null,null,null,null,null,null,null,null,null,0]
[null,null,null,null,null,null,null,null,null,null,null,null,null,null,null,null,0]
[null,null,null,null,null,null,null,null,null,null,null,null,null,null,null,null,0]
[null,null,null,null,null,null,null,null,null,null,null,null,null,null,null,null,0]
[null,null,null,null,null,null,null,null,null,null,null,null,null,null,null,null,0]
[null,null,null,null,null,null,null,null,null,null,null,null,null,null,null,null,0]
[null,null,null,null,null,null,null,null,null,null,null,null,null,null,null,null,0]
[null,null,null,null,null,null,null,null,null,null,null,null,null,null,null,null,0]
[null,null,null,null,null,null,null,null,null,null,null,null,null,null,null,null,0]
[null,null,null,null,null,null,null,null,null,null,null,null,null,null,null,null,0]
[null,null,null,null,null,null,null,null,null,null,null,null,null,null,null,null,0]
[null,null,null,null,null,null,null,null,null,null,null,null,null,null,null,null,0]
[null,null,null,null,null,null,null,null,null,null,null,null,null,null,null,null,0]
[null,null,null,null,null,null,null,null,null,null,null,null,null,null,null,null,{"$f":"IF((P189>0)*(P189<4),10%,IF(P189<0,0,IF((P189>3)*(P189<10),15%,IF(P189>=10,20%,0))))","v":0}]
[null,null,null,null,null,null,null,null,null,null,null,null,null,null,null,null,0]
[null,null,null,null,null,null,null,null,null,null,null,null,null,null,null,null,0]
[null,null,null,null,null,null,null,null,null,null,null,null,null,null,null,null,0]
[null,null,null,null,null,null,null,null,null,null,null,null,null,null,null,null,0]
[null,null,null,null,null,null,null,null,null,null,null,null,null,null,null,null,0]
[null,null,null,null,null,null,null,null,null,null,null,null,null,null,null,null,0]
[null,null,null,null,null,null,null,null,null,null,null,null,null,null,null,null,0]
[null,null,null,null,null,null,null,null,null,null,null,null,null,null,null,null,0]
[null,null,null,null,null,null,null,null,null,null,null,null,null,null,null,null,0]
[null,null,null,null,null,null,null,null,null,null,null,null,null,null,null,null,0]
[null,null,null,null,null,null,null,null,null,null,null,null,null,null,null,null,0]
{"$rows_left_out":1104}