{"text_format":"1","workbook":"xlsx","n_sheets":2,"sheets":["Лист1","Лист2"],"not_rendered":{"charts":0,"images":1,"macros":1,"external_links":0,"defined_names":0,"comments":0,"pivot_tables":0},"unopened":[],"bounds":{"document_bytes":16777216,"sheet_cells":100000,"rows_first":2000,"rows_last":500,"rows_between":2000,"halvings":0,"cell_chars":16384,"cell_head_chars":4096},"cells_cut":0,"cells_raw":0,"read":"whole","date_system":"1900"}

{"sheet":"Лист1","index":0,"n_rows":85,"n_cols":18,"rows_kept":85,"cut":false,"hidden":false,"merged":[[13,21,13,24],[14,21,14,24],[15,21,15,24],[13,12,15,12],[13,13,15,13],[13,14,15,14],[13,15,15,15],[13,16,15,16],[13,17,15,17],[13,11,15,11],[0,0,8,17],[9,0,9,17],[10,0,11,17],[12,0,12,17],[13,0,15,0],[13,1,15,1],[13,2,15,2],[13,3,15,3],[13,4,15,4],[13,5,15,5],[13,6,15,6],[13,7,15,7],[13,8,15,8],[13,9,15,9],[13,10,15,10]]}
[]
[]
[]
[]
[]
[]
[]
[]
[]
[]
[]
[]
[]
["№","Произ-ль","код",null,null,null,null,"Изготовление  (рабочие дни).",null,null,null,null,"Дата согласования ","Дата готовности ","Ориетировочная дата отправки","Ориентировочная дата поступления","Счет №","ОТДАНО на оплату в ОМТС"]
[]
[]
[null,"Гарант","ПДН-3197",null,null,null,null,0,null,null,null,null,"2018-11-15","2018-11-29"]
[null,"Гарант","ПДН-1120",null,null,null,null,16,null,null,null,null,"2018-11-01",{"$f":"WORKDAY(M18,H18)","v":"2018-11-23"}]
[null,"Гарант","ПДН-4288",null,null,null,null,16,null,null,null,null,"2018-11-01","2018-11-23"]
[null,"Гарант","ПДН-3384",null,null,null,null,16,null,null,null,null,"на согласовании",{"$error":"#VALUE!"}]
[null,"Гарант","ПДН-3835",null,null,null,null,10,null,null,null,null,"2018-07-10","2018-07-24"]
[null,"Гарант","ПДН-0549",null,null,null,null,16,null,null,null,null,"2018-07-13","2018-08-06"]
[null,"Урбан","ПДН-3474",null,null,null,null,14,null,null,null,null,"на согласовании",{"$error":"#VALUE!"}]
[null,"Урбан","ПДН-3475",null,null,null,null,14,null,null,null,null,"на согласовании",{"$error":"#VALUE!"}]
[null,"Урбан","ПДН-3476",null,null,null,null,14,null,null,null,null,"на согласовании",{"$error":"#VALUE!"}]
[null,"Урбан","ПДН-3477",null,null,null,null,14,null,null,null,null,"на согласовании",{"$error":"#VALUE!"}]
[null,"Урбан","ПДН-4313",null,null,null,null,14,null,null,null,null,"на согласовании",{"$error":"#VALUE!"}]
[null,"Урбан","ПДН-4311",null,null,null,null,14,null,null,null,null,"2018-07-25","2018-08-14"]
[null,"Урбан","ПДН-4312",null,null,null,null,14,null,null,null,null,"2018-07-25","2018-08-14"]
[null,"Урбан","Вставка ПДН-4312",null,null,null,null,14,null,null,null,null,"2018-07-25","2018-08-14"]
[null,"Гарант","ПДН-4295",null,null,null,null,16,null,null,null,null,"18.07.18 (12:40)",{"$error":"#VALUE!"}]
[null,"Гарант","ПДН-4254",null,null,null,null,10,null,null,null,null,"2018-07-20","2018-08-03"]
[null,"Гарант","ПДН-4255",null,null,null,null,10,null,null,null,null,"2018-07-23","2018-08-06"]
[null,"Гарант","ПДН-4328",null,null,null,null,10,null,null,null,null,"2018-07-30","2018-08-13"]
[null,"Гарант","ПДН-4329",null,null,null,null,12,null,null,null,null,"2018-07-27T09:40:00","2018-08-14"]
[null,"Гарант","ПДН-4287",null,null,null,null,10,null,null,null,null,"на согласовании",{"$error":"#VALUE!"}]
[null,"Гарант","ПДН-0156",null,null,null,null,10,null,null,null,null,"на согласовании",{"$error":"#VALUE!"}]
[null,"Гарант","ПДН-4355",null,null,null,null,14,null,null,null,null,"нет",{"$error":"#VALUE!"}]
[null,"Гарант","ПДН-0586",null,null,null,null,14,null,null,null,null,null,"1900-01-19"]
[null,"Гарант","ПДН-4305",null,null,null,null,16,null,null,null,null,null,"1900-01-23"]
[null,"Гарант","ПДН-4308",null,null,null,null,12,null,null,null,null,null,"1900-01-17"]
[null,"Урбан","ПДН-4487",null,null,null,null,null,null,null,null,null,"2018-11-08","2018-11-08"]
[null,"Урбан","ПДН-4488",null,null,null,null,null,null,null,null,null,"2018-11-07","2018-11-07"]
[null,"Урбан","ПДН-4489",null,null,null,null,null,null,null,null,null,"2018-11-07","2018-11-07"]
[null,"Урбан","ПДН-2438",null,null,null,null,null,null,null,null,null,"2018-11-09","2018-11-09"]
[null,"Урбан","ПДН-4257",null,null,null,null,null,null,null,null,null,"2018-11-07","2018-11-07"]
[null,"Гарант","ПДН-4409",null,null,null,null,null,null,null,null,null,"2018-10-19","2018-10-19"]
[null,"Гарант","ПДН-4410",null,null,null,null,null,null,null,null,null,"2018-10-19","2018-10-19"]
[null,"Гарант","ПДН-4411",null,null,null,null,null,null,null,null,null,"2018-10-19",{"$f":"WORKDAY(M49,H49)","v":"2018-10-19"}]
[null,"Гарант","ПДН-4412",null,null,null,null,null,null,null,null,null,"2018-10-25","2018-10-25"]
[null,"Гарант","ПДН-4413+вставка",null,null,null,null,null,null,null,null,null,"2018-10-22","2018-10-22"]
[null,"Гарант","ПДН-4439",null,null,null,null,null,null,null,null,null,"2018-10-19","2018-10-19"]
[null,"Гарант","ПДН-4425+вставка",null,null,null,null,null,null,null,null,null,"2018-10-19","2018-10-19"]
[null,"Гарант","ПДН-4391",null,null,null,null,null,null,null,null,null,"2018-10-23","2018-10-23"]
[null,"Гарант","ПДН-4392",null,null,null,null,null,null,null,null,null,"2018-10-30","2018-10-30"]
[null,"Гарант","ПДН-1966",null,null,null,null,null,null,null,null,null,"2018-10-26","2018-10-26"]
[null,"Гарант","ПДН-4472",null,null,null,null,null,null,null,null,null,"2018-10-23","2018-10-23"]
[null,"Гарант","ПДН-0592",null,null,null,null,null,null,null,null,null,"2018-10-22","2018-10-22"]
[null,"Гарант","ПДН-4479",null,null,null,null,null,null,null,null,null,"2018-10-24","2018-10-24"]
[null,"Гарант","ПДН-4455",null,null,null,null,12,null,null,null,null,"2018-10-25","2018-11-12"]
[null,"Гарант","ПДН-4448",null,null,null,null,8,null,null,null,null,"2018-10-26","2018-11-07"]
[null,"Гарант","ПДН-4481",null,null,null,null,12,null,null,null,null,"2018-10-25","2018-11-12"]
[null,"Гарант","ПДН-4449",null,null,null,null,14,null,null,null,null,"2018-10-29","2018-11-16"]
[null,"Гарант","ПДН-1907",null,null,null,null,12,null,null,null,null,"2018-10-26","2018-11-13"]
[null,"Гарант","ПДН-4437",null,null,null,null,12,null,null,null,null,"2018-10-26","2018-11-13"]
[null,"Гарант","ПДН-4482",null,null,null,null,10,null,null,null,null,"2018-10-30","2018-11-13"]
[null,"Гарант","ПДН-4241",null,null,null,null,14,null,null,null,null,"2018-10-29","2018-11-16"]
[null,"Гарант","ПДН-2327",null,null,null,null,14,null,null,null,null,"2018-10-30","2018-11-19"]
[null,"Гарант","ПДН-0592",null,null,null,null,12,null,null,null,null,"2018-10-31","2018-11-16"]
[null,"Гарант","ПДН-4480",null,null,null,null,8,null,null,null,null,"2018-11-07","2018-11-19"]
[null,"Гарант","ПДН-0551",null,null,null,null,12,null,null,null,null,"2018-11-14","2018-11-30"]
[null,"Гарант","ПДН-4478",null,null,null,null,16,null,null,null,null,"2018-11-14","2018-12-06"]
[null,"Гарант","ПДН-4493",null,null,null,null,"12-14",null,null,null,null,"2018-11-08","2179-09-29"]
[null,"Гарант","ПДН-0060",null,null,null,null,10,null,null,null,null,"2018-11-14","2018-11-28"]
[null,"Гарант","ПДН-4490",null,null,null,null,8,null,null,null,null,"2018-11-14","2018-11-26"]
[null,"Гарант","ПДН-4491",null,null,null,null,12,null,null,null,null,"2018-11-14","2018-11-30"]
[null,"Гарант","ПДН-4492",null,null,null,null,12,null,null,null,null,"2018-11-14","2018-11-30"]
[null,"Гарант","Субболстер",null,null,null,null,null,null,null,null,null,"2018-11-14","2018-11-14"]
[null,"Гарант","ПДН-3931",null,null,null,null,8,null,null,null,null,null,"1900-01-11"]
[null,"Гарант","ПДН-4198",null,null,null,null,12,null,null,null,null,null,"1900-01-17"]
[null,"Гарант","ПДН-0528",null,null,null,null,16,null,null,null,null,null,{"$f":"WORKDAY(M81,H81)","v":"1900-01-23"}]
[null,"Гарант","ПДН-0061",null,null,null,null,10,null,null,null,null,null,"1900-01-13"]
[null,"Гарант","ПДН-4495",null,null,null,null,8,null,null,null,null,null,"1900-01-11"]
[null,"Гарант","ПДН-4496",null,null,null,null,6,null,null,null,null,null,"1900-01-09"]
[null,"Гарант","ПДН-2206",null,null,null,null,14,null,null,null,null,null,"1900-01-19"]

{"sheet":"Лист2","index":1,"n_rows":10,"n_cols":5,"rows_kept":10,"cut":false,"hidden":false,"merged":[]}
[]
[{"$f":"IFERROR(INDEX(Лист1!$B$17:$B$85,SMALL(IF(ISNUMBER(Лист1!$N$17:$N$85),IF(Лист1!$N$17:$N$85=$E$2+3,ROW(Лист1!$B$17:$B$85)-16),\"\"),ROW(A1))),\"\")","v":"Гарант"},{"$f":"IFERROR(INDEX(Лист1!$C$17:$C$85,SMALL(IF(ISNUMBER(Лист1!$N$17:$N$85),IF(Лист1!$N$17:$N$85=$E$2+3,ROW(Лист1!$B$17:$B$85)-16),\"\"),ROW(A1))),\"\")","v":"ПДН-3197"},{"$f":"IFERROR(INDEX(Лист1!$N$17:$N$85,SMALL(IF(ISNUMBER(Лист1!$N$17:$N$85),IF(Лист1!$N$17:$N$85=$E$2+3,ROW(Лист1!$B$17:$B$85)-16),\"\"),ROW(A1))),\"\")","v":"2018-11-29"},null,{"$f":"TODAY()","v":"2018-11-26"}]
[{"$f":"IFERROR(INDEX(Лист1!$B$17:$B$85,SMALL(IF(ISNUMBER(Лист1!$N$17:$N$85),IF(Лист1!$N$17:$N$85=$E$2+3,ROW(Лист1!$B$17:$B$85)-16),\"\"),ROW(A2))),\"\")","v":""},{"$f":"IFERROR(INDEX(Лист1!$C$17:$C$85,SMALL(IF(ISNUMBER(Лист1!$N$17:$N$85),IF(Лист1!$N$17:$N$85=$E$2+3,ROW(Лист1!$B$17:$B$85)-16),\"\"),ROW(A2))),\"\")","v":""},{"$f":"IFERROR(INDEX(Лист1!$N$17:$N$85,SMALL(IF(ISNUMBER(Лист1!$N$17:$N$85),IF(Лист1!$N$17:$N$85=$E$2+3,ROW(Лист1!$B$17:$B$85)-16),\"\"),ROW(A2))),\"\")","v":""}]
[{"$f":"IFERROR(INDEX(Лист1!$B$17:$B$85,SMALL(IF(ISNUMBER(Лист1!$N$17:$N$85),IF(Лист1!$N$17:$N$85=$E$2+3,ROW(Лист1!$B$17:$B$85)-16),\"\"),ROW(A3))),\"\")","v":""},{"$f":"IFERROR(INDEX(Лист1!$C$17:$C$85,SMALL(IF(ISNUMBER(Лист1!$N$17:$N$85),IF(Лист1!$N$17:$N$85=$E$2+3,ROW(Лист1!$B$17:$B$85)-16),\"\"),ROW(A3))),\"\")","v":""},{"$f":"IFERROR(INDEX(Лист1!$N$17:$N$85,SMALL(IF(ISNUMBER(Лист1!$N$17:$N$85),IF(Лист1!$N$17:$N$85=$E$2+3,ROW(Лист1!$B$17:$B$85)-16),\"\"),ROW(A3))),\"\")","v":""}]
[{"$f":"IFERROR(INDEX(Лист1!$B$17:$B$85,SMALL(IF(ISNUMBER(Лист1!$N$17:$N$85),IF(Лист1!$N$17:$N$85=$E$2+3,ROW(Лист1!$B$17:$B$85)-16),\"\"),ROW(A4))),\"\")","v":""},{"$f":"IFERROR(INDEX(Лист1!$C$17:$C$85,SMALL(IF(ISNUMBER(Лист1!$N$17:$N$85),IF(Лист1!$N$17:$N$85=$E$2+3,ROW(Лист1!$B$17:$B$85)-16),\"\"),ROW(A4))),\"\")","v":""},{"$f":"IFERROR(INDEX(Лист1!$N$17:$N$85,SMALL(IF(ISNUMBER(Лист1!$N$17:$N$85),IF(Лист1!$N$17:$N$85=$E$2+3,ROW(Лист1!$B$17:$B$85)-16),\"\"),ROW(A4))),\"\")","v":""}]
[{"$f":"IFERROR(INDEX(Лист1!$B$17:$B$85,SMALL(IF(ISNUMBER(Лист1!$N$17:$N$85),IF(Лист1!$N$17:$N$85=$E$2+3,ROW(Лист1!$B$17:$B$85)-16),\"\"),ROW(A5))),\"\")","v":""},{"$f":"IFERROR(INDEX(Лист1!$C$17:$C$85,SMALL(IF(ISNUMBER(Лист1!$N$17:$N$85),IF(Лист1!$N$17:$N$85=$E$2+3,ROW(Лист1!$B$17:$B$85)-16),\"\"),ROW(A5))),\"\")","v":""},{"$f":"IFERROR(INDEX(Лист1!$N$17:$N$85,SMALL(IF(ISNUMBER(Лист1!$N$17:$N$85),IF(Лист1!$N$17:$N$85=$E$2+3,ROW(Лист1!$B$17:$B$85)-16),\"\"),ROW(A5))),\"\")","v":""}]
[{"$f":"IFERROR(INDEX(Лист1!$B$17:$B$85,SMALL(IF(ISNUMBER(Лист1!$N$17:$N$85),IF(Лист1!$N$17:$N$85=$E$2+3,ROW(Лист1!$B$17:$B$85)-16),\"\"),ROW(A6))),\"\")","v":""},{"$f":"IFERROR(INDEX(Лист1!$C$17:$C$85,SMALL(IF(ISNUMBER(Лист1!$N$17:$N$85),IF(Лист1!$N$17:$N$85=$E$2+3,ROW(Лист1!$B$17:$B$85)-16),\"\"),ROW(A6))),\"\")","v":""},{"$f":"IFERROR(INDEX(Лист1!$N$17:$N$85,SMALL(IF(ISNUMBER(Лист1!$N$17:$N$85),IF(Лист1!$N$17:$N$85=$E$2+3,ROW(Лист1!$B$17:$B$85)-16),\"\"),ROW(A6))),\"\")","v":""}]
[{"$f":"IFERROR(INDEX(Лист1!$B$17:$B$85,SMALL(IF(ISNUMBER(Лист1!$N$17:$N$85),IF(Лист1!$N$17:$N$85=$E$2+3,ROW(Лист1!$B$17:$B$85)-16),\"\"),ROW(A7))),\"\")","v":""},{"$f":"IFERROR(INDEX(Лист1!$C$17:$C$85,SMALL(IF(ISNUMBER(Лист1!$N$17:$N$85),IF(Лист1!$N$17:$N$85=$E$2+3,ROW(Лист1!$B$17:$B$85)-16),\"\"),ROW(A7))),\"\")","v":""},{"$f":"IFERROR(INDEX(Лист1!$N$17:$N$85,SMALL(IF(ISNUMBER(Лист1!$N$17:$N$85),IF(Лист1!$N$17:$N$85=$E$2+3,ROW(Лист1!$B$17:$B$85)-16),\"\"),ROW(A7))),\"\")","v":""}]
[{"$f":"IFERROR(INDEX(Лист1!$B$17:$B$85,SMALL(IF(ISNUMBER(Лист1!$N$17:$N$85),IF(Лист1!$N$17:$N$85=$E$2+3,ROW(Лист1!$B$17:$B$85)-16),\"\"),ROW(A8))),\"\")","v":""},{"$f":"IFERROR(INDEX(Лист1!$C$17:$C$85,SMALL(IF(ISNUMBER(Лист1!$N$17:$N$85),IF(Лист1!$N$17:$N$85=$E$2+3,ROW(Лист1!$B$17:$B$85)-16),\"\"),ROW(A8))),\"\")","v":""},{"$f":"IFERROR(INDEX(Лист1!$N$17:$N$85,SMALL(IF(ISNUMBER(Лист1!$N$17:$N$85),IF(Лист1!$N$17:$N$85=$E$2+3,ROW(Лист1!$B$17:$B$85)-16),\"\"),ROW(A8))),\"\")","v":""}]
[{"$f":"IFERROR(INDEX(Лист1!$B$17:$B$85,SMALL(IF(ISNUMBER(Лист1!$N$17:$N$85),IF(Лист1!$N$17:$N$85=$E$2+3,ROW(Лист1!$B$17:$B$85)-16),\"\"),ROW(A9))),\"\")","v":""},{"$f":"IFERROR(INDEX(Лист1!$C$17:$C$85,SMALL(IF(ISNUMBER(Лист1!$N$17:$N$85),IF(Лист1!$N$17:$N$85=$E$2+3,ROW(Лист1!$B$17:$B$85)-16),\"\"),ROW(A9))),\"\")","v":""},{"$f":"IFERROR(INDEX(Лист1!$N$17:$N$85,SMALL(IF(ISNUMBER(Лист1!$N$17:$N$85),IF(Лист1!$N$17:$N$85=$E$2+3,ROW(Лист1!$B$17:$B$85)-16),\"\"),ROW(A9))),\"\")","v":""}]