{"text_format":"1","workbook":"xlsx","n_sheets":2,"sheets":["Выходы","Иванов"],"not_rendered":{"charts":0,"images":0,"macros":1,"external_links":0,"defined_names":0,"comments":0,"pivot_tables":0},"unopened":[],"bounds":{"document_bytes":16777216,"sheet_cells":100000,"rows_first":2000,"rows_last":500,"rows_between":2000,"halvings":0,"cell_chars":16384,"cell_head_chars":4096},"cells_cut":0,"cells_raw":0,"read":"whole","date_system":"1900"}

{"sheet":"Выходы","index":0,"n_rows":9,"n_cols":4,"rows_kept":9,"cut":false,"hidden":false,"merged":[]}
[null,"Событие","Время","Фамилия"]
["01.02.2013","Вход","2013-02-01T08:51:27","Иванов"]
["01.02.2013","Выход","2013-02-01T15:58:03","Иванов"]
["01.02.2013","Вход","2013-02-01T16:05:17","Иванов"]
["01.02.2013","Выход","2013-02-02T00:02:27","Иванов"]
["04.02.2013","Вход","2013-02-04T13:31:22","Иванов"]
["04.02.2013","Выход","2013-02-04T17:03:21","Иванов"]
["05.02.2013","Вход","2013-02-05T07:39:56","Иванов"]
["05.02.2013","Выход","2013-02-05T17:02:37","Иванов"]

{"sheet":"Иванов","index":1,"n_rows":10,"n_cols":12,"rows_kept":10,"cut":false,"hidden":false,"merged":[]}
[{"$f":"MID(CELL(\"filename\",A1),SEARCH(\"]\",CELL(\"filename\"))+1,255)","v":"Иванов"}]
[]
[null,null,"01.02.2013","02.02.2013","03.02.2013","04.02.2013","05.02.2013","06.02.2013","07.02.2013","08.02.2013","09.02.2013","10.02.2013"]
[null,null,"пятница","суббота","воскресенье","понедельник","вторник","среда","четверг","пятница","суббота","воскресенье"]
["Вход",null,{"$f":"IFERROR(INDEX(Выходы!$C$2:$C$32065,MATCH($A$1&C$3&$A$5,Выходы!$D$2:$D$32065&Выходы!$A$2:$A$32065&Выходы!$B$2:$B$32065,0)),\"\")","v":"2013-02-01T08:51:27"},{"$f":"IFERROR(INDEX(Выходы!$C$2:$C$32065,MATCH($A$1&D$3&$A$5,Выходы!$D$2:$D$32065&Выходы!$A$2:$A$32065&Выходы!$B$2:$B$32065,0)),\"\")","v":""},{"$f":"IFERROR(INDEX(Выходы!$C$2:$C$32065,MATCH($A$1&E$3&$A$5,Выходы!$D$2:$D$32065&Выходы!$A$2:$A$32065&Выходы!$B$2:$B$32065,0)),\"\")","v":""},{"$f":"IFERROR(INDEX(Выходы!$C$2:$C$32065,MATCH($A$1&F$3&$A$5,Выходы!$D$2:$D$32065&Выходы!$A$2:$A$32065&Выходы!$B$2:$B$32065,0)),\"\")","v":"2013-02-04T13:31:22"},{"$f":"IFERROR(INDEX(Выходы!$C$2:$C$32065,MATCH($A$1&G$3&$A$5,Выходы!$D$2:$D$32065&Выходы!$A$2:$A$32065&Выходы!$B$2:$B$32065,0)),\"\")","v":"2013-02-05T07:39:56"},{"$f":"IFERROR(INDEX(Выходы!$C$2:$C$32065,MATCH($A$1&H$3&$A$5,Выходы!$D$2:$D$32065&Выходы!$A$2:$A$32065&Выходы!$B$2:$B$32065,0)),\"\")","v":""},{"$f":"IFERROR(INDEX(Выходы!$C$2:$C$32065,MATCH($A$1&I$3&$A$5,Выходы!$D$2:$D$32065&Выходы!$A$2:$A$32065&Выходы!$B$2:$B$32065,0)),\"\")","v":""},{"$f":"IFERROR(INDEX(Выходы!$C$2:$C$32065,MATCH($A$1&J$3&$A$5,Выходы!$D$2:$D$32065&Выходы!$A$2:$A$32065&Выходы!$B$2:$B$32065,0)),\"\")","v":""},{"$f":"IFERROR(INDEX(Выходы!$C$2:$C$32065,MATCH($A$1&K$3&$A$5,Выходы!$D$2:$D$32065&Выходы!$A$2:$A$32065&Выходы!$B$2:$B$32065,0)),\"\")","v":""},{"$f":"IFERROR(INDEX(Выходы!$C$2:$C$32065,MATCH($A$1&L$3&$A$5,Выходы!$D$2:$D$32065&Выходы!$A$2:$A$32065&Выходы!$B$2:$B$32065,0)),\"\")","v":""}]
["Выход",null,{"$f":"IFERROR(INDEX(Выходы!$C$2:$C$32065,MATCH($A$1&C$3&$A$6,Выходы!$D$2:$D$32065&Выходы!$A$2:$A$32065&Выходы!$B$2:$B$32065,0)),\"\")","v":"2013-02-01T15:58:03"},{"$f":"IFERROR(INDEX(Выходы!$C$2:$C$32065,MATCH($A$1&D$3&$A$6,Выходы!$D$2:$D$32065&Выходы!$A$2:$A$32065&Выходы!$B$2:$B$32065,0)),\"\")","v":""},{"$f":"IFERROR(INDEX(Выходы!$C$2:$C$32065,MATCH($A$1&E$3&$A$6,Выходы!$D$2:$D$32065&Выходы!$A$2:$A$32065&Выходы!$B$2:$B$32065,0)),\"\")","v":""},{"$f":"IFERROR(INDEX(Выходы!$C$2:$C$32065,MATCH($A$1&F$3&$A$6,Выходы!$D$2:$D$32065&Выходы!$A$2:$A$32065&Выходы!$B$2:$B$32065,0)),\"\")","v":"2013-02-04T17:03:21"},{"$f":"IFERROR(INDEX(Выходы!$C$2:$C$32065,MATCH($A$1&G$3&$A$6,Выходы!$D$2:$D$32065&Выходы!$A$2:$A$32065&Выходы!$B$2:$B$32065,0)),\"\")","v":"2013-02-05T17:02:37"},{"$f":"IFERROR(INDEX(Выходы!$C$2:$C$32065,MATCH($A$1&H$3&$A$6,Выходы!$D$2:$D$32065&Выходы!$A$2:$A$32065&Выходы!$B$2:$B$32065,0)),\"\")","v":""},{"$f":"IFERROR(INDEX(Выходы!$C$2:$C$32065,MATCH($A$1&I$3&$A$6,Выходы!$D$2:$D$32065&Выходы!$A$2:$A$32065&Выходы!$B$2:$B$32065,0)),\"\")","v":""},{"$f":"IFERROR(INDEX(Выходы!$C$2:$C$32065,MATCH($A$1&J$3&$A$6,Выходы!$D$2:$D$32065&Выходы!$A$2:$A$32065&Выходы!$B$2:$B$32065,0)),\"\")","v":""},{"$f":"IFERROR(INDEX(Выходы!$C$2:$C$32065,MATCH($A$1&K$3&$A$6,Выходы!$D$2:$D$32065&Выходы!$A$2:$A$32065&Выходы!$B$2:$B$32065,0)),\"\")","v":""},{"$f":"IFERROR(INDEX(Выходы!$C$2:$C$32065,MATCH($A$1&L$3&$A$6,Выходы!$D$2:$D$32065&Выходы!$A$2:$A$32065&Выходы!$B$2:$B$32065,0)),\"\")","v":""}]
["Общее время"]
["Время вне здания"]
["Время внутри здания"]
["Кол-во выходов из здания"]