{"text_format":"1","workbook":"xlsx","n_sheets":8,"sheets":["Ввод данных","Анкета","База клиентов","Списки","Боксы","Багажники","Велокрепления","Лыжи"],"not_rendered":{"charts":0,"images":3,"macros":1,"external_links":0,"defined_names":11,"comments":1,"pivot_tables":0},"unopened":[],"bounds":{"document_bytes":16777216,"sheet_cells":100000,"rows_first":2000,"rows_last":500,"rows_between":2000,"halvings":0,"cell_chars":16384,"cell_head_chars":4096},"cells_cut":0,"cells_raw":0,"read":"whole","date_system":"1900"}

{"sheet":"Ввод данных","index":0,"n_rows":20,"n_cols":8,"rows_kept":20,"cut":false,"hidden":false,"merged":[[19,2,19,3],[19,5,19,7],[16,2,16,7],[17,2,17,3],[18,2,18,3],[17,5,17,7],[18,5,18,7],[0,5,0,7],[5,5,5,6],[1,5,3,7],[0,1,0,2],[1,1,1,2],[2,1,2,2],[3,1,3,2],[4,1,4,2],[4,5,4,7],[14,2,15,3],[7,5,7,6],[7,1,7,4],[8,0,8,7],[5,1,5,2],[6,1,6,2]]}
["Фамилия:",null,null,"Когда выдан:",null,{"$f":"IF(OR(B1=\"\",B2=\"\",B3=\"\",B4=\"\",B5=\"\",B6=\"\",B7=\"\",B8=\"\",E1=\"\",E2=\"\",E3=\"\",E4=\"\",E5=\"\",E6=\"\",E7=\"\"),\"ВНИМАНИЕ!\",\"Договор заполнен верно\")","v":"ВНИМАНИЕ!"}]
["Имя:",null,null,"Адрес прописки, регистрации:",null,{"$f":"IF(F1=\"Внимание!\",IF(AND(B1=\"\",B2=\"\",B3=\"\",B4=\"\",B5=\"\",B6=\"\",B7=\"\",B8=\"\",E1=\"\",E2=\"\",E3=\"\",E4=\"\",E5=\"\",E6=\"\",E7=\"\"),\"Если Вы раньше пользовались нашими услугами, то начните ввод данных с:\"&CHAR(10)&CHAR(10)&\"НОМЕРА ТЕЛЕФОНА\"&CHAR(10)&\"или\"&CHAR(10)&\"СЕРИИ И НОМЕРА ПАСПОРТА\"&CHAR(10)&\"или\"&CHAR(10)&\"ГОС. НОМЕРА АВТОМОБИЛЯ\",IF(B1=\"\",\"Введите фамилию!\",\"\")&IF(B1=\"\",CHAR(10),\"\")&IF(B2=\"\",\"Введите имя!\",\"\")&IF(B2=\"\",CHAR(10),\"\")&IF(B3=\"\",\"Введите отчество!\",\"\")&IF(B3=\"\",CHAR(10),\"\")&IF(B4=\"\",\"Введите телефон!\",\"\")&IF(B4=\"\",CHAR(10),\"\")&IF(B5=\"\",\"Укажите документ!\",\"\")&IF(B5=\"\",CHAR(10),\"\")&IF(B6=\"\",\"Введите серию документа!\",\"\")&IF(B6=\"\",CHAR(10),\"\")&IF(B7=\"\",\"Введите номер документа!\",\"\")&IF(B7=\"\",CHAR(10),\"\")&IF(B8=\"\",\"Укажите кем выдан документ!\",\"\")&IF(B8=\"\",CHAR(10),\"\")&IF(E1=\"\",\"Укажите когда выдан документ!\",\"\")&IF(E1=\"\",CHAR(10),\"\")&IF(E2=\"\",\"Впишите адрес прописки!\",\"\")&IF(E2=\"\",CHAR(10),\"\")&IF(E3=\"\",\"Впишите адрес фактического проживания!\",\"\")&IF(E3=\"\",CHAR(10),\"\")&IF(E4=\"\",\"Укажите марку автомобиля!\",\"\")&IF(E4=\"\",CHAR(10),\"\")&IF(E5=\"\",\"Укажите модель автомобиля!\",\"\")&IF(E5=\"\",CHAR(10),\"\")&IF(E6=\"\",\"Введите год выпуска автомобиля!\",\"\")&IF(E6=\"\",CHAR(10),\"\")&IF(E7=\"\",\"Впишите гос. номер автомобиля!\",\"\")),\"Благодарим Вас за обращение в нашу компанию!\"&CHAR(10)&\"Счастливого пути и приятного путешествия с командой #ROOFRACKCREW\"&CHAR(10)&\"Будем рады видеть Вас снова =)\"&CHAR(10)&CHAR(10)&CHAR(10)&\"⬇ Нажмите кнопку ЗАПИСАТЬ ⬇\")","v":"Если Вы раньше пользовались нашими услугами, то начните ввод данных с:\n\nНОМЕРА ТЕЛЕФОНА\nили\nСЕРИИ И НОМЕРА ПАСПОРТА\nили\nГОС. НОМЕРА АВТОМОБИЛЯ"}]
["Отчество:",null,null,"Адрес фактического проживания:"]
["Контактный телефон:",null,null,"Марка автомобиля:"]
["Документ:",null,null,"Модель автомобиля:"]
["Серия:",null,null,"Год выпуска автомобиля:",null,"Номер договора:\n(вводится менеджером)"]
["Номер:",null,null,"Гос. номер:",null,{"$f":"IFERROR(INDEX('База клиентов'!A:Q,MATCH(B4,'База клиентов'!D:D,0),17),0)","v":0},"Скидка:\n(вводится менеджером)"]
["Кем выдан:",null,null,null,null,"Оплата:\n(вводится менеджером)"]
["Информация об арендуемом оборудовании заполняется менеджером"]
["Наименование","Модель оборудования","Кол-во","Инвентарный номер","Оценочная стоимость","₽ в сутки","Начало проката","Конец проката"]
["Автобокс:",null,null,null,{"$f":"IFERROR(INDEX(Боксы!A2:B62,MATCH(B11,Боксы!A2:A63,0),2),\"\")","v":""},{"$f":"IFERROR(IF(OR(G11=\"\",H11=\"\"),\"\",INDEX(Боксы!A2:P63,MATCH(B11,Боксы!A2:A63,0),IF(H16<=6,3,IF(AND(H16>6,H16<=13),4,IF(AND(H16>13,H16<=20),5,IF(AND(H16>20,H16<=29),6,IF(AND(H16>29,H16<=39),7,IF(H16=\"Тариф НГ\",9,IF(H16>39,8,1))))))))),\"\")","v":""}]
["Автобагажник:",null,null,null,{"$f":"IFERROR(INDEX(Багажники!A2:D16,MATCH(B12,Багажники!A2:A66,0),IF(LEFT(D12,3)=\"757\",2,IF(LEFT(D12,3)=\"775\",3,IF(LEFT(D12,3)=\"751\",4,IF(LEFT(D12,3)=\"753\",4,IF(LEFT(D12,3)=\"754\",4,2)))))),\"\")","v":""},{"$f":"IFERROR(IF(OR(G12=\"\",H12=\"\"),\"\",INDEX(Багажники!A2:P65,MATCH(B12,Багажники!A2:A65,0),IF(H16<=6,5,IF(AND(H16>6,H16<=13),6,IF(AND(H16>13,H16<=20),7,IF(AND(H16>20,H16<=29),8,IF(AND(H16>29,H16<=39),9,IF(H16=\"Тариф НГ\",11,IF(H16>39,10,1))))))))),\"\")","v":""}]
["Велокрепление:",null,null,{"$f":"IF(B13>0,\"-------------------------\",\"\")","v":""},{"$f":"IFERROR(INDEX(Велокрепления!A2:B6,MATCH(B13,Велокрепления!A2:A60,0),2),\"\")","v":""},{"$f":"IFERROR(IF(OR(G13=\"\",H13=\"\"),\"\",INDEX(Велокрепления!A2:P60,MATCH(B13,Велокрепления!A2:A60,0),IF(H16<=6,3,IF(AND(H16>6,H16<=13),4,IF(AND(H16>13,H16<=20),5,IF(AND(H16>20,H16<=29),6,IF(AND(H16>29,H16<=39),7,IF(H16=\"Тариф НГ\",9,IF(H16>39,8,1))))))))),\"\")","v":""}]
["Крепление для лыж и сноуборда:",null,null,{"$f":"IF(B14>0,\"-------------------------\",\"\")","v":""},{"$f":"IFERROR(INDEX(Лыжи!A3:B8,MATCH(B14,Лыжи!A3:A62,0),2),\"\")","v":""},{"$f":"IFERROR(IF(OR(G14=\"\",H14=\"\"),\"\",INDEX(Лыжи!A2:P60,MATCH(B14,Лыжи!A2:A60,0),IF(H16<=6,3,IF(AND(H16>6,H16<=13),4,IF(AND(H16>13,H16<=20),5,IF(AND(H16>20,H16<=29),6,IF(AND(H16>29,H16<=39),7,IF(H16=\"Тариф НГ\",9,IF(H16>39,8,1))))))))),\"\")","v":""}]
["Внесено:",null,"Калькулятор\nрассчета дней:\n(нужно указать начало проката)",null,"На количество дней:",null,"Залог:"]
["Полная стоимость:",{"$f":"#REF!","v":{"$error":"#REF!"}},null,null,"Дата окончания аренды:",{"$f":"IF(IF(G11>0,G11+F15,IF(G12>0,G12+F15,G13+F15))=0,\"\",IF(G11>0,G11+F15,IF(G12>0,G12+F15,G13+F15)))","v":""},"Кол-во дней:",{"$f":"IF(AND(DATE(YEAR(G11),DAY(12),DAY(1))=G11,DATE(YEAR(H11),DAY(1),DAY(31))=H11),\"Тариф НГ\",IF(AND(DATE(YEAR(G12),DAY(12),DAY(1))=G12,DATE(YEAR(H12),DAY(1),DAY(31))),\"Тариф НГ\",IF(AND(DATE(YEAR(G13),DAY(12),DAY(1))=G13,DATE(YEAR(H13),DAY(1),DAY(31))),\"Тариф НГ\",IF(AND(DATE(YEAR(G14),DAY(12),DAY(1))=G14,DATE(YEAR(H14),DAY(1),DAY(31))),\"Тариф НГ\",IF(B11>0,#REF!,IF(B12>0,#REF!,IF(B13>0,#REF!,IF(B14>0,#REF!,\"\"))))))))","v":""}]
["Комментарий \nк автобоксу:",null,"Доставка"]
["Комментарий \nк автобагажнику:",null,"Услуга:",null,null,"Адрес:"]
["Комментарий \nк велокреплению:",null,"Стоимость:"]
["Откуда узнали о нас:",null,"E-Mail клиента:"]

{"sheet":"Анкета","index":1,"n_rows":25,"n_cols":4,"rows_kept":25,"cut":false,"hidden":false,"merged":[[5,0,5,1],[0,0,0,2]]}
["Анкета нового клиента"]
["⬇ Вставить полный текст письма сюда ⬇"]
["Привет, клиент Пелех Мария заполнил(а) анкету:"]
[]
["Вы уже брали у нас в аренду?","Нет"]
["Пожалуйста, введите следующие данные"]
["Фамилия","Пелех",{"$f":"UPPER(LEFT(B7))&RIGHT(LOWER(B7),LEN(B7)-1)","v":"Пелех"},"Копировать значения нужно из столбика C и вставлять их в нужные ячейки на листе \"Ввод данных\""]
["Имя","Мария",{"$f":"UPPER(LEFT(B8))&RIGHT(LOWER(B8),LEN(B8)-1)","v":"Мария"}]
["Отчество","Николаевна","Николаевна"]
["Контактный номер телефона",89265959698,{"$f":"8&MID(SUBSTITUTE(SUBSTITUTE(SUBSTITUTE(SUBSTITUTE(B10,\"(\",),\")\",),\"-\",),\" \",),2,99)","v":"89265959698"}]
["Документ для оформления договора","В/У",{"$f":"B11","v":"В/У"}]
["Серия документа",7723,{"$f":"UPPER(SUBSTITUTE(B12,\" \",\"\"))","v":"7723"}]
["Номер документа",244635,{"$f":"UPPER(SUBSTITUTE(B13,\" \",\"\"))","v":"244635"}]
["Кем выдан документ","ГИБДД 7720",{"$f":"B14","v":"ГИБДД 7720"}]
["Когда выдан документ","Apr 04, 2015",{"$f":"DATEVALUE(MID(B15,5,2)&\".\"&IF(LEFT(B15,3)=\"Sep\",\"09\",IF(LEFT(B15,3)=\"Oct\",\"10\",IF(LEFT(B15,3)=\"Nov\",\"11\",IF(LEFT(B15,3)=\"Dec\",\"12\",IF(LEFT(B15,3)=\"Jan\",\"01\",IF(LEFT(B15,3)=\"Feb\",\"02\",IF(LEFT(B15,3)=\"Mar\",\"03\",IF(LEFT(B15,3)=\"Apr\",\"04\",IF(LEFT(B15,3)=\"May\",\"05\",IF(LEFT(B15,3)=\"Jun\",\"06\",IF(LEFT(B15,3)=\"Jul\",\"07\",IF(LEFT(B15,3)=\"Aug\",\"08\",\"\"))))))))))))&\".\"&MID(B15,9,4))","v":"2015-04-04"}]
["Адрес прописки, регистрации","Москва, ореховый проезд,43к2,70",{"$f":"B16","v":"Москва, ореховый проезд,43к2,70"}]
["Адрес фактического проживания","Совпадает",{"$f":"IF(B17=\"Совпадает\",B16,IF(B17=\"Тотже\",B16,IF(B17=\"Тот же\",B16,IF(B17=\"Там же\",B16,IF(B17=\"Тамже\",B16,B17)))))","v":"Москва, ореховый проезд,43к2,70"}]
["Марка автомобиля","Mazda",{"$f":"B18","v":"Mazda"}]
["Модель автомобиля","Cx-5",{"$f":"B19","v":"Cx-5"}]
["Год выпуска автомобиля",2013,{"$f":"B20","v":2013}]
["Гос. номер автомобиля","С775рк777",{"$f":"UPPER(SUBSTITUTE(B21,\" \",\"\"))","v":"С775РК777"}]
["Ваш E-Mail","antowka908@mail.ru",{"$f":"LOWER(B22)","v":"antowka908@mail.ru"}]
[]
[]
["Sent via Google Forms Email"]

{"sheet":"База клиентов","index":2,"n_rows":1275,"n_cols":18,"rows_kept":1275,"cut":false,"hidden":false,"merged":[]}
[null,"В аренде",null,"Рассылка",null,"Совпадение"]
["Фамилия","Имя","Отчество","Номер телефона","Документ","Серия паспорта/ВУ","Номер паспорта/В.У","Кем выдан паспорт","Выдан\n(число/месяц/год)","Адрес места прописки, регистрации","Адрес места фактического проживания","Марка авто","Модель авто","Год выпуска авто","Гос номер","Кол-во аренд","Скидка","E-Mail"]
["Зернов","Константин","Анатольевич",89991112233,"паспорт","4514","550440","УФМС РФ Москвы по р-ну Рязанский","2014-08-11","Илимская д. 10 кв. 78","Новый Арбат д. 1","Mitsubishi","ASX",2013,"К 100 НК 777",1,{"$f":"IF((P3>0)*(P3<4),10%,IF(P3<0,0,IF((P3>3)*(P3<10),15%,IF(P3>=10,20%,0))))","v":0.1},"zernov@mail.ru"]
["Киселёв","Максим","Геннадьевич",89269996677,"паспорт","4600","340043","ОВД Солнечногорского р-на Московской обл.","2000-08-25","Новый Арбат д. 1","Илимская д. 10 кв. 78","Hyundai","Santa Fe",2002,"У 999 ХВ 150",1,0.1]
["Фролов","Алексей","Александрович",84953917172,"паспорт","4507","241324","ОВД р-на Лианозово гор. Москвы","2001-07-06","Ленинградская д. 8 кв. 1","Ленинградская д. 8 кв. 1","MB ","V-250 Bluet",2014,"А 313 ОК 777",1,0.1,"frolov@yandex.ru"]
[null,null,null,null,null,null,null,null,null,null,null,null,null,null,null,null,{"$f":"IF((P6>0)*(P6<4),10%,IF(P6<0,0,IF((P6>3)*(P6<10),15%,IF(P6>=10,20%,0))))","v":0}]
[null,null,null,null,null,null,null,null,null,null,null,null,null,null,null,null,0]
[null,null,null,null,null,null,null,null,null,null,null,null,null,null,null,null,0]
[null,null,null,null,null,null,null,null,null,null,null,null,null,null,null,null,0]
[null,null,null,null,null,null,null,null,null,null,null,null,null,null,null,null,0]
[null,null,null,null,null,null,null,null,null,null,null,null,null,null,null,null,0]
[null,null,null,null,null,null,null,null,null,null,null,null,null,null,null,null,0]
[null,null,null,null,null,null,null,null,null,null,null,null,null,null,null,null,0]
[null,null,null,null,null,null,null,null,null,null,null,null,null,null,null,null,0]
[null,null,null,null,null,null,null,null,null,null,null,null,null,null,null,null,0]
[null,null,null,null,null,null,null,null,null,null,null,null,null,null,null,null,0]
[null,null,null,null,null,null,null,null,null,null,null,null,null,null,null,null,0]
[null,null,null,null,null,null,null,null,null,null,null,null,null,null,null,null,0]
[null,null,null,null,null,null,null,null,null,null,null,null,null,null,null,null,0]
[null,null,null,null,null,null,null,null,null,null,null,null,null,null,null,null,0]
[null,null,null,null,null,null,null,null,null,null,null,null,null,null,null,null,0]
[null,null,null,null,null,null,null,null,null,null,null,null,null,null,null,null,0]
[null,null,null,null,null,null,null,null,null,null,null,null,null,null,null,null,0]
[null,null,null,null,null,null,null,null,null,null,null,null,null,null,null,null,0]
[null,null,null,null,null,null,null,null,null,null,null,null,null,null,null,null,0]
[null,null,null,null,null,null,null,null,null,null,null,null,null,null,null,null,0]
[null,null,null,null,null,null,null,null,null,null,null,null,null,null,null,null,0]
[null,null,null,null,null,null,null,null,null,null,null,null,null,null,null,null,0]
[null,null,null,null,null,null,null,null,null,null,null,null,null,null,null,null,0]
[null,null,null,null,null,null,null,null,null,null,null,null,null,null,null,null,0]
[null,null,null,null,null,null,null,null,null,null,null,null,null,null,null,null,0]
[null,null,null,null,null,null,null,null,null,null,null,null,null,null,null,null,{"$f":"IF((P32>0)*(P32<4),10%,IF(P32<0,0,IF((P32>3)*(P32<10),15%,IF(P32>=10,20%,0))))","v":0}]
[null,null,null,null,null,null,null,null,null,null,null,null,null,null,null,null,0]
[null,null,null,null,null,null,null,null,null,null,null,null,null,null,null,null,0]
[null,null,null,null,null,null,null,null,null,null,null,null,null,null,null,null,0]
[null,null,null,null,null,null,null,null,null,null,null,null,null,null,null,null,0]
[null,null,null,null,null,null,null,null,null,null,null,null,null,null,null,null,0]
[null,null,null,null,null,null,null,null,null,null,null,null,null,null,null,null,0]
[null,null,null,null,null,null,null,null,null,null,null,null,null,null,null,null,0]
[null,null,null,null,null,null,null,null,null,null,null,null,null,null,null,null,0]
[null,null,null,null,null,null,null,null,null,null,null,null,null,null,null,null,0]
[null,null,null,null,null,null,null,null,null,null,null,null,null,null,null,null,0]
[null,null,null,null,null,null,null,null,null,null,null,null,null,null,null,null,0]
[null,null,null,null,null,null,null,null,null,null,null,null,null,null,null,null,0]
[null,null,null,null,null,null,null,null,null,null,null,null,null,null,null,null,0]
[null,null,null,null,null,null,null,null,null,null,null,null,null,null,null,null,0]
[null,null,null,null,null,null,null,null,null,null,null,null,null,null,null,null,0]
[null,null,null,null,null,null,null,null,null,null,null,null,null,null,null,null,0]
[null,null,null,null,null,null,null,null,null,null,null,null,null,null,null,null,0]
[null,null,null,null,null,null,null,null,null,null,null,null,null,null,null,null,0]
[null,null,null,null,null,null,null,null,null,null,null,null,null,null,null,null,0]
[null,null,null,null,null,null,null,null,null,null,null,null,null,null,null,null,0]
[null,null,null,null,null,null,null,null,null,null,null,null,null,null,null,null,0]
[null,null,null,null,null,null,null,null,null,null,null,null,null,null,null,null,0]
[null,null,null,null,null,null,null,null,null,null,null,null,null,null,null,null,0]
[null,null,null,null,null,null,null,null,null,null,null,null,null,null,null,null,0]
[null,null,null,null,null,null,null,null,null,null,null,null,null,null,null,null,0]
[null,null,null,null,null,null,null,null,null,null,null,null,null,null,null,null,0]
[null,null,null,null,null,null,null,null,null,null,null,null,null,null,null,null,0]
[null,null,null,null,null,null,null,null,null,null,null,null,null,null,null,null,0]
[null,null,null,null,null,null,null,null,null,null,null,null,null,null,null,null,0]
[null,null,null,null,null,null,null,null,null,null,null,null,null,null,null,null,0]
[null,null,null,null,null,null,null,null,null,null,null,null,null,null,null,null,0]
[null,null,null,null,null,null,null,null,null,null,null,null,null,null,null,null,0]
[null,null,null,null,null,null,null,null,null,null,null,null,null,null,null,null,0]
[null,null,null,null,null,null,null,null,null,null,null,null,null,null,null,null,0]
[null,null,null,null,null,null,null,null,null,null,null,null,null,null,null,null,0]
[null,null,null,null,null,null,null,null,null,null,null,null,null,null,null,null,0]
[null,null,null,null,null,null,null,null,null,null,null,null,null,null,null,null,0]
[null,null,null,null,null,null,null,null,null,null,null,null,null,null,null,null,0]
[null,null,null,null,null,null,null,null,null,null,null,null,null,null,null,null,0]
[null,null,null,null,null,null,null,null,null,null,null,null,null,null,null,null,0]
[null,null,null,null,null,null,null,null,null,null,null,null,null,null,null,null,0]
[null,null,null,null,null,null,null,null,null,null,null,null,null,null,null,null,0]
[null,null,null,null,null,null,null,null,null,null,null,null,null,null,null,null,0]
[null,null,null,null,null,null,null,null,null,null,null,null,null,null,null,null,0]
[null,null,null,null,null,null,null,null,null,null,null,null,null,null,null,null,0]
[null,null,null,null,null,null,null,null,null,null,null,null,null,null,null,null,0]
[null,null,null,null,null,null,null,null,null,null,null,null,null,null,null,null,0]
[null,null,null,null,null,null,null,null,null,null,null,null,null,null,null,null,0]
[null,null,null,null,null,null,null,null,null,null,null,null,null,null,null,null,0]
[null,null,null,null,null,null,null,null,null,null,null,null,null,null,null,null,0]
[null,null,null,null,null,null,null,null,null,null,null,null,null,null,null,null,0]
[null,null,null,null,null,null,null,null,null,null,null,null,null,null,null,null,0]
[null,null,null,null,null,null,null,null,null,null,null,null,null,null,null,null,0]
[null,null,null,null,null,null,null,null,null,null,null,null,null,null,null,null,0]
[null,null,null,null,null,null,null,null,null,null,null,null,null,null,null,null,0]
[null,null,null,null,null,null,null,null,null,null,null,null,null,null,null,null,0]
[null,null,null,null,null,null,null,null,null,null,null,null,null,null,null,null,0]
[null,null,null,null,null,null,null,null,null,null,null,null,null,null,null,null,0]
[null,null,null,null,null,null,null,null,null,null,null,null,null,null,null,null,0]
[null,null,null,null,null,null,null,null,null,null,null,null,null,null,null,null,0]
[null,null,null,null,null,null,null,null,null,null,null,null,null,null,null,null,0]
[null,null,null,null,null,null,null,null,null,null,null,null,null,null,null,null,0]
[null,null,null,null,null,null,null,null,null,null,null,null,null,null,null,null,0]
[null,null,null,null,null,null,null,null,null,null,null,null,null,null,null,null,{"$f":"IF((P96>0)*(P96<4),10%,IF(P96<0,0,IF((P96>3)*(P96<10),15%,IF(P96>=10,20%,0))))","v":0}]
[null,null,null,null,null,null,null,null,null,null,null,null,null,null,null,null,0]
[null,null,null,null,null,null,null,null,null,null,null,null,null,null,null,null,0]
[null,null,null,null,null,null,null,null,null,null,null,null,null,null,null,null,0]
[null,null,null,null,null,null,null,null,null,null,null,null,null,null,null,null,0]
[null,null,null,null,null,null,null,null,null,null,null,null,null,null,null,null,0]
[null,null,null,null,null,null,null,null,null,null,null,null,null,null,null,null,0]
[null,null,null,null,null,null,null,null,null,null,null,null,null,null,null,null,0]
[null,null,null,null,null,null,null,null,null,null,null,null,null,null,null,null,0]
[null,null,null,null,null,null,null,null,null,null,null,null,null,null,null,null,0]
[null,null,null,null,null,null,null,null,null,null,null,null,null,null,null,null,0]
[null,null,null,null,null,null,null,null,null,null,null,null,null,null,null,null,0]
[null,null,null,null,null,null,null,null,null,null,null,null,null,null,null,null,0]
[null,null,null,null,null,null,null,null,null,null,null,null,null,null,null,null,0]
[null,null,null,null,null,null,null,null,null,null,null,null,null,null,null,null,0]
[null,null,null,null,null,null,null,null,null,null,null,null,null,null,null,null,0]
[null,null,null,null,null,null,null,null,null,null,null,null,null,null,null,null,0]
[null,null,null,null,null,null,null,null,null,null,null,null,null,null,null,null,0]
[null,null,null,null,null,null,null,null,null,null,null,null,null,null,null,null,0]
[null,null,null,null,null,null,null,null,null,null,null,null,null,null,null,null,0]
[null,null,null,null,null,null,null,null,null,null,null,null,null,null,null,null,0]
[null,null,null,null,null,null,null,null,null,null,null,null,null,null,null,null,0]
[null,null,null,null,null,null,null,null,null,null,null,null,null,null,null,null,0]
[null,null,null,null,null,null,null,null,null,null,null,null,null,null,null,null,0]
[null,null,null,null,null,null,null,null,null,null,null,null,null,null,null,null,0]
{"$rows_left_out":1156}
{"sheet":"Списки","index":3,"n_rows":13,"n_cols":5,"rows_kept":13,"cut":false,"hidden":true,"merged":[]}
["наличными в кассу","паспорт","Доставка, монтаж","Яндекс",726]
["переводом на карту","В/У","Вывоз, демонтаж","Google",740]
["банковской картой",null,"Доставка, вывоз,\nмонтаж, демонтаж","Avito",745]
["Оплата по счету",null,null,"Юла"]
[null,null,null,"Багажники-Автобоксы"]
[null,null,null,"Bagaz-Auto"]
[null,null,null,"ProkatBagazhnikov.ru"]
[null,null,null,"Instagram"]
[null,null,null,"ВКонтакте"]
[null,null,null,"Facebook"]
[null,null,null,"От знакомых"]
[null,null,null,"Визитки"]
[null,null,null,"Уже был"]

{"sheet":"Боксы","index":4,"n_rows":39,"n_cols":9,"rows_kept":39,"cut":false,"hidden":true,"merged":[]}
["Боксы:","Оценочная стоимость:","5-6 дней:","7-13 дней:","14-20 дней:","21-29 дней:","30-39 дней:","40-… дней:","Новый Год"]
["Aero 450 B Cr",15500,400,350,300,250,200,180,5000]
["Aero 450 Black",15500,400,350,300,250,200,180,5000]
["Aero 450 Metall",15500,400,350,300,250,200,180,5000]
["Atlant Classic 500",12000,240,220,200,180,140,120,5500]
["Atlant Classiс 320",7500,180,160,140,120,100,90,3000]
["Atlant Classiс 430",10000,200,180,160,140,120,100,3500]
["Atlant Sport 431",11000,200,180,160,140,120,100,3500]
["Atlant Sport 501",12500,240,220,200,180,140,120,5500]
["Borneo 350 Grey",11000,300,260,220,200,160,140,3500]
["Borneo 350 Silver",11500,300,260,220,200,160,140,3500]
["Fapa 460 White",17500,350,300,260,220,180,160,6000]
["Hakr 300 Grey",7490,160,140,120,100,90,80,2500]
["Hakr Relax 310",9990,180,160,140,120,100,90,3500]
["Magnum 420 Black Glossy",16000,400,350,300,250,200,180,5000]
["Magnum 420 Grey",14000,400,350,300,250,200,180,5000]
["Magnum 420 Grey Carbon",14300,400,350,300,250,200,180,5000]
["Magnum 420 Silver",16000,400,350,300,250,200,180,5000]
["Magnum 420 White Glossy",17000,400,350,300,250,200,180,5000]
["Neumann 650 Black",26990,450,400,350,300,250,200,9000]
["Satellite 520 White Glossy",16000,400,350,300,250,200,180,6000]
["Saturn 460 Black U",12500,220,200,180,160,130,110,4000]
["Saturn 460 Silver U",12500,220,200,180,160,130,110,4000]
["Saturn 650 Black ",19990,450,400,350,300,250,200,9000]
["Saturn 650 White",19990,450,400,350,300,250,200,9000]
["Thule Atlantis 900 Black",44990,700,640,580,520,450,400,12000]
["Thule Atlantis 900 Silver",44990,700,640,580,520,450,400,12000]
["Thule Dynamic 800 Black",49990,700,640,580,520,450,400,12000]
["Thule Dynamic 800 Silver",49990,700,640,580,520,450,400,12000]
["Thule Motion 200 Silver",30990,500,450,400,350,300,250,8000]
["Thule Motion 800 Black",37990,700,640,580,520,450,400,11000]
["Thule Motion 800 Silver",37990,700,640,580,520,450,400,11000]
["Thule Motion 800 White",44990,700,640,580,520,450,400,11000]
["Thule Motion 900 Black",49990,700,640,580,520,450,400,12000]
["Thule Motion 900 Silver",49990,700,640,580,520,450,400,12000]
["Thule Ocean 200 Black",12900,400,350,300,250,200,180,6000]
["Thule Pacific 100 Black Glossy DUO",18000,400,350,300,250,200,180,3500]
["Thule Pacific 100 Silver",15000,350,300,260,220,180,160,3500]
["Thule Pacific 200 Black DUO",23990,400,350,300,250,200,180,6000]

{"sheet":"Багажники","index":5,"n_rows":11,"n_cols":11,"rows_kept":11,"cut":false,"hidden":true,"merged":[]}
["Багажники:","Оценочная стоимость (757):","Оценочная стоимость (775):","Оценочная стоимость (751, 753, 754):","5-6 дней:","7-13 дней:","14-20 дней:","21-29 дней:","30-39 дней:","40-… дней:","Новый Год"]
["Amos D1 Square",2500,2500,2500,120,110,100,90,80,70,2000]
["Amos D1 Standart",2500,2500,2500,120,110,100,90,80,70,2000]
["Amos C15 Square",2500,2500,2500,120,110,100,90,80,70,2500]
["Amos C15 Standart",2500,2500,2500,120,110,100,90,80,70,2500]
["Amos Alfa Square",2500,2500,2500,120,110,100,90,80,70,2000]
["Amos Alfa Standart",2500,2500,2500,120,110,100,90,80,70,2500]
["Thule Square",9400,11200,12500,240,200,160,140,120,100,3000]
["Thule Standart",10000,11500,13000,240,200,160,140,120,100,3000]
["Thule AeroBar",11000,12500,14000,240,200,160,140,120,100,3000]
["Thule WingBar",12000,13000,15000,400,320,240,200,160,140,4500]

{"sheet":"Велокрепления","index":6,"n_rows":4,"n_cols":9,"rows_kept":4,"cut":false,"hidden":true,"merged":[]}
["Крепление:","Оценочная стоимость","5-6 дней:","7-13 дней:","14-20 дней:","21-29 дней:","30-39 дней:","40-… дней:","Новый Год"]
["Inter",1000,100,90,80,70,60,50,3000]
["Thule 532",2990,140,120,100,80,70,60,3000]
["Thule 591",5290,200,160,120,100,80,70,3000]

{"sheet":"Лыжи","index":7,"n_rows":6,"n_cols":9,"rows_kept":6,"cut":false,"hidden":true,"merged":[]}
["Крепление:","Оценочная стоимость:","5-6 дней:","7-13 дней:","14-20 дней:","21-29 дней:","30-39 дней:","40-… дней:","Новый Год"]
["Amos Ski-3",2390,240,200,160,120,90,70,2000]
["Amos Ski-5",2490,240,200,160,120,90,70,2500]
["Thule 726",4990,240,200,160,120,90,70,3500]
["Thule 740",4990,240,200,160,120,90,70,3000]
["Thule 745",3990,240,200,160,120,90,70,3000]