{"text_format":"1","workbook":"xlsx","n_sheets":5,"sheets":["Список","Отправители","ф.7п","ф.112еп","Печать"],"not_rendered":{"charts":0,"images":0,"macros":1,"external_links":0,"defined_names":19,"comments":0,"pivot_tables":0},"unopened":[],"bounds":{"document_bytes":16777216,"sheet_cells":100000,"rows_first":2000,"rows_last":500,"rows_between":2000,"halvings":0,"cell_chars":16384,"cell_head_chars":4096},"cells_cut":0,"cells_raw":0,"read":"whole","date_system":"1900"}

{"sheet":"Список","index":0,"n_rows":18,"n_cols":14,"rows_kept":18,"cut":false,"hidden":false,"merged":[[0,0,0,6]]}
["Получатель",null,null,null,null,null,null,null,"Отправитель"]
["x","ФИО","Адрес","Индекс","Тел","Сумма","Кол. Одежды",null,"ФИО","ОтАдрес","ОтИндекс","ОтТел"]
["x","Иванов Иван Иванович","г. Москва ул. Московская кв 45",111125,9855655566,null,2,null,"Фируз",{"$f":"VLOOKUP(I3,Отправители!$B$2:$E$49,2,0)","v":"Адрес Фируза"},{"$f":"VLOOKUP(I3,Отправители!$B$2:$E$49,3,0)","v":136548},{"$f":"VLOOKUP(I3,Отправители!$B$2:$E$49,4,0)","v":9003655544},null,{"$f":"SUBSTITUTE(PROPER(INDEX(n_4,MID(TEXT(F3,n0),1,1)+1)&INDEX(n0x,MID(TEXT(F3,n0),2,1)+1,MID(TEXT(F3,n0),3,1)+1)&IF(-MID(TEXT(F3,n0),1,3),\"миллиард\"&VLOOKUP(MID(TEXT(F3,n0),3,1)*AND(MID(TEXT(F3,n0),2,1)-1),мил,2),\"\")&INDEX(n_4,MID(TEXT(F3,n0),4,1)+1)&INDEX(n0x,MID(TEXT(F3,n0),5,1)+1,MID(TEXT(F3,n0),6,1)+1)&IF(-MID(TEXT(F3,n0),4,3),\"миллион\"&VLOOKUP(MID(TEXT(F3,n0),6,1)*AND(MID(TEXT(F3,n0),5,1)-1),мил,2),\"\")&INDEX(n_4,MID(TEXT(F3,n0),7,1)+1)&INDEX(n1x,MID(TEXT(F3,n0),8,1)+1,MID(TEXT(F3,n0),9,1)+1)&IF(-MID(TEXT(F3,n0),7,3),VLOOKUP(MID(TEXT(F3,n0),9,1)*AND(MID(TEXT(F3,n0),8,1)-1),тыс,2),\"\")&INDEX(n_4,MID(TEXT(F3,n0),10,1)+1)&INDEX(n0x,MID(TEXT(F3,n0),11,1)+1,MID(TEXT(F3,n0),12,1)+1)),\"z\",\" \")&IF(TRUNC(TEXT(F3,n0)),\"\",\"  \")","v":"  "}]
["x","Лигута Алексей Михайлович","Брянск ул  Димитрова 48",245456,9553654785,4568,4,null,"Шнайдерман",{"$f":"VLOOKUP(I4,Отправители!$B$2:$E$49,2,0)","v":"Адрес Шнайдера"},{"$f":"VLOOKUP(I4,Отправители!$B$2:$E$49,3,0)","v":456987},{"$f":"VLOOKUP(I4,Отправители!$B$2:$E$49,4,0)","v":9524567894},null,{"$f":"SUBSTITUTE(PROPER(INDEX(n_4,MID(TEXT(F4,n0),1,1)+1)&INDEX(n0x,MID(TEXT(F4,n0),2,1)+1,MID(TEXT(F4,n0),3,1)+1)&IF(-MID(TEXT(F4,n0),1,3),\"миллиард\"&VLOOKUP(MID(TEXT(F4,n0),3,1)*AND(MID(TEXT(F4,n0),2,1)-1),мил,2),\"\")&INDEX(n_4,MID(TEXT(F4,n0),4,1)+1)&INDEX(n0x,MID(TEXT(F4,n0),5,1)+1,MID(TEXT(F4,n0),6,1)+1)&IF(-MID(TEXT(F4,n0),4,3),\"миллион\"&VLOOKUP(MID(TEXT(F4,n0),6,1)*AND(MID(TEXT(F4,n0),5,1)-1),мил,2),\"\")&INDEX(n_4,MID(TEXT(F4,n0),7,1)+1)&INDEX(n1x,MID(TEXT(F4,n0),8,1)+1,MID(TEXT(F4,n0),9,1)+1)&IF(-MID(TEXT(F4,n0),7,3),VLOOKUP(MID(TEXT(F4,n0),9,1)*AND(MID(TEXT(F4,n0),8,1)-1),тыс,2),\"\")&INDEX(n_4,MID(TEXT(F4,n0),10,1)+1)&INDEX(n0x,MID(TEXT(F4,n0),11,1)+1,MID(TEXT(F4,n0),12,1)+1)),\"z\",\" \")&IF(TRUNC(TEXT(F4,n0)),\"\",\"  \")","v":"Четыре тысячи пятьсот шестьдесят восемь "}]
[null,null,null,null,null,null,null,null,null,{"$f":"VLOOKUP(I5,Отправители!$B$2:$E$49,2,0)","v":{"$error":"#N/A"}},{"$f":"VLOOKUP(I5,Отправители!$B$2:$E$49,3,0)","v":{"$error":"#N/A"}},{"$f":"VLOOKUP(I5,Отправители!$B$2:$E$49,4,0)","v":{"$error":"#N/A"}},null,{"$f":"SUBSTITUTE(PROPER(INDEX(n_4,MID(TEXT(F5,n0),1,1)+1)&INDEX(n0x,MID(TEXT(F5,n0),2,1)+1,MID(TEXT(F5,n0),3,1)+1)&IF(-MID(TEXT(F5,n0),1,3),\"миллиард\"&VLOOKUP(MID(TEXT(F5,n0),3,1)*AND(MID(TEXT(F5,n0),2,1)-1),мил,2),\"\")&INDEX(n_4,MID(TEXT(F5,n0),4,1)+1)&INDEX(n0x,MID(TEXT(F5,n0),5,1)+1,MID(TEXT(F5,n0),6,1)+1)&IF(-MID(TEXT(F5,n0),4,3),\"миллион\"&VLOOKUP(MID(TEXT(F5,n0),6,1)*AND(MID(TEXT(F5,n0),5,1)-1),мил,2),\"\")&INDEX(n_4,MID(TEXT(F5,n0),7,1)+1)&INDEX(n1x,MID(TEXT(F5,n0),8,1)+1,MID(TEXT(F5,n0),9,1)+1)&IF(-MID(TEXT(F5,n0),7,3),VLOOKUP(MID(TEXT(F5,n0),9,1)*AND(MID(TEXT(F5,n0),8,1)-1),тыс,2),\"\")&INDEX(n_4,MID(TEXT(F5,n0),10,1)+1)&INDEX(n0x,MID(TEXT(F5,n0),11,1)+1,MID(TEXT(F5,n0),12,1)+1)),\"z\",\" \")&IF(TRUNC(TEXT(F5,n0)),\"\",\"  \")","v":"  "}]
[null,null,null,null,null,null,null,null,null,{"$f":"VLOOKUP(I6,Отправители!$B$2:$E$49,2,0)","v":{"$error":"#N/A"}},{"$f":"VLOOKUP(I6,Отправители!$B$2:$E$49,3,0)","v":{"$error":"#N/A"}},{"$f":"VLOOKUP(I6,Отправители!$B$2:$E$49,4,0)","v":{"$error":"#N/A"}},null,{"$f":"SUBSTITUTE(PROPER(INDEX(n_4,MID(TEXT(F6,n0),1,1)+1)&INDEX(n0x,MID(TEXT(F6,n0),2,1)+1,MID(TEXT(F6,n0),3,1)+1)&IF(-MID(TEXT(F6,n0),1,3),\"миллиард\"&VLOOKUP(MID(TEXT(F6,n0),3,1)*AND(MID(TEXT(F6,n0),2,1)-1),мил,2),\"\")&INDEX(n_4,MID(TEXT(F6,n0),4,1)+1)&INDEX(n0x,MID(TEXT(F6,n0),5,1)+1,MID(TEXT(F6,n0),6,1)+1)&IF(-MID(TEXT(F6,n0),4,3),\"миллион\"&VLOOKUP(MID(TEXT(F6,n0),6,1)*AND(MID(TEXT(F6,n0),5,1)-1),мил,2),\"\")&INDEX(n_4,MID(TEXT(F6,n0),7,1)+1)&INDEX(n1x,MID(TEXT(F6,n0),8,1)+1,MID(TEXT(F6,n0),9,1)+1)&IF(-MID(TEXT(F6,n0),7,3),VLOOKUP(MID(TEXT(F6,n0),9,1)*AND(MID(TEXT(F6,n0),8,1)-1),тыс,2),\"\")&INDEX(n_4,MID(TEXT(F6,n0),10,1)+1)&INDEX(n0x,MID(TEXT(F6,n0),11,1)+1,MID(TEXT(F6,n0),12,1)+1)),\"z\",\" \")&IF(TRUNC(TEXT(F6,n0)),\"\",\"  \")","v":"  "}]
[null,null,null,null,null,null,null,null,null,{"$f":"VLOOKUP(I7,Отправители!$B$2:$E$49,2,0)","v":{"$error":"#N/A"}},{"$f":"VLOOKUP(I7,Отправители!$B$2:$E$49,3,0)","v":{"$error":"#N/A"}},{"$f":"VLOOKUP(I7,Отправители!$B$2:$E$49,4,0)","v":{"$error":"#N/A"}},null,{"$f":"SUBSTITUTE(PROPER(INDEX(n_4,MID(TEXT(F7,n0),1,1)+1)&INDEX(n0x,MID(TEXT(F7,n0),2,1)+1,MID(TEXT(F7,n0),3,1)+1)&IF(-MID(TEXT(F7,n0),1,3),\"миллиард\"&VLOOKUP(MID(TEXT(F7,n0),3,1)*AND(MID(TEXT(F7,n0),2,1)-1),мил,2),\"\")&INDEX(n_4,MID(TEXT(F7,n0),4,1)+1)&INDEX(n0x,MID(TEXT(F7,n0),5,1)+1,MID(TEXT(F7,n0),6,1)+1)&IF(-MID(TEXT(F7,n0),4,3),\"миллион\"&VLOOKUP(MID(TEXT(F7,n0),6,1)*AND(MID(TEXT(F7,n0),5,1)-1),мил,2),\"\")&INDEX(n_4,MID(TEXT(F7,n0),7,1)+1)&INDEX(n1x,MID(TEXT(F7,n0),8,1)+1,MID(TEXT(F7,n0),9,1)+1)&IF(-MID(TEXT(F7,n0),7,3),VLOOKUP(MID(TEXT(F7,n0),9,1)*AND(MID(TEXT(F7,n0),8,1)-1),тыс,2),\"\")&INDEX(n_4,MID(TEXT(F7,n0),10,1)+1)&INDEX(n0x,MID(TEXT(F7,n0),11,1)+1,MID(TEXT(F7,n0),12,1)+1)),\"z\",\" \")&IF(TRUNC(TEXT(F7,n0)),\"\",\"  \")","v":"  "}]
[null,null,null,null,null,null,null,null,null,{"$f":"VLOOKUP(I8,Отправители!$B$2:$E$49,2,0)","v":{"$error":"#N/A"}},{"$f":"VLOOKUP(I8,Отправители!$B$2:$E$49,3,0)","v":{"$error":"#N/A"}},{"$f":"VLOOKUP(I8,Отправители!$B$2:$E$49,4,0)","v":{"$error":"#N/A"}},null,{"$f":"SUBSTITUTE(PROPER(INDEX(n_4,MID(TEXT(F8,n0),1,1)+1)&INDEX(n0x,MID(TEXT(F8,n0),2,1)+1,MID(TEXT(F8,n0),3,1)+1)&IF(-MID(TEXT(F8,n0),1,3),\"миллиард\"&VLOOKUP(MID(TEXT(F8,n0),3,1)*AND(MID(TEXT(F8,n0),2,1)-1),мил,2),\"\")&INDEX(n_4,MID(TEXT(F8,n0),4,1)+1)&INDEX(n0x,MID(TEXT(F8,n0),5,1)+1,MID(TEXT(F8,n0),6,1)+1)&IF(-MID(TEXT(F8,n0),4,3),\"миллион\"&VLOOKUP(MID(TEXT(F8,n0),6,1)*AND(MID(TEXT(F8,n0),5,1)-1),мил,2),\"\")&INDEX(n_4,MID(TEXT(F8,n0),7,1)+1)&INDEX(n1x,MID(TEXT(F8,n0),8,1)+1,MID(TEXT(F8,n0),9,1)+1)&IF(-MID(TEXT(F8,n0),7,3),VLOOKUP(MID(TEXT(F8,n0),9,1)*AND(MID(TEXT(F8,n0),8,1)-1),тыс,2),\"\")&INDEX(n_4,MID(TEXT(F8,n0),10,1)+1)&INDEX(n0x,MID(TEXT(F8,n0),11,1)+1,MID(TEXT(F8,n0),12,1)+1)),\"z\",\" \")&IF(TRUNC(TEXT(F8,n0)),\"\",\"  \")","v":"  "}]
[null,null,null,null,null,null,null,null,null,{"$f":"VLOOKUP(I9,Отправители!$B$2:$E$49,2,0)","v":{"$error":"#N/A"}},{"$f":"VLOOKUP(I9,Отправители!$B$2:$E$49,3,0)","v":{"$error":"#N/A"}},{"$f":"VLOOKUP(I9,Отправители!$B$2:$E$49,4,0)","v":{"$error":"#N/A"}},null,{"$f":"SUBSTITUTE(PROPER(INDEX(n_4,MID(TEXT(F9,n0),1,1)+1)&INDEX(n0x,MID(TEXT(F9,n0),2,1)+1,MID(TEXT(F9,n0),3,1)+1)&IF(-MID(TEXT(F9,n0),1,3),\"миллиард\"&VLOOKUP(MID(TEXT(F9,n0),3,1)*AND(MID(TEXT(F9,n0),2,1)-1),мил,2),\"\")&INDEX(n_4,MID(TEXT(F9,n0),4,1)+1)&INDEX(n0x,MID(TEXT(F9,n0),5,1)+1,MID(TEXT(F9,n0),6,1)+1)&IF(-MID(TEXT(F9,n0),4,3),\"миллион\"&VLOOKUP(MID(TEXT(F9,n0),6,1)*AND(MID(TEXT(F9,n0),5,1)-1),мил,2),\"\")&INDEX(n_4,MID(TEXT(F9,n0),7,1)+1)&INDEX(n1x,MID(TEXT(F9,n0),8,1)+1,MID(TEXT(F9,n0),9,1)+1)&IF(-MID(TEXT(F9,n0),7,3),VLOOKUP(MID(TEXT(F9,n0),9,1)*AND(MID(TEXT(F9,n0),8,1)-1),тыс,2),\"\")&INDEX(n_4,MID(TEXT(F9,n0),10,1)+1)&INDEX(n0x,MID(TEXT(F9,n0),11,1)+1,MID(TEXT(F9,n0),12,1)+1)),\"z\",\" \")&IF(TRUNC(TEXT(F9,n0)),\"\",\"  \")","v":"  "}]
[null,null,null,null,null,null,null,null,null,{"$f":"VLOOKUP(I10,Отправители!$B$2:$E$49,2,0)","v":{"$error":"#N/A"}},{"$f":"VLOOKUP(I10,Отправители!$B$2:$E$49,3,0)","v":{"$error":"#N/A"}},{"$f":"VLOOKUP(I10,Отправители!$B$2:$E$49,4,0)","v":{"$error":"#N/A"}},null,{"$f":"SUBSTITUTE(PROPER(INDEX(n_4,MID(TEXT(F10,n0),1,1)+1)&INDEX(n0x,MID(TEXT(F10,n0),2,1)+1,MID(TEXT(F10,n0),3,1)+1)&IF(-MID(TEXT(F10,n0),1,3),\"миллиард\"&VLOOKUP(MID(TEXT(F10,n0),3,1)*AND(MID(TEXT(F10,n0),2,1)-1),мил,2),\"\")&INDEX(n_4,MID(TEXT(F10,n0),4,1)+1)&INDEX(n0x,MID(TEXT(F10,n0),5,1)+1,MID(TEXT(F10,n0),6,1)+1)&IF(-MID(TEXT(F10,n0),4,3),\"миллион\"&VLOOKUP(MID(TEXT(F10,n0),6,1)*AND(MID(TEXT(F10,n0),5,1)-1),мил,2),\"\")&INDEX(n_4,MID(TEXT(F10,n0),7,1)+1)&INDEX(n1x,MID(TEXT(F10,n0),8,1)+1,MID(TEXT(F10,n0),9,1)+1)&IF(-MID(TEXT(F10,n0),7,3),VLOOKUP(MID(TEXT(F10,n0),9,1)*AND(MID(TEXT(F10,n0),8,1)-1),тыс,2),\"\")&INDEX(n_4,MID(TEXT(F10,n0),10,1)+1)&INDEX(n0x,MID(TEXT(F10,n0),11,1)+1,MID(TEXT(F10,n0),12,1)+1)),\"z\",\" \")&IF(TRUNC(TEXT(F10,n0)),\"\",\"  \")","v":"  "}]
{"$rows_left_out":9}
{"sheet":"Отправители","index":1,"n_rows":4,"n_cols":5,"rows_kept":4,"cut":false,"hidden":false,"merged":[]}
[null,"Фио","Адрес","Индекс","Тел"]
[null,"Иванов Иван Иванович","г. Брянск ул. Димитрова д. 48/2",241047,9003685542]
[null,"Фируз","Адрес Фируза",136548,9003655544]
[null,"Шнайдерман","Адрес Шнайдера",456987,9524567894]

{"sheet":"ф.7п","index":2,"n_rows":35,"n_cols":64,"rows_kept":35,"cut":false,"hidden":false,"merged":[[3,33,4,62],[7,33,8,62],[22,56,23,56],[22,57,23,57],[22,58,23,58],[22,59,23,59],[12,33,13,62],[22,62,23,62],[32,58,32,62],[33,58,33,62],[5,33,5,62],[9,33,9,62],[23,1,23,2],[23,32,23,33],[23,47,23,48],[33,48,34,50],[22,24,23,24],[22,25,23,25],[22,60,23,60],[22,61,23,61],[12,2,13,30],[17,2,17,30],[18,2,18,30],[19,2,19,30],[20,2,20,30],[17,33,17,62],[18,33,18,62],[19,33,19,62],[20,33,20,62],[22,26,23,26],[22,27,23,27],[22,28,23,28],[22,29,23,29],[22,30,23,30]]}
[]
[null,null,null,null,null,null,null,null,null,null,null,null,null,null,null,null,null,null,null,null,null,null,null,null,null,null,null,null,"ПОСЫЛКА",null,null,null,null,null,null,null,null,null,null,null,null,null,null,null,null,null,null,null,null,null,null,null,null,null,null,null,null,null,null,null,null,"ф. 7-п"]
[]
[null,null,null,null,null,null,null,null,null,null,null,null,null,null,null,null,null,null,null,null,null,null,null,null,null,null,null,null,null,null,null,null,null,{"$f":"IF(BL6=\"\",\" \",BL6)","v":"0 (  ) руб."},null,null,null,null,null,null,null,null,null,null,null,null,null,null,null,null,null,null,null,null,null,null,null,null,null,null,null,null,null,{"$f":"VLOOKUP(\"x\",Список!$A$3:$N$10,6,FALSE)","v":0}]
[null,null,null,null,null,null,null,null,null,null,null,null,null,null,null,null,null,null,null,null,null,null,null,null,null,null,null,null,null,null,null,null,null,null,null,null,null,null,null,null,null,null,null,null,null,null,null,null,null,null,null,null,null,null,null,null,null,null,null,null,null,null,null,{"$f":"VLOOKUP(\"x\",Список!$A$3:$N$10,14,FALSE)","v":"  "}]
[null,null,null,null,null,null,null,null,null,null,null,null,null,null,null,null,null,null,null,null,null,null,null,null,null,null,null,null,null,null,null,null,null,"(сумма объявленной ценности цифрами и прописью, руб.  ₽)",null,null,null,null,null,null,null,null,null,null,null,null,null,null,null,null,null,null,null,null,null,null,null,null,null,null,null,null,null,{"$f":"CONCATENATE(BL4,\" (\",BL5,\") руб.\")","v":"0 (  ) руб."}]
[]
[null,null,"Заполняется отправителем",null,null,null,null,null,null,null,null,null,null,null,null,null,null,null,null,null,null,null,null,null,null,null,null,null,null,null,null,null,null,{"$f":"CONCATENATE(BL4,\" (\",BL5,\") руб. 00 коп.\")","v":"0 (  ) руб. 00 коп."}]
[]
[null,null,null,null,null,null,null,null,null,null,null,null,null,null,null,null,null,null,null,null,null,null,null,null,null,null,null,null,null,null,null,null,null,"(сумма наложенного платежа цифрами и прописью, руб. коп. ₽)"]
{"$rows_left_out":26}
{"sheet":"ф.112еп","index":3,"n_rows":93,"n_cols":124,"rows_kept":93,"cut":false,"hidden":false,"merged":[[62,113,63,115],[62,116,63,118],[62,119,63,121],[61,2,61,88],[60,2,60,88],[60,90,60,121],[61,90,61,120],[62,95,63,97],[62,98,63,100],[62,101,63,103],[62,104,63,106],[62,107,63,109],[62,110,63,112],[62,89,63,91],[62,92,63,94],[59,17,59,54],[59,99,59,120],[58,99,58,120],[58,91,58,98],[58,79,58,90],[55,39,55,41],[55,42,55,44],[55,45,55,47],[55,48,55,50],[57,2,57,65],[58,75,58,77],[58,2,58,16],[58,17,58,53],[58,63,58,74],[58,54,58,62],[55,51,55,53],[55,54,55,56],[55,15,55,17],[55,18,55,20],[55,21,55,23],[55,24,55,26],[55,27,55,29],[55,30,55,32],[55,33,55,35],[55,36,55,38],[56,88,56,121],[54,88,55,99],[54,107,55,121],[54,100,55,106],[54,61,55,87],[55,57,55,59],[54,57,54,59],[54,33,54,35],[54,36,54,38],[54,39,54,41],[54,42,54,44],[54,45,54,47],[54,48,54,50],[48,2,48,99],[54,2,55,14],[54,15,54,17],[54,18,54,20],[54,21,54,23],[54,24,54,26],[54,27,54,29],[54,30,54,32],[52,101,52,103],[52,72,52,74],[52,95,52,97],[52,98,52,100],[53,15,53,17],[53,18,53,20],[53,21,53,23],[53,24,53,26],[53,72,53,74],[53,92,53,94],[53,95,53,97],[53,98,53,100],[52,57,52,59],[52,60,52,62],[54,51,54,53],[54,54,54,56],[53,116,53,118],[53,119,53,121],[52,104,52,106],[52,107,52,109],[52,110,52,112],[52,113,52,115],[52,119,52,121],[53,66,53,68],[53,69,53,71],[53,101,53,103],[53,104,53,106],[53,107,53,109],[53,110,53,112],[53,113,53,115],[53,57,53,59],[53,60,53,62],[53,63,53,65],[52,84,53,91],[52,92,52,94],[49,2,50,9],[49,11,49,13],[49,14,49,16],[50,116,50,118],[49,95,49,97],[49,98,49,100],[49,83,49,85],[49,86,49,88],[49,29,49,31],[49,32,49,34],[50,110,50,112],[50,113,50,115],[49,89,49,91],[49,92,49,94],[49,65,49,67],[50,83,50,85],[50,86,50,88],[50,89,50,91],[50,92,50,94],[50,29,50,31],[50,32,50,34],[50,35,50,38],[49,74,49,76],[52,2,53,14],[52,15,52,17],[52,18,52,20],[52,21,52,23],[52,24,52,26],[52,63,52,65],[53,51,53,53],[53,54,53,56],[53,27,53,29],[53,30,53,32],[53,33,53,35],[53,36,53,38],[53,39,53,41],[52,42,52,44],[52,45,52,47],[52,48,52,50],[52,51,52,53],[52,54,52,56],[53,42,53,44],[53,45,53,47],[53,48,53,50],[49,110,49,112],[49,113,49,115],[50,39,50,42],[50,43,50,45],[50,46,50,48],[49,119,49,121],[52,27,52,29],[52,30,52,32],[52,33,52,35],[52,36,52,38],[52,39,52,41],[52,66,52,68],[52,69,52,71],[52,116,52,118],[50,65,50,67],[50,68,50,70],[50,71,50,73],[50,74,50,76],[50,77,50,79],[50,104,50,106],[50,107,50,109],[50,80,50,82],[49,46,49,48],[49,116,49,118],[49,49,50,61],[49,62,49,64],[50,62,50,64],[49,23,49,25],[49,26,49,28],[49,35,49,38],[50,119,50,121],[51,2,51,25],[51,27,51,121],[50,95,50,97],[50,98,50,100],[50,101,50,103],[49,101,49,103],[49,104,49,106],[49,107,49,109],[49,80,49,82],[50,11,50,13],[50,14,50,16],[50,17,50,19],[50,20,50,22],[50,23,50,25],[50,26,50,28],[49,71,49,73],[49,77,49,79],[37,2,37,121],[49,17,49,19],[49,20,49,22],[47,104,47,121],[43,48,43,121],[45,71,45,103],[44,2,44,103],[39,116,40,118],[39,119,40,121],[40,2,40,103],[41,104,41,121],[44,104,46,106],[44,107,46,109],[44,110,46,112],[44,113,46,115],[44,116,46,118],[44,119,46,121],[39,107,40,109],[39,110,40,112],[39,113,40,115],[49,68,49,70],[46,2,46,103],[49,39,49,42],[49,43,49,45],[36,15,36,121],[36,2,36,13],[38,2,38,26],[38,27,38,121],[39,2,39,103],[39,104,40,106],[35,119,35,121],[34,110,34,112],[34,113,34,115],[34,116,34,118],[34,119,34,121],[35,54,35,56],[35,57,35,59],[35,60,35,62],[34,60,34,62],[34,63,34,65],[34,66,34,68],[35,110,35,112],[35,113,35,115],[35,116,35,118],[35,30,35,32],[35,33,35,35],[35,36,35,38],[34,15,34,17],[34,18,34,20],[34,54,34,56],[34,2,35,14],[35,15,35,17],[35,18,35,20],[35,21,35,23],[35,24,35,26],[35,27,35,29],[34,21,34,23],[34,24,34,26],[34,27,34,29],[34,30,34,32],[34,33,34,35],[35,63,35,65],[35,66,35,68],[34,36,34,38],[35,39,35,41],[35,42,35,44],[35,45,35,47],[35,48,35,50],[35,51,35,53],[34,57,34,59],[34,39,34,41],[34,42,34,44],[34,45,34,47],[34,48,34,50],[34,51,34,53],[34,69,34,71],[34,72,34,74],[35,101,35,103],[35,104,35,106],[35,107,35,109],[35,92,35,94],[34,84,35,91],[35,69,35,71],[35,72,35,74],[34,95,34,97],[35,95,35,97],[35,98,35,100],[34,98,34,100],[34,101,34,103],[31,116,31,118],[31,119,31,121],[31,92,31,94],[31,95,31,97],[31,98,31,100],[31,101,31,103],[31,104,31,106],[34,104,34,106],[34,107,34,109],[34,92,34,94],[33,2,33,25],[31,32,31,34],[31,35,31,38],[31,39,31,42],[31,43,31,45],[31,46,31,48],[31,17,31,19],[31,20,31,22],[31,23,31,25],[31,26,31,28],[31,11,31,13],[31,14,31,16],[32,74,32,76],[33,27,33,121],[32,107,32,109],[32,77,32,79],[32,80,32,82],[32,83,32,85],[32,86,32,88],[32,89,32,91],[31,49,32,61],[32,110,32,112],[32,113,32,115],[32,116,32,118],[32,119,32,121],[32,92,32,94],[32,95,32,97],[32,98,32,100],[32,101,32,103],[32,104,32,106],[32,35,32,38],[32,39,32,42],[31,29,31,31],[31,107,31,109],[31,110,31,112],[31,113,31,115],[30,2,30,51],[31,2,32,9],[32,11,32,13],[32,14,32,16],[32,17,32,19],[32,20,32,22],[32,23,32,25],[32,26,32,28],[32,29,32,31],[32,32,32,34],[28,113,28,115],[28,116,28,118],[28,119,28,121],[28,92,28,94],[28,95,28,97],[28,98,28,100],[28,101,28,103],[28,104,28,106],[32,43,32,45],[32,46,32,48],[31,83,31,85],[31,86,31,88],[31,89,31,91],[31,62,31,64],[31,65,31,67],[31,68,31,70],[31,71,31,73],[31,74,31,76],[31,77,31,79],[31,80,31,82],[32,62,32,64],[32,65,32,67],[32,68,32,70],[32,71,32,73],[28,86,28,88],[28,89,28,91],[28,62,28,64],[28,65,28,67],[28,68,28,70],[28,71,28,73],[28,74,28,76],[28,107,28,109],[28,110,28,112],[28,44,28,46],[28,47,28,49],[28,50,28,52],[28,53,28,55],[28,56,28,58],[28,59,28,61],[28,77,28,79],[28,80,28,82],[28,83,28,85],[27,116,27,118],[27,119,27,121],[28,19,28,21],[28,22,28,24],[28,25,28,27],[28,28,28,30],[28,31,28,33],[28,34,28,37],[28,38,28,40],[28,41,28,43],[27,77,27,79],[27,80,27,82],[27,83,27,85],[27,56,27,58],[27,59,27,61],[27,62,27,64],[27,65,27,67],[27,68,27,70],[27,101,27,103],[27,104,27,106],[27,107,27,109],[27,110,27,112],[27,113,27,115],[27,86,27,88],[25,101,25,103],[26,77,26,79],[26,50,26,52],[26,53,26,55],[26,56,26,58],[26,59,26,61],[27,44,27,46],[27,47,27,49],[25,71,25,73],[27,50,27,52],[26,44,26,46],[26,47,26,49],[25,47,25,49],[25,50,25,52],[25,53,25,55],[25,56,25,58],[27,53,27,55],[25,86,25,88],[25,59,25,61],[25,62,25,64],[25,65,25,67],[25,68,25,70],[27,95,27,97],[27,98,27,100],[27,71,27,73],[27,74,27,76],[26,95,26,97],[27,89,27,91],[27,92,27,94],[25,74,25,76],[25,77,25,79],[25,19,25,21],[25,22,25,24],[25,25,25,27],[25,28,25,30],[25,31,25,33],[25,34,25,37],[25,38,25,40],[25,41,25,43],[25,44,25,46],[27,19,27,21],[27,22,27,24],[27,25,27,27],[27,28,27,30],[27,31,27,33],[27,34,27,37],[27,38,27,40],[27,41,27,43],[26,2,28,17],[26,19,26,21],[26,22,26,24],[26,25,26,27],[26,28,26,30],[26,34,26,37],[26,38,26,40],[26,41,26,43],[26,31,26,33],[12,60,15,97],[26,113,26,115],[26,116,26,118],[26,119,26,121],[26,110,26,112],[26,80,26,82],[26,83,26,85],[26,86,26,88],[26,89,26,91],[26,92,26,94],[26,104,26,106],[26,107,26,109],[25,110,25,112],[25,113,25,115],[25,116,25,118],[25,89,25,91],[25,92,25,94],[25,95,25,97],[25,98,25,100],[12,104,18,105],[12,106,18,107],[25,104,25,106],[25,107,25,109],[25,83,25,85],[22,113,23,115],[22,110,23,112],[22,107,23,109],[22,104,23,106],[23,2,23,103],[22,2,22,103],[26,62,26,64],[12,108,18,109],[12,110,18,111],[26,98,26,100],[26,101,26,103],[19,2,19,8],[19,10,19,121],[20,2,20,121],[21,2,21,8],[25,119,25,121],[25,80,25,82],[26,65,26,67],[26,68,26,70],[26,71,26,73],[26,74,26,76],[12,98,18,99],[12,100,18,101],[12,102,18,103],[6,36,10,38],[13,36,17,38],[12,118,18,119],[12,120,18,121],[9,60,11,97],[16,60,18,97],[5,100,11,101],[5,98,11,99],[24,104,24,121],[6,40,10,58],[13,40,17,58],[5,120,11,121],[5,118,11,119],[5,116,11,117],[5,114,11,115],[5,112,11,113],[5,110,11,111],[5,60,8,97],[12,114,18,115],[12,116,18,117],[22,119,23,121],[22,116,23,118],[21,10,21,121],[12,112,18,113],[2,0,41,0],[43,0,93,0],[72,3,72,120],[71,24,71,120],[74,117,75,121],[74,109,75,113],[74,106,75,108],[74,114,75,116],[66,103,67,119],[70,3,70,120],[66,37,67,46],[3,2,3,34],[3,35,3,121],[4,2,5,3],[4,4,5,16],[4,17,5,21],[4,22,5,26],[4,27,5,33],[62,77,62,84],[63,73,63,84],[62,53,63,72],[62,2,63,17],[62,34,63,52],[62,86,63,88],[2,123,41,123],[43,123,84,123],[78,102,78,110],[82,6,83,119],[85,72,92,96],[92,103,93,118],[69,3,69,9],[69,11,69,120],[62,18,63,33],[64,4,65,35],[66,3,66,18],[67,3,67,18],[67,33,67,36],[66,27,67,32],[66,56,67,67],[66,83,67,99],[5,108,11,109],[5,106,11,107],[5,104,11,105],[5,102,11,103],[4,37,4,121],[9,3,16,7],[9,9,12,32],[13,9,17,32]]}
[null,null,null,null,null,null,null,null,null,null,null,null,null,null,null,null,null,null,null,null,null,null,null,null,null,null,null,null,null,null,null,null,null,null,null,"http://mw-online.ru/content/f-112ep-postal-order-form-in-excel"]
[]
["Обведенное жирной линией заполняется отправителем перевода или РПО",null,null,null,null,null,null,null,null,null,null,null,null,null,null,null,null,null,null,null,null,null,null,null,null,null,null,null,null,null,null,null,null,null,null,null,null,null,null,null,null,null,null,null,null,null,null,null,null,null,null,null,null,null,null,null,null,null,null,null,null,null,null,null,null,null,null,null,null,null,null,null,null,null,null,null,null,null,null,null,null,null,null,null,null,null,null,null,null,null,null,null,null,null,null,null,null,null,null,null,null,null,null,null,null,null,null,null,null,null,null,null,null,null,null,null,null,null,null,null,null,null,null,"Исправления не допускаются"]
[null,null,"ПОЧТОВЫЙ ПЕРЕВОД",null,null,null,null,null,null,null,null,null,null,null,null,null,null,null,null,null,null,null,null,null,null,null,null,null,null,null,null,null,null,null,null,{"$f":"ф.7п!$AH$8","v":"0 (  ) руб. 00 коп."}]
[null,null,"на",null,{"$f":"ф.7п!$BL$4","v":0},null,null,null,null,null,null,null,null,null,null,null,null,"руб.",null,null,null,null,0,null,null,null,null,"коп.",null,null,null,null,null,null,null,null,null,"(Рубли прописью, копейки цифрами)"]
[null,null,null,null,null,null,null,null,null,null,null,null,null,null,null,null,null,null,null,null,null,null,null,null,null,null,null,null,null,null,null,null,null,null,null,null,null,null,null,null,null,null,null,null,null,null,null,null,null,null,null,null,null,null,null,null,null,null,null,null,"SMS о поступлении почтового перевода в ОПС",null,null,null,null,null,null,null,null,null,null,null,null,null,null,null,null,null,null,null,null,null,null,null,null,null,null,null,null,null,null,null,null,null,null,null,null,null,"+",null,7]
[null,null,null,null,null,null,null,null,null,null,null,null,null,null,null,null,null,null,null,null,null,null,null,null,null,null,null,null,null,null,null,null,null,null,null,null,null,null,null,null,"с доставкой на дом"]
[]
[]
[null,null,null,"V",null,null,null,null,null,"НАЛОЖЕННЫЙ",null,null,null,null,null,null,null,null,null,null,null,null,null,null,null,null,null,null,null,null,null,null,null,null,null,null,null,null,null,null,null,null,null,null,null,null,null,null,null,null,null,null,null,null,null,null,null,null,null,null,"выплаты, № мобильного телефона адресата"]
{"$rows_left_out":84}
{"sheet":"Печать","index":4,"n_rows":33,"n_cols":5,"rows_kept":33,"cut":false,"hidden":false,"merged":[]}
[]
[]
[]
[]
[]
[]
[]
[]
[]
[]
{"$rows_left_out":23}