{"text_format":"1","workbook":"xlsx","n_sheets":3,"sheets":["анализ","Загальний ввод","NMDC"],"not_rendered":{"charts":0,"images":0,"macros":1,"external_links":0,"defined_names":0,"comments":0,"pivot_tables":0},"unopened":[],"bounds":{"document_bytes":16777216,"sheet_cells":100000,"rows_first":2000,"rows_last":500,"rows_between":2000,"halvings":0,"cell_chars":16384,"cell_head_chars":4096},"cells_cut":0,"cells_raw":0,"read":"whole","date_system":"1900"}

{"sheet":"анализ","index":0,"n_rows":0,"n_cols":0,"rows_kept":0,"cut":false,"hidden":true,"merged":[]}

{"sheet":"Загальний ввод","index":1,"n_rows":41,"n_cols":26,"rows_kept":41,"cut":false,"hidden":false,"merged":[[38,1,38,14],[18,0,19,0],[18,1,19,1],[18,2,18,4],[18,5,18,7],[18,11,19,11],[18,23,18,25],[16,7,16,8],[16,10,16,11],[17,7,17,8],[17,10,17,12],[18,15,18,16],[18,17,18,19],[18,20,18,22],[18,12,19,12]]}
[]
[]
[]
[]
[]
[]
[]
[]
[]
[]
[]
[]
[]
[]
[]
[]
[]
[]
["№","Свердловина","Початок експлуатації приладу",null,null,"Кінець експлуатації приладу",null,null,"Час експлуатації, год","Час циркуляції, год","Інтервал роботи, м","Відмітка про проведення ремонту","Примітки(дата, вид роботи)","Циркуляція","Час нижче ротора","Механічні пульсатори",null,"НОБТ 203мм",null,null,"НОБТ 171,5 мм",null,null,"НОБТ 127 мм"]
[null,null,"Дата","Час, год","Глибина, м","Дата","Час, год","Глибина, м",{"$f":"SUM(I21:I38)","v":160.29305555555038},{"$f":"IF(SUM(J21:J38)>0,SUM(J21:J38),0)","v":86.205555555555549},{"$f":"SUM(K21:K38)","v":2518.3000000000002},null,null,null,null,"Пульсатор СР0551","Пульсатор СР0552","NMDC 203001","NMDC 203002","NMDC 203003","NMDC 1338","NMDC 1339","NMDC 1341","NMDC 127001","NMDC 127002","NMDC 127003"]
[1,"300 Опішня","2018-10-03","01:30:00",3188.9,"2018-10-13","08:00:00",3314.8,{"$f":"IF(F21>0,(F21+G21)-(C21+D21),\" \")","v":10.270833333335759},5.2791666666666668,{"$f":"IF(H21>0,H21-E21,\" \")","v":125.90000000000009},null,null,null,null,null,1,null,null,1]
[2,"525 Кегичівка","2018-10-16","08:18:00",2055.4,"2018-10-25","04:00:00",2163.5,8.8208333333313931,4.7638888888888884,{"$f":"IF(H22>0,H22-E22,\" \")","v":108.09999999999991},null,null,null,null,null,1]
[3,"33 Краснокутська","2018-11-28","08:00:00",3545,"2018-12-13","12:45:00",3623.1,15.197916666664241,8.7430555555555554,{"$f":"IF(H23>0,H23-E23,\" \")","v":78.099999999999909},"Сервіс","Проводили сервіс, замінили полипак смолл, ризинки в незадовільному стані, а саме, якісь дубові, тим самим вони пропустили невелику кількість бруду, на роботу пульсатора це ніяким чином не вплинуло. Сервіс провили при напрацюванні 450:52 годни циркуляції",11.208333333333334,15.076388888888888,null,1,null,1,1]
[4,"22 Зах Борисівська","2019-01-04","16:00:00",926,null,null,null," ",null," ",null,null,null,null,null,1]
[7,"26 Червоноярська","2018-06-16","03:00:00",1080,"2018-06-22","10:00:00",1333.8,{"$f":"IF(F25>0,(F25+G25)-(C25+D25),\" \")","v":6.2916666666642413},4.625,{"$f":"IF(H25>0,H25-E25,\" \")","v":253.79999999999995},null,null,4.625,6.291666666666667,null,null,null,1,1]
[8,"117 Медведівка","2018-06-29","12:30:00",1120.5999999999999,"2018-07-07","05:00:00",1458.5,7.6875,3.6388888888888888,{"$f":"IF(H26>0,H26-E26,\" \")","v":337.90000000000009},"Сервіс","Порушення цілісності мембрани сервоклапана, выкревлений вал сервоклапана",3.6388888888888888,7.6875,null,null,null,1,1]
[9,null,null,null,null,null,null,null," ",null,{"$f":"IF(H27>0,H27-E27,\" \")","v":" "}]
[1,"117 Медведівка","2018-07-18","04:20:00",2080,"2018-07-22","12:30:00",2247,{"$f":"IF(F28>0,(F28+G28)-(C28+D28),\" \")","v":4.3402777777810115},1.84375,167,null,null,1.84375,3.1805555555555554,null,null,null,1,1]
[2,"85 сх.Медведівка","2018-07-30","11:35:00",1774,"2018-08-05","12:00:00",2008.7,6.0173611111094942,3.1041666666666665,234.70000000000005,null,null,3.1041666666666665,5.395833333333333,null,null,null,1,1]
[null,"73 Зах.Соснівська","2018-08-13","16:30:00",3430,"2018-09-01","08:00:00",3660,{"$f":"IF(F30>0,F30-C30,\" \")","v":19},10.897916666666667,{"$f":"IF(H30>0,H30-E30,\" \")","v":230},null,null,10.897916666666667,17.229166666666668,null,null,null,null,null,1,1]
[null,"300 Опішня","2018-09-16","09:30:00",3095,"2018-10-13","08:00:00",3314.8,27,11.78125,219.80000000000018,null,null,11.78125,22.243055555555557,null,null,null,1,1]
[null,"525 Кегичівка","2018-10-16","08:18:00",2055.4,"2018-10-25","04:00:00",2163.5,9,4.7638888888888884,108.09999999999991,null,null,4.7638888888888884,9.125,null,null,null,1,1]
[null,"33 Краснокутська","2018-11-28","05:00:00",3545,"2018-12-17","18:00:00",3679.3,{"$f":"IF(F33>0,F33-C33,\" \")","v":19},11.121527777777779,134.30000000000018,"Сервіс","Сервіс ролл тесту проводили більш менш з меншими похибками біля прачечной на вході ПВБР",11.208333333333334,15.076388888888888,null,null,null,1,1]
[null,"22 Зах Борисівська","2019-01-04","16:00:00",926,null,null,null," ",null," "]
[null,"117Медведівка","2018-10-20","08:00:00",3380,"2018-10-29","08:00:00",3521.7,{"$f":"IF(F35>0,(F35+G35)-(C35+D35),\" \")","v":9},5.770833333333333,141.69999999999982,null,null,5.770833333333333,8.0833333333333339,null,null,null,null,null,1,1]
[null,"160 Гадяч","2018-11-03","08:00:00",3073,"2018-11-14","00:00:00",3296,10.666666666664241,6.6486111111111112,223,null,null,6.6486111111111112,9.8958333333333339,null,null,null,null,null,null,1,1]
[null,"50 Абазівка","2018-11-24","08:00:00",4005.6,"2018-12-02","08:00:00",4161.5,8,3.223611111111111,155.90000000000009,null,"05-12-18 , переповнення пом'яті, зтирання пам'яті.",3.223611111111111,10.1875,null,null,null,null,null,null,1,1]
[null,null,null,null,null,null,null,null," ",null," "]
[null,"РОБОТИ з 01.01.2019 р."]
[null,"410 Біляївська","2019-01-06","08:30:00",3400.7,null,null,null,{"$f":"IF(F40>0,(F40+G40)-(C40+D40),\" \")","v":" "},null,{"$f":"IF(H40>0,H40-E40,\" \")","v":" "},null,null,null,null,null,null,null,null,null,null,1,1]
[null,"22 Зах Борисівська","2019-01-04","16:00:00",926,null,null,null,null,null,null,null,null,null,null,null,null,null,1,1]

{"sheet":"NMDC","index":2,"n_rows":315,"n_cols":24,"rows_kept":315,"cut":false,"hidden":false,"merged":[[1,0,2,0],[1,1,2,1],[1,2,1,4],[1,5,1,7]]}
[null,null,null,null,null,null,null,null,null,null,41.666666666666664,null,null,41.666666666666664,null,null,41.666666666666664]
["N п/п","Свердловина","Дата початку експлуатації",null,null,"Дата кінця експлуатації",null,null,"Інтервал роботи, м",null,"NMDC 171",null,null,"NMDC 203",null,null,"NMDC 127",null,"сервіс NMDC ","сервіс NMDC ","сервіс NMDC ","Дифектоскопія NMDC ","Дифектоскопія NMDC ","Дифектоскопія NMDC "]
[null,null,"Дата","Час, год","Глибина, м","Дата","Час, год","Глибина, м",{"$f":"SUM(I4:I41)","v":1212.8000000000002},"NMDC 1338","NMDC 1339","NMDC 1341","NMDC 203001","NMDC 203002","NMDC 203003","NMDC 127001","NMDC 127002","NMDC 127003",203,171,127,203,171,127]
[null,"Заг.напр.циркуляція",null,null,null,null,null,null,null,{"$f":"K1-SUMIF(INDEX(B5:B978,IF(ISNA(MATCH(\"сервіс1338\",T5:T978,)),1,SUMPRODUCT(MAX((T5:T978=\"сервіс1338\")*ROW(J5:J978)))-10)):B978,#REF!,INDEX(J5:J978,IF(ISNA(MATCH(\"сервіс1338\",T5:T978,)),1,SUMPRODUCT(MAX((T5:T978=\"сервіс1338\")*ROW(J5:J978)))-10)):J978)","v":{"$error":"#VALUE!"}},{"$f":"K1-SUMIF(INDEX(B5:B978,IF(ISNA(MATCH(\"сервіс1339\",T5:T978,)),1,SUMPRODUCT(MAX((T5:T978=\"сервіс1339\")*ROW(K5:K978)))-10)):B978,#REF!,INDEX(K5:K978,IF(ISNA(MATCH(\"сервіс1339\",T5:T978,)),1,SUMPRODUCT(MAX((T5:T978=\"сервіс1339\")*ROW(K5:K978)))-10)):K978)","v":{"$error":"#VALUE!"}},{"$f":"K1-SUMIF(INDEX(B5:B978,IF(ISNA(MATCH(\"сервіс1341\",T5:T978,)),1,SUMPRODUCT(MAX((T5:T978=\"сервіс1341\")*ROW(L5:L978)))-10)):B978,#REF!,INDEX(L5:L978,IF(ISNA(MATCH(\"сервіс1341\",T5:T978,)),1,SUMPRODUCT(MAX((T5:T978=\"сервіс1341\")*ROW(L5:L978)))-10)):L978)","v":{"$error":"#VALUE!"}},{"$f":"N1-SUMIF(INDEX(B5:B978,IF(ISNA(MATCH(\"сервіс203001\",S5:S978,)),1,SUMPRODUCT(MAX((S5:S978=\"сервіс203001\")*ROW(M5:M978)))-10)):B978,#REF!,INDEX(M5:M978,IF(ISNA(MATCH(\"сервіс203001\",S5:S978,)),1,SUMPRODUCT(MAX((S5:S978=\"сервіс203001\")*ROW(M5:M978)))-10)):M978)","v":41.666666666666664},{"$f":"N1-SUMIF(INDEX(B5:B978,IF(ISNA(MATCH(\"сервіс203002\",S5:S978,)),1,SUMPRODUCT(MAX((S5:S978=\"сервіс203002\")*ROW(N5:N978)))-10)):B978,#REF!,INDEX(N5:N978,IF(ISNA(MATCH(\"сервіс203002\",S5:S978,)),1,SUMPRODUCT(MAX((S5:S978=\"сервіс203002\")*ROW(N5:N978)))-10)):N978)","v":41.666666666666664},{"$f":"N1-SUMIF(INDEX(B5:B978,IF(ISNA(MATCH(\"сервіс203003\",S5:S978,)),1,SUMPRODUCT(MAX((S5:S978=\"сервіс203003\")*ROW(O5:O978)))-10)):B978,#REF!,INDEX(O5:O978,IF(ISNA(MATCH(\"сервіс203003\",S5:S978,)),1,SUMPRODUCT(MAX((S5:S978=\"сервіс203003\")*ROW(O5:O978)))-10)):O978)","v":41.666666666666664},{"$f":"Q1-SUMIF(INDEX(B5:B978,IF(ISNA(MATCH(\"сервіс127001\",U5:U978,)),1,SUMPRODUCT(MAX((U5:U978=\"сервіс127001\")*ROW(P5:P978)))-10)):B978,#REF!,INDEX(P5:P978,IF(ISNA(MATCH(\"сервіс127001\",U5:U978,)),1,SUMPRODUCT(MAX((U5:U978=\"сервіс127001\")*ROW(P5:P978)))-10)):P978)","v":41.666666666666664},{"$f":"Q1-SUMIF(INDEX(B5:B978,IF(ISNA(MATCH(\"сервіс127002\",U5:U978,)),1,SUMPRODUCT(MAX((U5:U978=\"сервіс127002\")*ROW(Q5:Q978)))-10)):B978,#REF!,INDEX(Q5:Q978,IF(ISNA(MATCH(\"сервіс127002\",U5:U978,)),1,SUMPRODUCT(MAX((U5:U978=\"сервіс127002\")*ROW(Q5:Q978)))-10)):Q978)","v":41.666666666666664},{"$f":"Q1-SUMIF(INDEX(B5:B978,IF(ISNA(MATCH(\"сервіс127003\",U5:U978,)),1,SUMPRODUCT(MAX((U5:U978=\"сервіс127003\")*ROW(R5:R978)))-10)):B978,#REF!,INDEX(R5:R978,IF(ISNA(MATCH(\"сервіс127003\",U5:U978,)),1,SUMPRODUCT(MAX((U5:U978=\"сервіс127003\")*ROW(R5:R978)))-10)):R978)","v":41.666666666666664}]
[5,"73 Зах.Соснівська","2018-08-13","16:30:00",3430,"2018-09-01","08:00:00",3660,{"$f":"H5-E5","v":230}]
[null,"Циркуляція",null,null,null,null,null,null,null,{"$f":"IF('Загальний ввод'!U30<1,0,'Загальний ввод'!N30)","v":10.897916666666667},{"$f":"IF('Загальний ввод'!V30<1,0,'Загальний ввод'!N30)","v":10.897916666666667},{"$f":"IF('Загальний ввод'!W30<1,0,'Загальний ввод'!N30)","v":0}]
[null,"Інтервал роботи",null,null,null,null,null,null,null,{"$f":"IF('Загальний ввод'!U30<1,0,'Загальний ввод'!K30)","v":230},{"$f":"IF('Загальний ввод'!V30<1,0,'Загальний ввод'!K30)","v":230},{"$f":"IF('Загальний ввод'!W30<1,0,'Загальний ввод'!K30)","v":0},null,null,null,null,null,null,null,"сервіс1338"]
[null,"Час нижче ротора",null,null,null,null,null,null,null,{"$f":"IF('Загальний ввод'!U30<1,0,'Загальний ввод'!O30)","v":17.229166666666668},{"$f":"IF('Загальний ввод'!V30<1,0,'Загальний ввод'!O30)","v":17.229166666666668},{"$f":"IF('Загальний ввод'!W30<1,0,'Загальний ввод'!O30)","v":0},null,null,null,null,null,null,null,"сервіс1339"]
[6,"300 Опішня","2018-09-16","09:30:00",3095,"2018-10-13","08:00:00",3314.8,219.80000000000018,null,null,null,null,null,null,null,null,null,null,"сервіс1341"]
[null,"Циркуляція",null,null,null,null,null,null,null,null,null,null,{"$f":"IF('Загальний ввод'!R31<1,0,'Загальний ввод'!N31)","v":0},{"$f":"IF('Загальний ввод'!S31<1,0,'Загальний ввод'!N31)","v":11.78125},{"$f":"IF('Загальний ввод'!T31<1,0,'Загальний ввод'!N31)","v":11.78125}]
[null,"Інтервал роботи",null,null,null,null,null,null,null,null,null,null,{"$f":"IF('Загальний ввод'!R31<1,0,'Загальний ввод'!K31)","v":0},{"$f":"IF('Загальний ввод'!S31<1,0,'Загальний ввод'!K31)","v":219.80000000000018},{"$f":"IF('Загальний ввод'!T31<1,0,'Загальний ввод'!K31)","v":219.80000000000018},null,null,null,null,null,null,null,"дифектоскопія1338"]
[null,"Час нижче ротора",null,null,null,null,null,null,null,null,null,null,{"$f":"IF('Загальний ввод'!R31<1,0,'Загальний ввод'!O31)","v":0},{"$f":"IF('Загальний ввод'!S31<1,0,'Загальний ввод'!O31)","v":22.243055555555557},{"$f":"IF('Загальний ввод'!T31<1,0,'Загальний ввод'!O31)","v":22.243055555555557},null,null,null,null,null,null,null,"дифектоскопія1339"]
[7,"525 Кегичівка","2018-10-16","08:18:00",2055.4,"2018-10-25","04:00:00",2163.5,{"$f":"H13-E13","v":108.09999999999991}]
[null,"Циркуляція",null,null,null,null,null,null,null,null,null,null,{"$f":"IF('Загальний ввод'!R32<1,0,'Загальний ввод'!N32)","v":0},{"$f":"IF('Загальний ввод'!S32<1,0,'Загальний ввод'!N32)","v":4.7638888888888884},{"$f":"IF('Загальний ввод'!T32<1,0,'Загальний ввод'!N32)","v":4.7638888888888884},null,null,null,"сервіс203001",null,null,"дифектоскопія203003"]
[null,"Інтервал роботи",null,null,null,null,null,null,null,null,null,null,{"$f":"IF('Загальний ввод'!R32<1,0,'Загальний ввод'!K32)","v":0},{"$f":"IF('Загальний ввод'!S32<1,0,'Загальний ввод'!K32)","v":108.09999999999991},{"$f":"IF('Загальний ввод'!T32<1,0,'Загальний ввод'!K32)","v":108.09999999999991},null,null,null,"сервіс203002",null,null,"дифектоскопія203001"]
[null,"Час нижче ротора",null,null,null,null,null,null,null,null,null,null,{"$f":"IF('Загальний ввод'!R32<1,0,'Загальний ввод'!O32)","v":0},{"$f":"IF('Загальний ввод'!S32<1,0,'Загальний ввод'!O32)","v":9.125},{"$f":"IF('Загальний ввод'!T32<1,0,'Загальний ввод'!O32)","v":9.125},null,null,null,"сервіс203003",null,null,"дифектоскопія203002"]
[8,"117Медведівка","2018-10-20","08:00:00",3380,"2018-10-29","08:00:00",3521.7,{"$f":"H17-E17","v":141.69999999999982}]
[9,"Циркуляція",null,null,null,null,null,null,null,{"$f":"IF('Загальний ввод'!U35<1,0,'Загальний ввод'!N35)","v":5.770833333333333},{"$f":"IF('Загальний ввод'!V35<1,0,'Загальний ввод'!N35)","v":5.770833333333333},{"$f":"IF('Загальний ввод'!W35<1,0,'Загальний ввод'!N35)","v":0}]
[null,"Інтервал роботи",null,null,null,null,null,null,null,{"$f":"IF('Загальний ввод'!U35<1,0,'Загальний ввод'!K35)","v":141.69999999999982},{"$f":"IF('Загальний ввод'!V35<1,0,'Загальний ввод'!K35)","v":141.69999999999982},{"$f":"IF('Загальний ввод'!W35<1,0,'Загальний ввод'!K35)","v":0}]
[null,"Час нижче ротора",null,null,null,null,null,null,null,{"$f":"IF('Загальний ввод'!U35<1,0,'Загальний ввод'!O35)","v":8.0833333333333339},{"$f":"IF('Загальний ввод'!V35<1,0,'Загальний ввод'!O35)","v":8.0833333333333339},{"$f":"IF('Загальний ввод'!W35<1,0,'Загальний ввод'!O35)","v":0}]
[9,"160 Гадяч","2018-11-03","08:00:00",3073,"2018-11-14","00:00:00",3296,{"$f":"H21-E21","v":223}]
[45,"Циркуляція",null,null,null,null,null,null,null,{"$f":"IF('Загальний ввод'!U36<1,0,'Загальний ввод'!N36)","v":0},{"$f":"IF('Загальний ввод'!V36<1,0,'Загальний ввод'!N36)","v":6.6486111111111112},{"$f":"IF('Загальний ввод'!W36<1,0,'Загальний ввод'!N36)","v":6.6486111111111112}]
[null,"Інтервал роботи",null,null,null,null,null,null,null,{"$f":"IF('Загальний ввод'!U36<1,0,'Загальний ввод'!K36)","v":0},{"$f":"IF('Загальний ввод'!V36<1,0,'Загальний ввод'!K36)","v":223},{"$f":"IF('Загальний ввод'!W36<1,0,'Загальний ввод'!K36)","v":223}]
[null,"Час нижче ротора",null,null,null,null,null,null,null,{"$f":"IF('Загальний ввод'!U36<1,0,'Загальний ввод'!O36)","v":0},{"$f":"IF('Загальний ввод'!V36<1,0,'Загальний ввод'!O36)","v":9.8958333333333339},{"$f":"IF('Загальний ввод'!W36<1,0,'Загальний ввод'!O36)","v":9.8958333333333339}]
[10,"33 Краснокутська","2018-11-28","05:00:00",3545,"2018-12-17","18:00:00",3679.3,{"$f":"H25-E25","v":134.30000000000018}]
[null,"Циркуляція",null,null,null,null,null,null,null,null,null,null,{"$f":"IF('Загальний ввод'!R33<1,0,'Загальний ввод'!N33)","v":0},{"$f":"IF('Загальний ввод'!S33<1,0,'Загальний ввод'!N33)","v":11.208333333333334},{"$f":"IF('Загальний ввод'!T33<1,0,'Загальний ввод'!N33)","v":11.208333333333334}]
[null,"Інтервал роботи",null,null,null,null,null,null,null,null,null,null,{"$f":"IF('Загальний ввод'!R33<1,0,'Загальний ввод'!K33)","v":0},{"$f":"IF('Загальний ввод'!S33<1,0,'Загальний ввод'!K33)","v":134.30000000000018},{"$f":"IF('Загальний ввод'!T33<1,0,'Загальний ввод'!K33)","v":134.30000000000018}]
[null,"Час нижче ротора",null,null,null,null,null,null,null,null,null,null,{"$f":"IF('Загальний ввод'!R33<1,0,'Загальний ввод'!O33)","v":0},{"$f":"IF('Загальний ввод'!S33<1,0,'Загальний ввод'!O33)","v":15.076388888888888},{"$f":"IF('Загальний ввод'!T33<1,0,'Загальний ввод'!O33)","v":15.076388888888888}]
[11,"50 Абазівка","2018-11-24","08:00:00",4005.6,"2018-12-02","08:00:00",4161.5,{"$f":"H29-E29","v":155.90000000000009}]
[null,"Циркуляція",null,null,null,null,null,null,null,{"$f":"IF('Загальний ввод'!U37<1,0,'Загальний ввод'!N37)","v":0},{"$f":"IF('Загальний ввод'!V37<1,0,'Загальний ввод'!N37)","v":3.223611111111111},{"$f":"IF('Загальний ввод'!W37<1,0,'Загальний ввод'!N37)","v":3.223611111111111}]
[null,"Інтервал роботи",null,null,null,null,null,null,null,{"$f":"IF('Загальний ввод'!U37<1,0,'Загальний ввод'!K37)","v":0},{"$f":"IF('Загальний ввод'!V37<1,0,'Загальний ввод'!K37)","v":155.90000000000009},{"$f":"IF('Загальний ввод'!W37<1,0,'Загальний ввод'!K37)","v":155.90000000000009}]
[null,"Час нижче ротора",null,null,null,null,null,null,null,{"$f":"IF('Загальний ввод'!U37<1,0,'Загальний ввод'!O37)","v":0},{"$f":"IF('Загальний ввод'!V37<1,0,'Загальний ввод'!O37)","v":10.1875},{"$f":"IF('Загальний ввод'!W37<1,0,'Загальний ввод'!O37)","v":10.1875}]
[{"$f":"IF(SUM('Загальний ввод'!R41:Z41),'Загальний ввод'!B41,\"?\")","v":"22 Зах Борисівська"},"22 Зах Борисівська","2019-01-04","16:00:00",926]
[{"$f":"IF(SUM('Загальний ввод'!R42:Z42),'Загальний ввод'!B42,\"?\")","v":"?"},"Циркуляція"]
[{"$f":"IF(SUM('Загальний ввод'!R43:Z43),'Загальний ввод'!B43,\"?\")","v":"?"},"Інтервал роботи"]
[{"$f":"IF(SUM('Загальний ввод'!R44:Z44),'Загальний ввод'!B44,\"?\")","v":"?"},"Час нижче ротора"]
[{"$f":"IF(SUM('Загальний ввод'!R45:Z45),'Загальний ввод'!B45,\"?\")","v":"?"},"410 Біляївська","2019-01-06","08:30:00",3400.7]
[{"$f":"IF(SUM('Загальний ввод'!R46:Z46),'Загальний ввод'!B46,\"?\")","v":"?"},"Циркуляція"]
[{"$f":"IF(SUM('Загальний ввод'!R47:Z47),'Загальний ввод'!B47,\"?\")","v":"?"},"Інтервал роботи"]
[{"$f":"IF(SUM('Загальний ввод'!R48:Z48),'Загальний ввод'!B48,\"?\")","v":"?"},"Час нижче ротора"]
[{"$f":"IF(SUM('Загальний ввод'!R49:Z49),'Загальний ввод'!B49,\"?\")","v":"?"}]
[{"$f":"IF(SUM('Загальний ввод'!R50:Z50),'Загальний ввод'!B50,\"?\")","v":"?"}]
[]
[{"$f":"IF(SUM('Загальний ввод'!R52:Z52),'Загальний ввод'!B52,\"?\")","v":"?"}]
[{"$f":"IF(SUM('Загальний ввод'!R53:Z53),'Загальний ввод'!B53,\"?\")","v":"?"}]
[{"$f":"IF(SUM('Загальний ввод'!R54:Z54),'Загальний ввод'!B54,\"?\")","v":"?"}]
[{"$f":"IF(SUM('Загальний ввод'!R55:Z55),'Загальний ввод'!B55,\"?\")","v":"?"},{"$f":"IF('Загальний ввод'!R21=1,'Загальний ввод'!B21,IF('Загальний ввод'!S21=1,'Загальний ввод'!B21,IF('Загальний ввод'!T21=1,'Загальний ввод'!B21,)))","v":"300 Опішня"}]
[{"$f":"IF(SUM('Загальний ввод'!R56:Z56),'Загальний ввод'!B56,\"?\")","v":"?"},{"$f":"IF('Загальний ввод'!R22<1,0,IF('Загальний ввод'!S22<1,0,IF('Загальний ввод'!T22<1,0,'Загальний ввод'!B22)))","v":0}]
[{"$f":"IF(SUM('Загальний ввод'!R57:Z57),'Загальний ввод'!B57,\"?\")","v":"?"},{"$f":"IF('Загальний ввод'!R23<1,0,IF('Загальний ввод'!S23<1,0,IF('Загальний ввод'!T23<1,0,'Загальний ввод'!B23)))","v":0}]
[{"$f":"IF(SUM('Загальний ввод'!R58:Z58),'Загальний ввод'!B58,\"?\")","v":"?"},{"$f":"IF('Загальний ввод'!R24<1,0,IF('Загальний ввод'!S24<1,0,IF('Загальний ввод'!T24<1,0,'Загальний ввод'!B24)))","v":0}]
[{"$f":"IF(SUM('Загальний ввод'!R59:Z59),'Загальний ввод'!B59,\"?\")","v":"?"},{"$f":"IF('Загальний ввод'!#REF!<1,0,IF('Загальний ввод'!#REF!<1,0,IF('Загальний ввод'!#REF!<1,0,'Загальний ввод'!#REF!)))","v":{"$error":"#REF!"}}]
[{"$f":"IF(SUM('Загальний ввод'!R60:Z60),'Загальний ввод'!B60,\"?\")","v":"?"},{"$f":"IF('Загальний ввод'!#REF!<1,0,IF('Загальний ввод'!#REF!<1,0,IF('Загальний ввод'!#REF!<1,0,'Загальний ввод'!#REF!)))","v":{"$error":"#REF!"}}]
[{"$f":"IF(SUM('Загальний ввод'!R61:Z61),'Загальний ввод'!B61,\"?\")","v":"?"},{"$f":"IF('Загальний ввод'!#REF!<1,0,IF('Загальний ввод'!#REF!<1,0,IF('Загальний ввод'!#REF!<1,0,'Загальний ввод'!#REF!)))","v":{"$error":"#REF!"}}]
[{"$f":"IF(SUM('Загальний ввод'!R62:Z62),'Загальний ввод'!B62,\"?\")","v":"?"},{"$f":"IF('Загальний ввод'!#REF!<1,0,IF('Загальний ввод'!#REF!<1,0,IF('Загальний ввод'!#REF!<1,0,'Загальний ввод'!#REF!)))","v":{"$error":"#REF!"}}]
[{"$f":"IF(SUM('Загальний ввод'!R63:Z63),'Загальний ввод'!B63,\"?\")","v":"?"},{"$f":"IF('Загальний ввод'!#REF!<1,0,IF('Загальний ввод'!#REF!<1,0,IF('Загальний ввод'!#REF!<1,0,'Загальний ввод'!#REF!)))","v":{"$error":"#REF!"}}]
[{"$f":"IF(SUM('Загальний ввод'!R64:Z64),'Загальний ввод'!B64,\"?\")","v":"?"},{"$f":"IF('Загальний ввод'!#REF!<1,0,IF('Загальний ввод'!#REF!<1,0,IF('Загальний ввод'!#REF!<1,0,'Загальний ввод'!#REF!)))","v":{"$error":"#REF!"}}]
[{"$f":"IF(SUM('Загальний ввод'!R65:Z65),'Загальний ввод'!B65,\"?\")","v":"?"},{"$f":"IF('Загальний ввод'!#REF!<1,0,IF('Загальний ввод'!#REF!<1,0,IF('Загальний ввод'!#REF!<1,0,'Загальний ввод'!#REF!)))","v":{"$error":"#REF!"}}]
[{"$f":"IF(SUM('Загальний ввод'!R66:Z66),'Загальний ввод'!B66,\"?\")","v":"?"},{"$f":"IF('Загальний ввод'!#REF!<1,0,IF('Загальний ввод'!#REF!<1,0,IF('Загальний ввод'!#REF!<1,0,'Загальний ввод'!#REF!)))","v":{"$error":"#REF!"}}]
[{"$f":"IF(SUM('Загальний ввод'!R67:Z67),'Загальний ввод'!B67,\"?\")","v":"?"},{"$f":"IF('Загальний ввод'!#REF!<1,0,IF('Загальний ввод'!#REF!<1,0,IF('Загальний ввод'!#REF!<1,0,'Загальний ввод'!#REF!)))","v":{"$error":"#REF!"}}]
[{"$f":"IF(SUM('Загальний ввод'!R68:Z68),'Загальний ввод'!B68,\"?\")","v":"?"},{"$f":"IF('Загальний ввод'!#REF!<1,0,IF('Загальний ввод'!#REF!<1,0,IF('Загальний ввод'!#REF!<1,0,'Загальний ввод'!#REF!)))","v":{"$error":"#REF!"}}]
[{"$f":"IF(SUM('Загальний ввод'!R69:Z69),'Загальний ввод'!B69,\"?\")","v":"?"},{"$f":"IF('Загальний ввод'!#REF!<1,0,IF('Загальний ввод'!#REF!<1,0,IF('Загальний ввод'!#REF!<1,0,'Загальний ввод'!#REF!)))","v":{"$error":"#REF!"}}]
[{"$f":"IF(SUM('Загальний ввод'!R70:Z70),'Загальний ввод'!B70,\"?\")","v":"?"},{"$f":"IF('Загальний ввод'!#REF!<1,0,IF('Загальний ввод'!#REF!<1,0,IF('Загальний ввод'!#REF!<1,0,'Загальний ввод'!#REF!)))","v":{"$error":"#REF!"}}]
[{"$f":"IF(SUM('Загальний ввод'!R71:Z71),'Загальний ввод'!B71,\"?\")","v":"?"},{"$f":"IF('Загальний ввод'!#REF!<1,0,IF('Загальний ввод'!#REF!<1,0,IF('Загальний ввод'!#REF!<1,0,'Загальний ввод'!#REF!)))","v":{"$error":"#REF!"}}]
[{"$f":"IF(SUM('Загальний ввод'!R72:Z72),'Загальний ввод'!B72,\"?\")","v":"?"},{"$f":"IF('Загальний ввод'!#REF!<1,0,IF('Загальний ввод'!#REF!<1,0,IF('Загальний ввод'!#REF!<1,0,'Загальний ввод'!#REF!)))","v":{"$error":"#REF!"}}]
[{"$f":"IF(SUM('Загальний ввод'!R73:Z73),'Загальний ввод'!B73,\"?\")","v":"?"},{"$f":"IF('Загальний ввод'!#REF!<1,0,IF('Загальний ввод'!#REF!<1,0,IF('Загальний ввод'!#REF!<1,0,'Загальний ввод'!#REF!)))","v":{"$error":"#REF!"}}]
[{"$f":"IF(SUM('Загальний ввод'!R74:Z74),'Загальний ввод'!B74,\"?\")","v":"?"},{"$f":"IF('Загальний ввод'!#REF!<1,0,IF('Загальний ввод'!#REF!<1,0,IF('Загальний ввод'!#REF!<1,0,'Загальний ввод'!#REF!)))","v":{"$error":"#REF!"}}]
[{"$f":"IF(SUM('Загальний ввод'!R75:Z75),'Загальний ввод'!B75,\"?\")","v":"?"},{"$f":"IF('Загальний ввод'!R25<1,0,IF('Загальний ввод'!S25<1,0,IF('Загальний ввод'!T25<1,0,'Загальний ввод'!B25)))","v":0}]
[{"$f":"IF(SUM('Загальний ввод'!R76:Z76),'Загальний ввод'!B76,\"?\")","v":"?"},{"$f":"IF('Загальний ввод'!R26<1,0,IF('Загальний ввод'!S26<1,0,IF('Загальний ввод'!T26<1,0,'Загальний ввод'!B26)))","v":0}]
[{"$f":"IF(SUM('Загальний ввод'!R77:Z77),'Загальний ввод'!B77,\"?\")","v":"?"},{"$f":"IF('Загальний ввод'!R27<1,0,IF('Загальний ввод'!S27<1,0,IF('Загальний ввод'!T27<1,0,'Загальний ввод'!B27)))","v":0}]
[{"$f":"IF(SUM('Загальний ввод'!R78:Z78),'Загальний ввод'!B78,\"?\")","v":"?"},{"$f":"IF('Загальний ввод'!R28<1,0,IF('Загальний ввод'!S28<1,0,IF('Загальний ввод'!T28<1,0,'Загальний ввод'!B28)))","v":0}]
[{"$f":"IF(SUM('Загальний ввод'!R79:Z79),'Загальний ввод'!B79,\"?\")","v":"?"},{"$f":"IF('Загальний ввод'!R29<1,0,IF('Загальний ввод'!S29<1,0,IF('Загальний ввод'!T29<1,0,'Загальний ввод'!B29)))","v":0}]
[{"$f":"IF(SUM('Загальний ввод'!R80:Z80),'Загальний ввод'!B80,\"?\")","v":"?"},{"$f":"IF('Загальний ввод'!#REF!<1,0,IF('Загальний ввод'!#REF!<1,0,IF('Загальний ввод'!#REF!<1,0,'Загальний ввод'!#REF!)))","v":{"$error":"#REF!"}}]
[{"$f":"IF(SUM('Загальний ввод'!R81:Z81),'Загальний ввод'!B81,\"?\")","v":"?"},{"$f":"IF('Загальний ввод'!#REF!<1,0,IF('Загальний ввод'!#REF!<1,0,IF('Загальний ввод'!#REF!<1,0,'Загальний ввод'!#REF!)))","v":{"$error":"#REF!"}}]
[{"$f":"IF(SUM('Загальний ввод'!R82:Z82),'Загальний ввод'!B82,\"?\")","v":"?"},{"$f":"IF('Загальний ввод'!#REF!<1,0,IF('Загальний ввод'!#REF!<1,0,IF('Загальний ввод'!#REF!<1,0,'Загальний ввод'!#REF!)))","v":{"$error":"#REF!"}}]
[{"$f":"IF(SUM('Загальний ввод'!R83:Z83),'Загальний ввод'!B83,\"?\")","v":"?"},{"$f":"IF('Загальний ввод'!#REF!<1,0,IF('Загальний ввод'!#REF!<1,0,IF('Загальний ввод'!#REF!<1,0,'Загальний ввод'!#REF!)))","v":{"$error":"#REF!"}}]
[{"$f":"IF(SUM('Загальний ввод'!R84:Z84),'Загальний ввод'!B84,\"?\")","v":"?"},{"$f":"IF('Загальний ввод'!#REF!<1,0,IF('Загальний ввод'!#REF!<1,0,IF('Загальний ввод'!#REF!<1,0,'Загальний ввод'!#REF!)))","v":{"$error":"#REF!"}}]
[{"$f":"IF(SUM('Загальний ввод'!R85:Z85),'Загальний ввод'!B85,\"?\")","v":"?"},{"$f":"IF('Загальний ввод'!#REF!<1,0,IF('Загальний ввод'!#REF!<1,0,IF('Загальний ввод'!#REF!<1,0,'Загальний ввод'!#REF!)))","v":{"$error":"#REF!"}}]
[{"$f":"IF(SUM('Загальний ввод'!R86:Z86),'Загальний ввод'!B86,\"?\")","v":"?"},{"$f":"IF('Загальний ввод'!#REF!<1,0,IF('Загальний ввод'!#REF!<1,0,IF('Загальний ввод'!#REF!<1,0,'Загальний ввод'!#REF!)))","v":{"$error":"#REF!"}}]
[{"$f":"IF(SUM('Загальний ввод'!R87:Z87),'Загальний ввод'!B87,\"?\")","v":"?"},{"$f":"IF('Загальний ввод'!#REF!<1,0,IF('Загальний ввод'!#REF!<1,0,IF('Загальний ввод'!#REF!<1,0,'Загальний ввод'!#REF!)))","v":{"$error":"#REF!"}}]
[{"$f":"IF(SUM('Загальний ввод'!R88:Z88),'Загальний ввод'!B88,\"?\")","v":"?"},{"$f":"IF('Загальний ввод'!#REF!<1,0,IF('Загальний ввод'!#REF!<1,0,IF('Загальний ввод'!#REF!<1,0,'Загальний ввод'!#REF!)))","v":{"$error":"#REF!"}}]
{"$rows_left_out":235}