{"text_format":"1","workbook":"xlsx","n_sheets":3,"sheets":["Лист1","Лист2","Лист3"],"not_rendered":{"charts":0,"images":0,"macros":1,"external_links":0,"defined_names":0,"comments":0,"pivot_tables":0},"unopened":[],"bounds":{"document_bytes":16777216,"sheet_cells":100000,"rows_first":2000,"rows_last":500,"rows_between":2000,"halvings":0,"cell_chars":16384,"cell_head_chars":4096},"cells_cut":0,"cells_raw":0,"read":"whole","date_system":"1900"}

{"sheet":"Лист1","index":0,"n_rows":48,"n_cols":3,"rows_kept":48,"cut":false,"hidden":false,"merged":[]}
["ФИО","Дата","Кол-во"]
["Сотрудник 1","2019-01-01",3]
["Сотрудник 2","2019-01-01",3]
["Сотрудник 3","2019-01-01",3]
["Сотрудник 4","2019-01-01",3]
["Сотрудник 5","2019-01-01",9]
["Сотрудник 6","2019-01-01",7]
["Сотрудник 7","2019-01-02",5]
["Сотрудник 8","2019-01-02",1]
["Сотрудник 9","2019-01-02",5]
["Сотрудник 10","2019-01-02",6]
["Сотрудник 11","2019-01-02",3]
["Сотрудник 1","2019-01-02",2]
["Сотрудник 2","2019-01-02",1]
["Сотрудник 3","2019-01-02",9]
["Сотрудник 4","2019-01-03",2]
["Сотрудник 5","2019-01-03",3]
["Сотрудник 6","2019-01-03",5]
["Сотрудник 7","2019-01-03",2]
["Сотрудник 8","2019-01-03",5]
["Сотрудник 9","2019-01-03",6]
["Сотрудник 10","2019-01-03",5]
["Сотрудник 11","2019-01-03",4]
["Сотрудник 12","2019-01-03",2]
["Сотрудник 13","2019-01-03",2]
["Сотрудник 14","2019-01-03",3]
["Сотрудник 15","2019-01-03",5]
["Сотрудник 16","2019-01-03",2]
["Сотрудник 17","2019-01-03",5]
["Сотрудник 18","2019-01-03",6]
["Сотрудник 19","2019-01-03",5]
["Сотрудник 20","2019-01-03",2]
["Сотрудник 21","2019-01-03",3]
["Сотрудник 22","2019-01-03",5]
["Сотрудник 23","2019-01-03",2]
["Сотрудник 24","2019-01-03",5]
["Сотрудник 25","2019-01-03",6]
["Сотрудник 10","2019-01-04",5]
["Сотрудник 11","2019-01-04",2]
["Сотрудник 12","2019-01-04",3]
["Сотрудник 13","2019-01-04",5]
["Сотрудник 14","2019-01-04",2]
["Сотрудник 15","2019-01-04",5]
["Сотрудник 16","2019-01-04",6]
["Сотрудник 17","2019-01-04",5]
["Сотрудник 18","2019-01-04",5]
["Сотрудник 5","2019-01-04",6]
["Сотрудник 6","2019-01-04",5]

{"sheet":"Лист2","index":1,"n_rows":32,"n_cols":6,"rows_kept":32,"cut":false,"hidden":false,"merged":[]}
["ФИО","Дата","Код товара","Изготовитель","Кол-во","Сумма"]
["Сотрудник 1","2019-01-02",null,null,{"$f":"INDEX(Лист1!$C$2:$C$48,MATCH(A2&B2,Лист1!$A$2:$A$48&Лист1!$B$2:$B$48,))","v":2}]
["Сотрудник 2","2019-01-01",null,null,{"$f":"INDEX(Лист1!$C$2:$C$48,MATCH(A3&B3,Лист1!$A$2:$A$48&Лист1!$B$2:$B$48,))","v":3}]
["Сотрудник 3","2019-01-01",null,null,{"$f":"INDEX(Лист1!$C$2:$C$48,MATCH(A4&B4,Лист1!$A$2:$A$48&Лист1!$B$2:$B$48,))","v":3}]
["Сотрудник 10","2019-01-03",null,null,{"$f":"INDEX(Лист1!$C$2:$C$48,MATCH(A5&B5,Лист1!$A$2:$A$48&Лист1!$B$2:$B$48,))","v":5}]
["Сотрудник 11","2019-01-01",null,null,{"$f":"INDEX(Лист1!$C$2:$C$48,MATCH(A6&B6,Лист1!$A$2:$A$48&Лист1!$B$2:$B$48,))","v":{"$error":"#N/A"}}]
["Сотрудник 12","2019-01-01",null,null,{"$f":"INDEX(Лист1!$C$2:$C$48,MATCH(A7&B7,Лист1!$A$2:$A$48&Лист1!$B$2:$B$48,))","v":{"$error":"#N/A"}}]
["Сотрудник 13","2019-01-02",null,null,{"$f":"INDEX(Лист1!$C$2:$C$48,MATCH(A8&B8,Лист1!$A$2:$A$48&Лист1!$B$2:$B$48,))","v":{"$error":"#N/A"}}]
["Сотрудник 14","2019-01-03",null,null,{"$f":"INDEX(Лист1!$C$2:$C$48,MATCH(A9&B9,Лист1!$A$2:$A$48&Лист1!$B$2:$B$48,))","v":3}]
["Сотрудник 15","2019-01-03",null,null,{"$f":"INDEX(Лист1!$C$2:$C$48,MATCH(A10&B10,Лист1!$A$2:$A$48&Лист1!$B$2:$B$48,))","v":5}]
["Сотрудник 16","2019-01-03",null,null,{"$f":"INDEX(Лист1!$C$2:$C$48,MATCH(A11&B11,Лист1!$A$2:$A$48&Лист1!$B$2:$B$48,))","v":2}]
["Сотрудник 17","2019-01-05",null,null,{"$f":"INDEX(Лист1!$C$2:$C$48,MATCH(A12&B12,Лист1!$A$2:$A$48&Лист1!$B$2:$B$48,))","v":{"$error":"#N/A"}}]
["Сотрудник 18","2019-01-03",null,null,{"$f":"INDEX(Лист1!$C$2:$C$48,MATCH(A13&B13,Лист1!$A$2:$A$48&Лист1!$B$2:$B$48,))","v":6}]
["Сотрудник 19","2019-01-03",null,null,{"$f":"INDEX(Лист1!$C$2:$C$48,MATCH(A14&B14,Лист1!$A$2:$A$48&Лист1!$B$2:$B$48,))","v":5}]
["Сотрудник 20","2019-01-03",null,null,{"$f":"INDEX(Лист1!$C$2:$C$48,MATCH(A15&B15,Лист1!$A$2:$A$48&Лист1!$B$2:$B$48,))","v":2}]
["Сотрудник 21","2019-01-03",null,null,{"$f":"INDEX(Лист1!$C$2:$C$48,MATCH(A16&B16,Лист1!$A$2:$A$48&Лист1!$B$2:$B$48,))","v":3}]
["Сотрудник 22","2019-01-03",null,null,{"$f":"INDEX(Лист1!$C$2:$C$48,MATCH(A17&B17,Лист1!$A$2:$A$48&Лист1!$B$2:$B$48,))","v":5}]
["Сотрудник 23","2019-01-02",null,null,{"$f":"INDEX(Лист1!$C$2:$C$48,MATCH(A18&B18,Лист1!$A$2:$A$48&Лист1!$B$2:$B$48,))","v":{"$error":"#N/A"}}]
["Сотрудник 25","2019-01-04",null,null,{"$f":"INDEX(Лист1!$C$2:$C$48,MATCH(A19&B19,Лист1!$A$2:$A$48&Лист1!$B$2:$B$48,))","v":{"$error":"#N/A"}}]
["Сотрудник 10","2019-01-05",null,null,{"$f":"INDEX(Лист1!$C$2:$C$48,MATCH(A20&B20,Лист1!$A$2:$A$48&Лист1!$B$2:$B$48,))","v":{"$error":"#N/A"}}]
["Сотрудник 11","2019-01-06",null,null,{"$f":"INDEX(Лист1!$C$2:$C$48,MATCH(A21&B21,Лист1!$A$2:$A$48&Лист1!$B$2:$B$48,))","v":{"$error":"#N/A"}}]
["Сотрудник 12","2019-01-02",null,null,{"$f":"INDEX(Лист1!$C$2:$C$48,MATCH(A22&B22,Лист1!$A$2:$A$48&Лист1!$B$2:$B$48,))","v":{"$error":"#N/A"}}]
["Сотрудник 13","2019-01-04",null,null,{"$f":"INDEX(Лист1!$C$2:$C$48,MATCH(A23&B23,Лист1!$A$2:$A$48&Лист1!$B$2:$B$48,))","v":5}]
["Сотрудник 14","2019-01-02",null,null,{"$f":"INDEX(Лист1!$C$2:$C$48,MATCH(A24&B24,Лист1!$A$2:$A$48&Лист1!$B$2:$B$48,))","v":{"$error":"#N/A"}}]
["Сотрудник 15","2019-01-04",null,null,{"$f":"INDEX(Лист1!$C$2:$C$48,MATCH(A25&B25,Лист1!$A$2:$A$48&Лист1!$B$2:$B$48,))","v":5}]
["Сотрудник 16","2019-01-05",null,null,{"$f":"INDEX(Лист1!$C$2:$C$48,MATCH(A26&B26,Лист1!$A$2:$A$48&Лист1!$B$2:$B$48,))","v":{"$error":"#N/A"}}]
["Сотрудник 17","2019-01-06",null,null,{"$f":"INDEX(Лист1!$C$2:$C$48,MATCH(A27&B27,Лист1!$A$2:$A$48&Лист1!$B$2:$B$48,))","v":{"$error":"#N/A"}}]
["Сотрудник 18","2019-01-02",null,null,{"$f":"INDEX(Лист1!$C$2:$C$48,MATCH(A28&B28,Лист1!$A$2:$A$48&Лист1!$B$2:$B$48,))","v":{"$error":"#N/A"}}]
["Сотрудник 5","2019-01-01",null,null,{"$f":"INDEX(Лист1!$C$2:$C$48,MATCH(A29&B29,Лист1!$A$2:$A$48&Лист1!$B$2:$B$48,))","v":9}]
["Сотрудник 6","2019-01-02",null,null,{"$f":"INDEX(Лист1!$C$2:$C$48,MATCH(A30&B30,Лист1!$A$2:$A$48&Лист1!$B$2:$B$48,))","v":{"$error":"#N/A"}}]
["Сотрудник 3","2019-01-01",null,null,{"$f":"INDEX(Лист1!$C$2:$C$48,MATCH(A31&B31,Лист1!$A$2:$A$48&Лист1!$B$2:$B$48,))","v":3}]
["Сотрудник 25","2019-01-03",null,null,{"$f":"INDEX(Лист1!$C$2:$C$48,MATCH(A32&B32,Лист1!$A$2:$A$48&Лист1!$B$2:$B$48,))","v":6}]

{"sheet":"Лист3","index":2,"n_rows":0,"n_cols":0,"rows_kept":0,"cut":false,"hidden":false,"merged":[]}