{"text_format":"1","workbook":"xlsx","n_sheets":2,"sheets":["Sheet1","Sheet2"],"not_rendered":{"charts":0,"images":0,"macros":1,"external_links":0,"defined_names":1,"comments":0,"pivot_tables":0},"unopened":[],"bounds":{"document_bytes":16777216,"sheet_cells":100000,"rows_first":2000,"rows_last":500,"rows_between":2000,"halvings":0,"cell_chars":16384,"cell_head_chars":4096},"cells_cut":0,"cells_raw":0,"read":"whole","date_system":"1900"}

{"sheet":"Sheet1","index":0,"n_rows":1000,"n_cols":5,"rows_kept":1000,"cut":false,"hidden":false,"merged":[]}
["Имя","Фамилия","Организация","Номер карты","Время"]
[{"$f":"IF(D2=\"\",\"\",INDEX(Sheet2!A:A,MATCH(Sheet1!D2,Sheet2!D:D,0)))","v":"Иван"},{"$f":"IF(D2=\"\",\"\",INDEX(Sheet2!B:B,MATCH(Sheet1!D2,Sheet2!D:D,0)))","v":"Иванов"},{"$f":"IF(D2=\"\",\"\",INDEX(Sheet2!C:C,MATCH(Sheet1!D2,Sheet2!D:D,0)))","v":"ААА"},12345678,{"$f":"IF(D2=\"\",\"\",IF(E2=\"\",NOW(),E2))","v":43525.708820370368}]
[{"$f":"IF(D3=\"\",\"\",INDEX(Sheet2!A:A,MATCH(Sheet1!D3,Sheet2!D:D,0)))","v":"Василий "},{"$f":"IF(D3=\"\",\"\",INDEX(Sheet2!B:B,MATCH(Sheet1!D3,Sheet2!D:D,0)))","v":"Петров"},{"$f":"IF(D3=\"\",\"\",INDEX(Sheet2!C:C,MATCH(Sheet1!D3,Sheet2!D:D,0)))","v":"ООО"},12345679,43525.708828009258]
[{"$f":"IF(D4=\"\",\"\",INDEX(Sheet2!A:A,MATCH(Sheet1!D4,Sheet2!D:D,0)))","v":"Алексей"},{"$f":"IF(D4=\"\",\"\",INDEX(Sheet2!B:B,MATCH(Sheet1!D4,Sheet2!D:D,0)))","v":"Сидоров"},{"$f":"IF(D4=\"\",\"\",INDEX(Sheet2!C:C,MATCH(Sheet1!D4,Sheet2!D:D,0)))","v":"МММ"},12345689,43525.708832523145]
[{"$f":"IF(D5=\"\",\"\",INDEX(Sheet2!A:A,MATCH(Sheet1!D5,Sheet2!D:D,0)))","v":"Дмитрий"},{"$f":"IF(D5=\"\",\"\",INDEX(Sheet2!B:B,MATCH(Sheet1!D5,Sheet2!D:D,0)))","v":"Соколов "},{"$f":"IF(D5=\"\",\"\",INDEX(Sheet2!C:C,MATCH(Sheet1!D5,Sheet2!D:D,0)))","v":"ООО"},33333333,43525.719443865739]
[{"$f":"IF(D6=\"\",\"\",INDEX(Sheet2!A:A,MATCH(Sheet1!D6,Sheet2!D:D,0)))","v":"Василий "},{"$f":"IF(D6=\"\",\"\",INDEX(Sheet2!B:B,MATCH(Sheet1!D6,Sheet2!D:D,0)))","v":"Петров"},{"$f":"IF(D6=\"\",\"\",INDEX(Sheet2!C:C,MATCH(Sheet1!D6,Sheet2!D:D,0)))","v":"ООО"},12345679,43525.725083680554]
[{"$f":"IF(D7=\"\",\"\",INDEX(Sheet2!A:A,MATCH(Sheet1!D7,Sheet2!D:D,0)))","v":"Егор"},{"$f":"IF(D7=\"\",\"\",INDEX(Sheet2!B:B,MATCH(Sheet1!D7,Sheet2!D:D,0)))","v":"Михайлов "},{"$f":"IF(D7=\"\",\"\",INDEX(Sheet2!C:C,MATCH(Sheet1!D7,Sheet2!D:D,0)))","v":"ООО"},12234556,43525.733875578706]
[{"$f":"IF(D8=\"\",\"\",INDEX(Sheet2!A:A,MATCH(Sheet1!D8,Sheet2!D:D,0)))","v":"Матвей"},{"$f":"IF(D8=\"\",\"\",INDEX(Sheet2!B:B,MATCH(Sheet1!D8,Sheet2!D:D,0)))","v":"Волков "},{"$f":"IF(D8=\"\",\"\",INDEX(Sheet2!C:C,MATCH(Sheet1!D8,Sheet2!D:D,0)))","v":"МММ"},99999999,43525.733935763892]
[{"$f":"IF(D9=\"\",\"\",INDEX(Sheet2!A:A,MATCH(Sheet1!D9,Sheet2!D:D,0)))","v":"Денис"},{"$f":"IF(D9=\"\",\"\",INDEX(Sheet2!B:B,MATCH(Sheet1!D9,Sheet2!D:D,0)))","v":"Попов "},{"$f":"IF(D9=\"\",\"\",INDEX(Sheet2!C:C,MATCH(Sheet1!D9,Sheet2!D:D,0)))","v":"ААА"},22222222,43525.734313310182]
[{"$f":"IF(D10=\"\",\"\",INDEX(Sheet2!A:A,MATCH(Sheet1!D10,Sheet2!D:D,0)))","v":""},{"$f":"IF(D10=\"\",\"\",INDEX(Sheet2!B:B,MATCH(Sheet1!D10,Sheet2!D:D,0)))","v":""},{"$f":"IF(D10=\"\",\"\",INDEX(Sheet2!C:C,MATCH(Sheet1!D10,Sheet2!D:D,0)))","v":""},null,""]
[{"$f":"IF(D11=\"\",\"\",INDEX(Sheet2!A:A,MATCH(Sheet1!D11,Sheet2!D:D,0)))","v":""},{"$f":"IF(D11=\"\",\"\",INDEX(Sheet2!B:B,MATCH(Sheet1!D11,Sheet2!D:D,0)))","v":""},{"$f":"IF(D11=\"\",\"\",INDEX(Sheet2!C:C,MATCH(Sheet1!D11,Sheet2!D:D,0)))","v":""},null,""]
[{"$f":"IF(D12=\"\",\"\",INDEX(Sheet2!A:A,MATCH(Sheet1!D12,Sheet2!D:D,0)))","v":""},{"$f":"IF(D12=\"\",\"\",INDEX(Sheet2!B:B,MATCH(Sheet1!D12,Sheet2!D:D,0)))","v":""},{"$f":"IF(D12=\"\",\"\",INDEX(Sheet2!C:C,MATCH(Sheet1!D12,Sheet2!D:D,0)))","v":""},null,""]
[{"$f":"IF(D13=\"\",\"\",INDEX(Sheet2!A:A,MATCH(Sheet1!D13,Sheet2!D:D,0)))","v":""},{"$f":"IF(D13=\"\",\"\",INDEX(Sheet2!B:B,MATCH(Sheet1!D13,Sheet2!D:D,0)))","v":""},{"$f":"IF(D13=\"\",\"\",INDEX(Sheet2!C:C,MATCH(Sheet1!D13,Sheet2!D:D,0)))","v":""},null,""]
[{"$f":"IF(D14=\"\",\"\",INDEX(Sheet2!A:A,MATCH(Sheet1!D14,Sheet2!D:D,0)))","v":""},{"$f":"IF(D14=\"\",\"\",INDEX(Sheet2!B:B,MATCH(Sheet1!D14,Sheet2!D:D,0)))","v":""},{"$f":"IF(D14=\"\",\"\",INDEX(Sheet2!C:C,MATCH(Sheet1!D14,Sheet2!D:D,0)))","v":""},null,""]
[{"$f":"IF(D15=\"\",\"\",INDEX(Sheet2!A:A,MATCH(Sheet1!D15,Sheet2!D:D,0)))","v":""},{"$f":"IF(D15=\"\",\"\",INDEX(Sheet2!B:B,MATCH(Sheet1!D15,Sheet2!D:D,0)))","v":""},{"$f":"IF(D15=\"\",\"\",INDEX(Sheet2!C:C,MATCH(Sheet1!D15,Sheet2!D:D,0)))","v":""},null,""]
[{"$f":"IF(D16=\"\",\"\",INDEX(Sheet2!A:A,MATCH(Sheet1!D16,Sheet2!D:D,0)))","v":""},{"$f":"IF(D16=\"\",\"\",INDEX(Sheet2!B:B,MATCH(Sheet1!D16,Sheet2!D:D,0)))","v":""},{"$f":"IF(D16=\"\",\"\",INDEX(Sheet2!C:C,MATCH(Sheet1!D16,Sheet2!D:D,0)))","v":""},null,""]
[{"$f":"IF(D17=\"\",\"\",INDEX(Sheet2!A:A,MATCH(Sheet1!D17,Sheet2!D:D,0)))","v":""},{"$f":"IF(D17=\"\",\"\",INDEX(Sheet2!B:B,MATCH(Sheet1!D17,Sheet2!D:D,0)))","v":""},{"$f":"IF(D17=\"\",\"\",INDEX(Sheet2!C:C,MATCH(Sheet1!D17,Sheet2!D:D,0)))","v":""},null,""]
[{"$f":"IF(D18=\"\",\"\",INDEX(Sheet2!A:A,MATCH(Sheet1!D18,Sheet2!D:D,0)))","v":""},{"$f":"IF(D18=\"\",\"\",INDEX(Sheet2!B:B,MATCH(Sheet1!D18,Sheet2!D:D,0)))","v":""},{"$f":"IF(D18=\"\",\"\",INDEX(Sheet2!C:C,MATCH(Sheet1!D18,Sheet2!D:D,0)))","v":""},null,""]
[{"$f":"IF(D19=\"\",\"\",INDEX(Sheet2!A:A,MATCH(Sheet1!D19,Sheet2!D:D,0)))","v":""},{"$f":"IF(D19=\"\",\"\",INDEX(Sheet2!B:B,MATCH(Sheet1!D19,Sheet2!D:D,0)))","v":""},{"$f":"IF(D19=\"\",\"\",INDEX(Sheet2!C:C,MATCH(Sheet1!D19,Sheet2!D:D,0)))","v":""},null,""]
[{"$f":"IF(D20=\"\",\"\",INDEX(Sheet2!A:A,MATCH(Sheet1!D20,Sheet2!D:D,0)))","v":""},{"$f":"IF(D20=\"\",\"\",INDEX(Sheet2!B:B,MATCH(Sheet1!D20,Sheet2!D:D,0)))","v":""},{"$f":"IF(D20=\"\",\"\",INDEX(Sheet2!C:C,MATCH(Sheet1!D20,Sheet2!D:D,0)))","v":""},null,""]
[{"$f":"IF(D21=\"\",\"\",INDEX(Sheet2!A:A,MATCH(Sheet1!D21,Sheet2!D:D,0)))","v":""},{"$f":"IF(D21=\"\",\"\",INDEX(Sheet2!B:B,MATCH(Sheet1!D21,Sheet2!D:D,0)))","v":""},{"$f":"IF(D21=\"\",\"\",INDEX(Sheet2!C:C,MATCH(Sheet1!D21,Sheet2!D:D,0)))","v":""},null,""]
[{"$f":"IF(D22=\"\",\"\",INDEX(Sheet2!A:A,MATCH(Sheet1!D22,Sheet2!D:D,0)))","v":""},{"$f":"IF(D22=\"\",\"\",INDEX(Sheet2!B:B,MATCH(Sheet1!D22,Sheet2!D:D,0)))","v":""},{"$f":"IF(D22=\"\",\"\",INDEX(Sheet2!C:C,MATCH(Sheet1!D22,Sheet2!D:D,0)))","v":""},null,""]
[{"$f":"IF(D23=\"\",\"\",INDEX(Sheet2!A:A,MATCH(Sheet1!D23,Sheet2!D:D,0)))","v":""},{"$f":"IF(D23=\"\",\"\",INDEX(Sheet2!B:B,MATCH(Sheet1!D23,Sheet2!D:D,0)))","v":""},{"$f":"IF(D23=\"\",\"\",INDEX(Sheet2!C:C,MATCH(Sheet1!D23,Sheet2!D:D,0)))","v":""},null,""]
[{"$f":"IF(D24=\"\",\"\",INDEX(Sheet2!A:A,MATCH(Sheet1!D24,Sheet2!D:D,0)))","v":""},{"$f":"IF(D24=\"\",\"\",INDEX(Sheet2!B:B,MATCH(Sheet1!D24,Sheet2!D:D,0)))","v":""},{"$f":"IF(D24=\"\",\"\",INDEX(Sheet2!C:C,MATCH(Sheet1!D24,Sheet2!D:D,0)))","v":""},null,""]
[{"$f":"IF(D25=\"\",\"\",INDEX(Sheet2!A:A,MATCH(Sheet1!D25,Sheet2!D:D,0)))","v":""},{"$f":"IF(D25=\"\",\"\",INDEX(Sheet2!B:B,MATCH(Sheet1!D25,Sheet2!D:D,0)))","v":""},{"$f":"IF(D25=\"\",\"\",INDEX(Sheet2!C:C,MATCH(Sheet1!D25,Sheet2!D:D,0)))","v":""},null,""]
[{"$f":"IF(D26=\"\",\"\",INDEX(Sheet2!A:A,MATCH(Sheet1!D26,Sheet2!D:D,0)))","v":""},{"$f":"IF(D26=\"\",\"\",INDEX(Sheet2!B:B,MATCH(Sheet1!D26,Sheet2!D:D,0)))","v":""},{"$f":"IF(D26=\"\",\"\",INDEX(Sheet2!C:C,MATCH(Sheet1!D26,Sheet2!D:D,0)))","v":""}]
[{"$f":"IF(D27=\"\",\"\",INDEX(Sheet2!A:A,MATCH(Sheet1!D27,Sheet2!D:D,0)))","v":""},{"$f":"IF(D27=\"\",\"\",INDEX(Sheet2!B:B,MATCH(Sheet1!D27,Sheet2!D:D,0)))","v":""},{"$f":"IF(D27=\"\",\"\",INDEX(Sheet2!C:C,MATCH(Sheet1!D27,Sheet2!D:D,0)))","v":""}]
[{"$f":"IF(D28=\"\",\"\",INDEX(Sheet2!A:A,MATCH(Sheet1!D28,Sheet2!D:D,0)))","v":""},{"$f":"IF(D28=\"\",\"\",INDEX(Sheet2!B:B,MATCH(Sheet1!D28,Sheet2!D:D,0)))","v":""},{"$f":"IF(D28=\"\",\"\",INDEX(Sheet2!C:C,MATCH(Sheet1!D28,Sheet2!D:D,0)))","v":""}]
[{"$f":"IF(D29=\"\",\"\",INDEX(Sheet2!A:A,MATCH(Sheet1!D29,Sheet2!D:D,0)))","v":""},{"$f":"IF(D29=\"\",\"\",INDEX(Sheet2!B:B,MATCH(Sheet1!D29,Sheet2!D:D,0)))","v":""},{"$f":"IF(D29=\"\",\"\",INDEX(Sheet2!C:C,MATCH(Sheet1!D29,Sheet2!D:D,0)))","v":""}]
[{"$f":"IF(D30=\"\",\"\",INDEX(Sheet2!A:A,MATCH(Sheet1!D30,Sheet2!D:D,0)))","v":""},{"$f":"IF(D30=\"\",\"\",INDEX(Sheet2!B:B,MATCH(Sheet1!D30,Sheet2!D:D,0)))","v":""},{"$f":"IF(D30=\"\",\"\",INDEX(Sheet2!C:C,MATCH(Sheet1!D30,Sheet2!D:D,0)))","v":""}]
[{"$f":"IF(D31=\"\",\"\",INDEX(Sheet2!A:A,MATCH(Sheet1!D31,Sheet2!D:D,0)))","v":""},{"$f":"IF(D31=\"\",\"\",INDEX(Sheet2!B:B,MATCH(Sheet1!D31,Sheet2!D:D,0)))","v":""},{"$f":"IF(D31=\"\",\"\",INDEX(Sheet2!C:C,MATCH(Sheet1!D31,Sheet2!D:D,0)))","v":""}]
[{"$f":"IF(D32=\"\",\"\",INDEX(Sheet2!A:A,MATCH(Sheet1!D32,Sheet2!D:D,0)))","v":""},{"$f":"IF(D32=\"\",\"\",INDEX(Sheet2!B:B,MATCH(Sheet1!D32,Sheet2!D:D,0)))","v":""},{"$f":"IF(D32=\"\",\"\",INDEX(Sheet2!C:C,MATCH(Sheet1!D32,Sheet2!D:D,0)))","v":""}]
[{"$f":"IF(D33=\"\",\"\",INDEX(Sheet2!A:A,MATCH(Sheet1!D33,Sheet2!D:D,0)))","v":""},{"$f":"IF(D33=\"\",\"\",INDEX(Sheet2!B:B,MATCH(Sheet1!D33,Sheet2!D:D,0)))","v":""},{"$f":"IF(D33=\"\",\"\",INDEX(Sheet2!C:C,MATCH(Sheet1!D33,Sheet2!D:D,0)))","v":""}]
[{"$f":"IF(D34=\"\",\"\",INDEX(Sheet2!A:A,MATCH(Sheet1!D34,Sheet2!D:D,0)))","v":""},{"$f":"IF(D34=\"\",\"\",INDEX(Sheet2!B:B,MATCH(Sheet1!D34,Sheet2!D:D,0)))","v":""},{"$f":"IF(D34=\"\",\"\",INDEX(Sheet2!C:C,MATCH(Sheet1!D34,Sheet2!D:D,0)))","v":""}]
[{"$f":"IF(D35=\"\",\"\",INDEX(Sheet2!A:A,MATCH(Sheet1!D35,Sheet2!D:D,0)))","v":""},{"$f":"IF(D35=\"\",\"\",INDEX(Sheet2!B:B,MATCH(Sheet1!D35,Sheet2!D:D,0)))","v":""},{"$f":"IF(D35=\"\",\"\",INDEX(Sheet2!C:C,MATCH(Sheet1!D35,Sheet2!D:D,0)))","v":""}]
[{"$f":"IF(D36=\"\",\"\",INDEX(Sheet2!A:A,MATCH(Sheet1!D36,Sheet2!D:D,0)))","v":""},{"$f":"IF(D36=\"\",\"\",INDEX(Sheet2!B:B,MATCH(Sheet1!D36,Sheet2!D:D,0)))","v":""},{"$f":"IF(D36=\"\",\"\",INDEX(Sheet2!C:C,MATCH(Sheet1!D36,Sheet2!D:D,0)))","v":""}]
[{"$f":"IF(D37=\"\",\"\",INDEX(Sheet2!A:A,MATCH(Sheet1!D37,Sheet2!D:D,0)))","v":""},{"$f":"IF(D37=\"\",\"\",INDEX(Sheet2!B:B,MATCH(Sheet1!D37,Sheet2!D:D,0)))","v":""},{"$f":"IF(D37=\"\",\"\",INDEX(Sheet2!C:C,MATCH(Sheet1!D37,Sheet2!D:D,0)))","v":""}]
[{"$f":"IF(D38=\"\",\"\",INDEX(Sheet2!A:A,MATCH(Sheet1!D38,Sheet2!D:D,0)))","v":""},{"$f":"IF(D38=\"\",\"\",INDEX(Sheet2!B:B,MATCH(Sheet1!D38,Sheet2!D:D,0)))","v":""},{"$f":"IF(D38=\"\",\"\",INDEX(Sheet2!C:C,MATCH(Sheet1!D38,Sheet2!D:D,0)))","v":""}]
[{"$f":"IF(D39=\"\",\"\",INDEX(Sheet2!A:A,MATCH(Sheet1!D39,Sheet2!D:D,0)))","v":""},{"$f":"IF(D39=\"\",\"\",INDEX(Sheet2!B:B,MATCH(Sheet1!D39,Sheet2!D:D,0)))","v":""},{"$f":"IF(D39=\"\",\"\",INDEX(Sheet2!C:C,MATCH(Sheet1!D39,Sheet2!D:D,0)))","v":""}]
[{"$f":"IF(D40=\"\",\"\",INDEX(Sheet2!A:A,MATCH(Sheet1!D40,Sheet2!D:D,0)))","v":""},{"$f":"IF(D40=\"\",\"\",INDEX(Sheet2!B:B,MATCH(Sheet1!D40,Sheet2!D:D,0)))","v":""},{"$f":"IF(D40=\"\",\"\",INDEX(Sheet2!C:C,MATCH(Sheet1!D40,Sheet2!D:D,0)))","v":""}]
[{"$f":"IF(D41=\"\",\"\",INDEX(Sheet2!A:A,MATCH(Sheet1!D41,Sheet2!D:D,0)))","v":""},{"$f":"IF(D41=\"\",\"\",INDEX(Sheet2!B:B,MATCH(Sheet1!D41,Sheet2!D:D,0)))","v":""},{"$f":"IF(D41=\"\",\"\",INDEX(Sheet2!C:C,MATCH(Sheet1!D41,Sheet2!D:D,0)))","v":""}]
[{"$f":"IF(D42=\"\",\"\",INDEX(Sheet2!A:A,MATCH(Sheet1!D42,Sheet2!D:D,0)))","v":""},{"$f":"IF(D42=\"\",\"\",INDEX(Sheet2!B:B,MATCH(Sheet1!D42,Sheet2!D:D,0)))","v":""},{"$f":"IF(D42=\"\",\"\",INDEX(Sheet2!C:C,MATCH(Sheet1!D42,Sheet2!D:D,0)))","v":""}]
[{"$f":"IF(D43=\"\",\"\",INDEX(Sheet2!A:A,MATCH(Sheet1!D43,Sheet2!D:D,0)))","v":""},{"$f":"IF(D43=\"\",\"\",INDEX(Sheet2!B:B,MATCH(Sheet1!D43,Sheet2!D:D,0)))","v":""},{"$f":"IF(D43=\"\",\"\",INDEX(Sheet2!C:C,MATCH(Sheet1!D43,Sheet2!D:D,0)))","v":""}]
[{"$f":"IF(D44=\"\",\"\",INDEX(Sheet2!A:A,MATCH(Sheet1!D44,Sheet2!D:D,0)))","v":""},{"$f":"IF(D44=\"\",\"\",INDEX(Sheet2!B:B,MATCH(Sheet1!D44,Sheet2!D:D,0)))","v":""},{"$f":"IF(D44=\"\",\"\",INDEX(Sheet2!C:C,MATCH(Sheet1!D44,Sheet2!D:D,0)))","v":""}]
[{"$f":"IF(D45=\"\",\"\",INDEX(Sheet2!A:A,MATCH(Sheet1!D45,Sheet2!D:D,0)))","v":""},{"$f":"IF(D45=\"\",\"\",INDEX(Sheet2!B:B,MATCH(Sheet1!D45,Sheet2!D:D,0)))","v":""},{"$f":"IF(D45=\"\",\"\",INDEX(Sheet2!C:C,MATCH(Sheet1!D45,Sheet2!D:D,0)))","v":""}]
[{"$f":"IF(D46=\"\",\"\",INDEX(Sheet2!A:A,MATCH(Sheet1!D46,Sheet2!D:D,0)))","v":""},{"$f":"IF(D46=\"\",\"\",INDEX(Sheet2!B:B,MATCH(Sheet1!D46,Sheet2!D:D,0)))","v":""},{"$f":"IF(D46=\"\",\"\",INDEX(Sheet2!C:C,MATCH(Sheet1!D46,Sheet2!D:D,0)))","v":""}]
[{"$f":"IF(D47=\"\",\"\",INDEX(Sheet2!A:A,MATCH(Sheet1!D47,Sheet2!D:D,0)))","v":""},{"$f":"IF(D47=\"\",\"\",INDEX(Sheet2!B:B,MATCH(Sheet1!D47,Sheet2!D:D,0)))","v":""},{"$f":"IF(D47=\"\",\"\",INDEX(Sheet2!C:C,MATCH(Sheet1!D47,Sheet2!D:D,0)))","v":""}]
[{"$f":"IF(D48=\"\",\"\",INDEX(Sheet2!A:A,MATCH(Sheet1!D48,Sheet2!D:D,0)))","v":""},{"$f":"IF(D48=\"\",\"\",INDEX(Sheet2!B:B,MATCH(Sheet1!D48,Sheet2!D:D,0)))","v":""},{"$f":"IF(D48=\"\",\"\",INDEX(Sheet2!C:C,MATCH(Sheet1!D48,Sheet2!D:D,0)))","v":""}]
[{"$f":"IF(D49=\"\",\"\",INDEX(Sheet2!A:A,MATCH(Sheet1!D49,Sheet2!D:D,0)))","v":""},{"$f":"IF(D49=\"\",\"\",INDEX(Sheet2!B:B,MATCH(Sheet1!D49,Sheet2!D:D,0)))","v":""},{"$f":"IF(D49=\"\",\"\",INDEX(Sheet2!C:C,MATCH(Sheet1!D49,Sheet2!D:D,0)))","v":""}]
[{"$f":"IF(D50=\"\",\"\",INDEX(Sheet2!A:A,MATCH(Sheet1!D50,Sheet2!D:D,0)))","v":""},{"$f":"IF(D50=\"\",\"\",INDEX(Sheet2!B:B,MATCH(Sheet1!D50,Sheet2!D:D,0)))","v":""},{"$f":"IF(D50=\"\",\"\",INDEX(Sheet2!C:C,MATCH(Sheet1!D50,Sheet2!D:D,0)))","v":""}]
[{"$f":"IF(D51=\"\",\"\",INDEX(Sheet2!A:A,MATCH(Sheet1!D51,Sheet2!D:D,0)))","v":""},{"$f":"IF(D51=\"\",\"\",INDEX(Sheet2!B:B,MATCH(Sheet1!D51,Sheet2!D:D,0)))","v":""},{"$f":"IF(D51=\"\",\"\",INDEX(Sheet2!C:C,MATCH(Sheet1!D51,Sheet2!D:D,0)))","v":""}]
[{"$f":"IF(D52=\"\",\"\",INDEX(Sheet2!A:A,MATCH(Sheet1!D52,Sheet2!D:D,0)))","v":""},{"$f":"IF(D52=\"\",\"\",INDEX(Sheet2!B:B,MATCH(Sheet1!D52,Sheet2!D:D,0)))","v":""},{"$f":"IF(D52=\"\",\"\",INDEX(Sheet2!C:C,MATCH(Sheet1!D52,Sheet2!D:D,0)))","v":""}]
[{"$f":"IF(D53=\"\",\"\",INDEX(Sheet2!A:A,MATCH(Sheet1!D53,Sheet2!D:D,0)))","v":""},{"$f":"IF(D53=\"\",\"\",INDEX(Sheet2!B:B,MATCH(Sheet1!D53,Sheet2!D:D,0)))","v":""},{"$f":"IF(D53=\"\",\"\",INDEX(Sheet2!C:C,MATCH(Sheet1!D53,Sheet2!D:D,0)))","v":""}]
[{"$f":"IF(D54=\"\",\"\",INDEX(Sheet2!A:A,MATCH(Sheet1!D54,Sheet2!D:D,0)))","v":""},{"$f":"IF(D54=\"\",\"\",INDEX(Sheet2!B:B,MATCH(Sheet1!D54,Sheet2!D:D,0)))","v":""},{"$f":"IF(D54=\"\",\"\",INDEX(Sheet2!C:C,MATCH(Sheet1!D54,Sheet2!D:D,0)))","v":""}]
[{"$f":"IF(D55=\"\",\"\",INDEX(Sheet2!A:A,MATCH(Sheet1!D55,Sheet2!D:D,0)))","v":""},{"$f":"IF(D55=\"\",\"\",INDEX(Sheet2!B:B,MATCH(Sheet1!D55,Sheet2!D:D,0)))","v":""},{"$f":"IF(D55=\"\",\"\",INDEX(Sheet2!C:C,MATCH(Sheet1!D55,Sheet2!D:D,0)))","v":""}]
[{"$f":"IF(D56=\"\",\"\",INDEX(Sheet2!A:A,MATCH(Sheet1!D56,Sheet2!D:D,0)))","v":""},{"$f":"IF(D56=\"\",\"\",INDEX(Sheet2!B:B,MATCH(Sheet1!D56,Sheet2!D:D,0)))","v":""},{"$f":"IF(D56=\"\",\"\",INDEX(Sheet2!C:C,MATCH(Sheet1!D56,Sheet2!D:D,0)))","v":""}]
[{"$f":"IF(D57=\"\",\"\",INDEX(Sheet2!A:A,MATCH(Sheet1!D57,Sheet2!D:D,0)))","v":""},{"$f":"IF(D57=\"\",\"\",INDEX(Sheet2!B:B,MATCH(Sheet1!D57,Sheet2!D:D,0)))","v":""},{"$f":"IF(D57=\"\",\"\",INDEX(Sheet2!C:C,MATCH(Sheet1!D57,Sheet2!D:D,0)))","v":""}]
[{"$f":"IF(D58=\"\",\"\",INDEX(Sheet2!A:A,MATCH(Sheet1!D58,Sheet2!D:D,0)))","v":""},{"$f":"IF(D58=\"\",\"\",INDEX(Sheet2!B:B,MATCH(Sheet1!D58,Sheet2!D:D,0)))","v":""},{"$f":"IF(D58=\"\",\"\",INDEX(Sheet2!C:C,MATCH(Sheet1!D58,Sheet2!D:D,0)))","v":""}]
[{"$f":"IF(D59=\"\",\"\",INDEX(Sheet2!A:A,MATCH(Sheet1!D59,Sheet2!D:D,0)))","v":""},{"$f":"IF(D59=\"\",\"\",INDEX(Sheet2!B:B,MATCH(Sheet1!D59,Sheet2!D:D,0)))","v":""},{"$f":"IF(D59=\"\",\"\",INDEX(Sheet2!C:C,MATCH(Sheet1!D59,Sheet2!D:D,0)))","v":""}]
[{"$f":"IF(D60=\"\",\"\",INDEX(Sheet2!A:A,MATCH(Sheet1!D60,Sheet2!D:D,0)))","v":""},{"$f":"IF(D60=\"\",\"\",INDEX(Sheet2!B:B,MATCH(Sheet1!D60,Sheet2!D:D,0)))","v":""},{"$f":"IF(D60=\"\",\"\",INDEX(Sheet2!C:C,MATCH(Sheet1!D60,Sheet2!D:D,0)))","v":""}]
[{"$f":"IF(D61=\"\",\"\",INDEX(Sheet2!A:A,MATCH(Sheet1!D61,Sheet2!D:D,0)))","v":""},{"$f":"IF(D61=\"\",\"\",INDEX(Sheet2!B:B,MATCH(Sheet1!D61,Sheet2!D:D,0)))","v":""},{"$f":"IF(D61=\"\",\"\",INDEX(Sheet2!C:C,MATCH(Sheet1!D61,Sheet2!D:D,0)))","v":""}]
[{"$f":"IF(D62=\"\",\"\",INDEX(Sheet2!A:A,MATCH(Sheet1!D62,Sheet2!D:D,0)))","v":""},{"$f":"IF(D62=\"\",\"\",INDEX(Sheet2!B:B,MATCH(Sheet1!D62,Sheet2!D:D,0)))","v":""},{"$f":"IF(D62=\"\",\"\",INDEX(Sheet2!C:C,MATCH(Sheet1!D62,Sheet2!D:D,0)))","v":""}]
[{"$f":"IF(D63=\"\",\"\",INDEX(Sheet2!A:A,MATCH(Sheet1!D63,Sheet2!D:D,0)))","v":""},{"$f":"IF(D63=\"\",\"\",INDEX(Sheet2!B:B,MATCH(Sheet1!D63,Sheet2!D:D,0)))","v":""},{"$f":"IF(D63=\"\",\"\",INDEX(Sheet2!C:C,MATCH(Sheet1!D63,Sheet2!D:D,0)))","v":""}]
[{"$f":"IF(D64=\"\",\"\",INDEX(Sheet2!A:A,MATCH(Sheet1!D64,Sheet2!D:D,0)))","v":""},{"$f":"IF(D64=\"\",\"\",INDEX(Sheet2!B:B,MATCH(Sheet1!D64,Sheet2!D:D,0)))","v":""},{"$f":"IF(D64=\"\",\"\",INDEX(Sheet2!C:C,MATCH(Sheet1!D64,Sheet2!D:D,0)))","v":""}]
[{"$f":"IF(D65=\"\",\"\",INDEX(Sheet2!A:A,MATCH(Sheet1!D65,Sheet2!D:D,0)))","v":""},{"$f":"IF(D65=\"\",\"\",INDEX(Sheet2!B:B,MATCH(Sheet1!D65,Sheet2!D:D,0)))","v":""},{"$f":"IF(D65=\"\",\"\",INDEX(Sheet2!C:C,MATCH(Sheet1!D65,Sheet2!D:D,0)))","v":""}]
[{"$f":"IF(D66=\"\",\"\",INDEX(Sheet2!A:A,MATCH(Sheet1!D66,Sheet2!D:D,0)))","v":""},{"$f":"IF(D66=\"\",\"\",INDEX(Sheet2!B:B,MATCH(Sheet1!D66,Sheet2!D:D,0)))","v":""},{"$f":"IF(D66=\"\",\"\",INDEX(Sheet2!C:C,MATCH(Sheet1!D66,Sheet2!D:D,0)))","v":""}]
[{"$f":"IF(D67=\"\",\"\",INDEX(Sheet2!A:A,MATCH(Sheet1!D67,Sheet2!D:D,0)))","v":""},{"$f":"IF(D67=\"\",\"\",INDEX(Sheet2!B:B,MATCH(Sheet1!D67,Sheet2!D:D,0)))","v":""},{"$f":"IF(D67=\"\",\"\",INDEX(Sheet2!C:C,MATCH(Sheet1!D67,Sheet2!D:D,0)))","v":""}]
[{"$f":"IF(D68=\"\",\"\",INDEX(Sheet2!A:A,MATCH(Sheet1!D68,Sheet2!D:D,0)))","v":""},{"$f":"IF(D68=\"\",\"\",INDEX(Sheet2!B:B,MATCH(Sheet1!D68,Sheet2!D:D,0)))","v":""},{"$f":"IF(D68=\"\",\"\",INDEX(Sheet2!C:C,MATCH(Sheet1!D68,Sheet2!D:D,0)))","v":""}]
[{"$f":"IF(D69=\"\",\"\",INDEX(Sheet2!A:A,MATCH(Sheet1!D69,Sheet2!D:D,0)))","v":""},{"$f":"IF(D69=\"\",\"\",INDEX(Sheet2!B:B,MATCH(Sheet1!D69,Sheet2!D:D,0)))","v":""},{"$f":"IF(D69=\"\",\"\",INDEX(Sheet2!C:C,MATCH(Sheet1!D69,Sheet2!D:D,0)))","v":""}]
[{"$f":"IF(D70=\"\",\"\",INDEX(Sheet2!A:A,MATCH(Sheet1!D70,Sheet2!D:D,0)))","v":""},{"$f":"IF(D70=\"\",\"\",INDEX(Sheet2!B:B,MATCH(Sheet1!D70,Sheet2!D:D,0)))","v":""},{"$f":"IF(D70=\"\",\"\",INDEX(Sheet2!C:C,MATCH(Sheet1!D70,Sheet2!D:D,0)))","v":""}]
[{"$f":"IF(D71=\"\",\"\",INDEX(Sheet2!A:A,MATCH(Sheet1!D71,Sheet2!D:D,0)))","v":""},{"$f":"IF(D71=\"\",\"\",INDEX(Sheet2!B:B,MATCH(Sheet1!D71,Sheet2!D:D,0)))","v":""},{"$f":"IF(D71=\"\",\"\",INDEX(Sheet2!C:C,MATCH(Sheet1!D71,Sheet2!D:D,0)))","v":""}]
[{"$f":"IF(D72=\"\",\"\",INDEX(Sheet2!A:A,MATCH(Sheet1!D72,Sheet2!D:D,0)))","v":""},{"$f":"IF(D72=\"\",\"\",INDEX(Sheet2!B:B,MATCH(Sheet1!D72,Sheet2!D:D,0)))","v":""},{"$f":"IF(D72=\"\",\"\",INDEX(Sheet2!C:C,MATCH(Sheet1!D72,Sheet2!D:D,0)))","v":""}]
[{"$f":"IF(D73=\"\",\"\",INDEX(Sheet2!A:A,MATCH(Sheet1!D73,Sheet2!D:D,0)))","v":""},{"$f":"IF(D73=\"\",\"\",INDEX(Sheet2!B:B,MATCH(Sheet1!D73,Sheet2!D:D,0)))","v":""},{"$f":"IF(D73=\"\",\"\",INDEX(Sheet2!C:C,MATCH(Sheet1!D73,Sheet2!D:D,0)))","v":""}]
[{"$f":"IF(D74=\"\",\"\",INDEX(Sheet2!A:A,MATCH(Sheet1!D74,Sheet2!D:D,0)))","v":""},{"$f":"IF(D74=\"\",\"\",INDEX(Sheet2!B:B,MATCH(Sheet1!D74,Sheet2!D:D,0)))","v":""},{"$f":"IF(D74=\"\",\"\",INDEX(Sheet2!C:C,MATCH(Sheet1!D74,Sheet2!D:D,0)))","v":""}]
[{"$f":"IF(D75=\"\",\"\",INDEX(Sheet2!A:A,MATCH(Sheet1!D75,Sheet2!D:D,0)))","v":""},{"$f":"IF(D75=\"\",\"\",INDEX(Sheet2!B:B,MATCH(Sheet1!D75,Sheet2!D:D,0)))","v":""},{"$f":"IF(D75=\"\",\"\",INDEX(Sheet2!C:C,MATCH(Sheet1!D75,Sheet2!D:D,0)))","v":""}]
[{"$f":"IF(D76=\"\",\"\",INDEX(Sheet2!A:A,MATCH(Sheet1!D76,Sheet2!D:D,0)))","v":""},{"$f":"IF(D76=\"\",\"\",INDEX(Sheet2!B:B,MATCH(Sheet1!D76,Sheet2!D:D,0)))","v":""},{"$f":"IF(D76=\"\",\"\",INDEX(Sheet2!C:C,MATCH(Sheet1!D76,Sheet2!D:D,0)))","v":""}]
[{"$f":"IF(D77=\"\",\"\",INDEX(Sheet2!A:A,MATCH(Sheet1!D77,Sheet2!D:D,0)))","v":""},{"$f":"IF(D77=\"\",\"\",INDEX(Sheet2!B:B,MATCH(Sheet1!D77,Sheet2!D:D,0)))","v":""},{"$f":"IF(D77=\"\",\"\",INDEX(Sheet2!C:C,MATCH(Sheet1!D77,Sheet2!D:D,0)))","v":""}]
[{"$f":"IF(D78=\"\",\"\",INDEX(Sheet2!A:A,MATCH(Sheet1!D78,Sheet2!D:D,0)))","v":""},{"$f":"IF(D78=\"\",\"\",INDEX(Sheet2!B:B,MATCH(Sheet1!D78,Sheet2!D:D,0)))","v":""},{"$f":"IF(D78=\"\",\"\",INDEX(Sheet2!C:C,MATCH(Sheet1!D78,Sheet2!D:D,0)))","v":""}]
[{"$f":"IF(D79=\"\",\"\",INDEX(Sheet2!A:A,MATCH(Sheet1!D79,Sheet2!D:D,0)))","v":""},{"$f":"IF(D79=\"\",\"\",INDEX(Sheet2!B:B,MATCH(Sheet1!D79,Sheet2!D:D,0)))","v":""},{"$f":"IF(D79=\"\",\"\",INDEX(Sheet2!C:C,MATCH(Sheet1!D79,Sheet2!D:D,0)))","v":""}]
[{"$f":"IF(D80=\"\",\"\",INDEX(Sheet2!A:A,MATCH(Sheet1!D80,Sheet2!D:D,0)))","v":""},{"$f":"IF(D80=\"\",\"\",INDEX(Sheet2!B:B,MATCH(Sheet1!D80,Sheet2!D:D,0)))","v":""},{"$f":"IF(D80=\"\",\"\",INDEX(Sheet2!C:C,MATCH(Sheet1!D80,Sheet2!D:D,0)))","v":""}]
{"$rows_left_out":921}
{"sheet":"Sheet2","index":1,"n_rows":13,"n_cols":4,"rows_kept":13,"cut":false,"hidden":false,"merged":[]}
["Имя","Фамилия","Организация","Номер карты"]
["Иван","Иванов","ААА",12345678]
["Василий ","Петров","ООО",12345679]
["Алексей","Сидоров","МММ",12345689]
["Алексей","Кузнецов","ААА",11111111]
["Денис","Попов ","ААА",22222222]
["Дмитрий","Соколов ","ООО",33333333]
["Егор","Михайлов ","ООО",12234556]
["Кирилл","Новиков ","ООО",78894556]
["Леонид","Фёдоров ","ООО",32165487]
["Максим","Морозов ","МММ",88888888]
["Матвей","Волков ","МММ",99999999]
["Никита","Алексеев ","МММ",13467985]