{"text_format":"1","workbook":"xlsx","n_sheets":4,"sheets":["лицевая ПРЭМ","Лист2","Лист1","БД"],"not_rendered":{"charts":0,"images":0,"macros":1,"external_links":0,"defined_names":6,"comments":0,"pivot_tables":0},"unopened":[],"bounds":{"document_bytes":16777216,"sheet_cells":100000,"rows_first":2000,"rows_last":500,"rows_between":2000,"halvings":0,"cell_chars":16384,"cell_head_chars":4096},"cells_cut":0,"cells_raw":0,"read":"whole","date_system":"1900"}

{"sheet":"лицевая ПРЭМ","index":0,"n_rows":50,"n_cols":14,"rows_kept":50,"cut":false,"hidden":false,"merged":[[12,0,12,9],[49,4,49,7],[26,0,26,8],[26,9,26,13],[41,0,41,4],[45,0,45,2],[27,9,27,13],[29,0,29,13],[42,0,42,4],[43,0,43,4],[5,1,6,9],[5,10,6,13],[8,9,8,13],[8,6,8,8],[11,5,11,13],[10,0,10,3],[10,4,10,12],[30,0,30,3],[28,0,28,5],[28,8,28,11],[25,0,25,13],[22,0,22,4],[22,5,22,13],[23,5,23,13],[39,0,39,4],[39,8,39,12],[32,0,32,13],[33,0,33,13],[37,0,38,2],[41,5,41,6],[41,15,41,18],[42,15,42,18],[42,9,42,13],[42,5,42,8],[41,9,41,12],[45,15,45,18],[46,15,46,18],[46,9,46,13],[46,5,46,8],[45,9,45,12],[24,0,24,13],[21,0,21,13],[13,0,13,13],[12,10,12,12],[14,0,14,5],[15,0,15,2],[14,6,14,13],[15,3,15,13],[17,0,17,2],[18,3,18,13],[19,0,19,3],[20,4,20,13],[17,3,17,13],[19,4,19,13],[16,0,16,6],[16,7,16,13]]}
[]
[]
[]
[]
[]
[null,"СВИДЕТЕЛЬСТВО  О ПОВЕРКЕ №"]
[]
[]
[null,null,null,null,null,null,"Действительно до",null,null,"2019-03-12"]
[]
["Средство измерений",null,null,null,"Преобразователь расхода электромагнитный ПРЭМ"]
[null,null,null,null,null,"наименование, тип, модификация средства измерений, регистрационный номер в"]
[null,null,null,null,null,null,null,null,null,null,"17858-02"]
["Федеральном информационном фонде по обеспечению единства измерений,  присвоенный при утверждении типа"]
["заводской (серийный) номер\n"]
["в составе",null,null,"                              "]
["номер знака предыдущей поверки",null,null,null,null,null,null,"                              "]
["поверено",null,null,"в полном объеме"]
[null,null,null,"наименование едениц величин, диапазонов измерений, на которых поверено средство измерений"]
["в соответствии с",null,null,null,{"$f":"INDEX(БД!C2:C35,БД!E1,0)","v":"РБЯК.407111.014 Д5 \"Преобразователи расхода электромагнитные ПРЭМ. Методика поверки.\""}]
[null,null,null,null,"наименование или обозначение документа, на основании которого выполнена поверка"]
[]
["с применением эталонов:",null,null,null,null,{"$f":"INDEX(БД!D2:D36,БД!E1,0)","v":"3.2.АОЖ.0045.2018 УПРС 70/1 №055, 2-го разряда"}]
[null,null,null,null,null,"регистрационный номер и (или) наименование, тип,"]
[]
["заводской номер, разряд, клас или погрешность зталонов, применяемых при поверке"]
["при следующих значениях влияющих факторов:   "]
[null,null,null,null,null,null,null,null,null,"перечень влияющих факторов"]
["Температураокружающего воздуха:",null,null,null,null,null,99.9,"оС","относительная влажность:",null,null,null,21.3,"%"]
["нормированных в документе на методику поверки, с указанием их значений"]
["атмосферное давление:",null,null,null,102.2,"кПа"]
[]
["и на основании результатов первичной (периодической) поверки признано"]
["ненужное зачеркнуть"]
["пригодным к применению."]
[]
[]
["Знак поверки"]
[]
["Главный метролог",null,null,null,null,null,null,null,"И.Я. Ефремова"]
[]
["И.о. главного метролога"]
["Должность руководителя подразделения",null,null,null,null,"подпись",null,null,null,"фамилия, имя отчество (при наличии)"]
["или другого уполномоченого лица"]
[]
["Поверитель"]
[null,null,null,null,null,"подпись",null,null,null,"фамилия, имя отчество (при наличии)"]
[]
[]
["Дата поверки",null,null,null,"2019-03-18"]

{"sheet":"Лист2","index":1,"n_rows":10,"n_cols":1,"rows_kept":10,"cut":false,"hidden":true,"merged":[[9,0,11,4],[1,0,2,4],[3,0,4,4],[5,0,6,4],[7,0,8,4]]}
[]
[{"$error":"#NAME?"}]
[]
[{"$f":"IF(A2<0.2,1.423*A2,1.183*A2)","v":{"$error":"#NAME?"}}]
[]
[{"$f":"IF(A2<0.25,4.847*A2,2.692*A2)","v":{"$error":"#NAME?"}}]
[]
[{"$f":"IF(A6=\" \",\" \",A6*1.1)","v":{"$error":"#NAME?"}}]
[]
[{"$f":"SQRT(A8*A8+A4*A4+A2*A2)","v":{"$error":"#NAME?"}}]

{"sheet":"Лист1","index":2,"n_rows":0,"n_cols":0,"rows_kept":0,"cut":false,"hidden":true,"merged":[]}

{"sheet":"БД","index":3,"n_rows":11,"n_cols":6,"rows_kept":11,"cut":false,"hidden":false,"merged":[]}
["Наименование","Госреестр","Методика","Эталоны",{"$f":"MATCH('лицевая ПРЭМ'!K13,Реестр1,0)","v":3},"Преобразователь расхода электромагнитный ПРЭМ"]
["Преобразователь расхода электромагнитный ПРЭМ","17858-98","РБЯК.407111.014 Д5 \"Преобразователи расхода электромагнитные ПРЭМ. Методика поверки.\" ","3.2.АОЖ.0045.2018 УПРС 70/1 №055, 2-го разряда",null,"Вычислитель количества теплоты ВКТ 7"]
["Преобразователь расхода электромагнитный ПРЭМ","21692-01","РБЯК.407111.034 Д5 \"Преобразователи расхода электромагнитные ПРЭМ. Методика поверки.\"","3.2.АОЖ.0045.2018 УПРС 70/1 №055, 2-го разряда",null,"Тепловычислитель Multical 66E мод. 66Е00В0158"]
["Преобразователь расхода электромагнитный ПРЭМ","17858-02","РБЯК.407111.014 Д5 \"Преобразователи расхода электромагнитные ПРЭМ. Методика поверки.\"","3.2.АОЖ.0045.2018 УПРС 70/1 №055, 2-го разряда",null,"Тепловычислитель ВЗЛЕТ ТСРВ-026м"]
["Преобразователь расхода электромагнитный ПРЭМ","17858-06","РБЯК.407111.039 МП \"Преобразователи расхода электромагнитные ПРЭМ. Методика поверки.\"","3.2.АОЖ.0045.2018 УПРС 70/1 №055, 2-го разряда"]
["Преобразователь расхода электромагнитный ПРЭМ","17858-11","РБЯК.407111.039 МП \"Преобразователи расхода электромагнитные ПРЭМ. Методика поверки.\"","3.2.АОЖ.0045.2018 УПРС 70/1 №055, 2-го разряда"]
["Вычислитель количества теплоты ВКТ 7","23195-11","РБЯК.400880.036 РЭ раздел 8 \"Методика поверки\" руководства по эксплуатации \"Вычислители количества теплоты ВКТ-7\"","3.2.АОЖ.0046.2018 СКС-6 №1037"]
["Вычислитель количества теплоты ВКТ 7","23195-02","РБЯК.400880.036 РЭ раздел 8 \"Методика поверки\" руководства по эксплуатации \"Вычислители количества теплоты ВКТ-7\"","3.2.АОЖ.0046.2018 СКС-6 №1037"]
["Вычислитель количества теплоты ВКТ 7","23195-06","РБЯК.400880.036 РЭ раздел 8 \"Методика поверки\" руководства по эксплуатации \"Вычислители количества теплоты ВКТ-7\"","3.2.АОЖ.0046.2018 СКС-6 №1037"]
["Тепловычислитель Multical 66E мод. 66Е00В0158","15468-00","МП РТ-324-96","3.2.АОЖ.0046.2018 СКС-6 №1037"]
["Тепловычислитель ВЗЛЕТ ТСРВ-026м","27010-09","В84.00-00.00 РЭ с разделом \"Методика поверки\" руководства по эксплуатации","В7-34А № 0862188, Ч3-64 № 8803136, Р4831 № 10691; № 07893; № 23393"]