{"text_format":"1","workbook":"xlsx","n_sheets":3,"sheets":["Sheet1","Sheet2","Sheet1 3"],"not_rendered":{"charts":0,"images":0,"macros":1,"external_links":0,"defined_names":3,"comments":0,"pivot_tables":0},"unopened":[],"bounds":{"document_bytes":16777216,"sheet_cells":100000,"rows_first":2000,"rows_last":500,"rows_between":2000,"halvings":0,"cell_chars":16384,"cell_head_chars":4096},"cells_cut":0,"cells_raw":0,"read":"whole","date_system":"1900"}

{"sheet":"Sheet1","index":0,"n_rows":29,"n_cols":7,"rows_kept":29,"cut":false,"hidden":false,"merged":[]}
["Last name","First name","Organization","Card number","Entrance Time","POB",{"$f":"SUMPRODUCT(--(LEN(TRIM(D1:D15))>0))-1","v":14}]
[{"$f":"IFERROR(IF(D2=\"\",\"\",INDEX(Sheet2!A:A,MATCH(Sheet1!D2,Sheet2!E:E,0))),\"\")","v":"Ali"},{"$f":"IFERROR(IF(D2=\"\",\"\",INDEX(Sheet2!B:B,MATCH(Sheet1!D2,Sheet2!E:E,0))),\"\")","v":"Muhammad"},{"$f":"IFERROR(IF(D2=\"\",\"\",INDEX(Sheet2!D:D,MATCH(Sheet1!D2,Sheet2!E:E,0))),\"\")","v":"USA"},{"$f":"'Sheet1 3'!E8","v":6},{"$f":"IF(D2<>\"\",IF(E2=\"\",NOW(),E2),\"\")","v":43546.245988194445}]
[{"$f":"IFERROR(IF(D3=\"\",\"\",INDEX(Sheet2!A:A,MATCH(Sheet1!D3,Sheet2!E:E,0))),\"\")","v":"Columbus"},{"$f":"IFERROR(IF(D3=\"\",\"\",INDEX(Sheet2!B:B,MATCH(Sheet1!D3,Sheet2!E:E,0))),\"\")","v":"Christopher"},{"$f":"IFERROR(IF(D3=\"\",\"\",INDEX(Sheet2!D:D,MATCH(Sheet1!D3,Sheet2!E:E,0))),\"\")","v":"Italia"},{"$f":"'Sheet1 3'!E9","v":9},43546.245988194445]
[{"$f":"IFERROR(IF(D4=\"\",\"\",INDEX(Sheet2!A:A,MATCH(Sheet1!D4,Sheet2!E:E,0))),\"\")","v":"Thatcher"},{"$f":"IFERROR(IF(D4=\"\",\"\",INDEX(Sheet2!B:B,MATCH(Sheet1!D4,Sheet2!E:E,0))),\"\")","v":"Margaret"},{"$f":"IFERROR(IF(D4=\"\",\"\",INDEX(Sheet2!D:D,MATCH(Sheet1!D4,Sheet2!E:E,0))),\"\")","v":"Britain"},{"$f":"'Sheet1 3'!E10","v":8},43546.245988194445]
[{"$f":"IFERROR(IF(D5=\"\",\"\",INDEX(Sheet2!A:A,MATCH(Sheet1!D5,Sheet2!E:E,0))),\"\")","v":"Ali"},{"$f":"IFERROR(IF(D5=\"\",\"\",INDEX(Sheet2!B:B,MATCH(Sheet1!D5,Sheet2!E:E,0))),\"\")","v":"Muhammad"},{"$f":"IFERROR(IF(D5=\"\",\"\",INDEX(Sheet2!D:D,MATCH(Sheet1!D5,Sheet2!E:E,0))),\"\")","v":"USA"},{"$f":"'Sheet1 3'!E11","v":6},43546.245988194445]
[{"$f":"IFERROR(IF(D6=\"\",\"\",INDEX(Sheet2!A:A,MATCH(Sheet1!D6,Sheet2!E:E,0))),\"\")","v":"Gandhi"},{"$f":"IFERROR(IF(D6=\"\",\"\",INDEX(Sheet2!B:B,MATCH(Sheet1!D6,Sheet2!E:E,0))),\"\")","v":"Mahatma"},{"$f":"IFERROR(IF(D6=\"\",\"\",INDEX(Sheet2!D:D,MATCH(Sheet1!D6,Sheet2!E:E,0))),\"\")","v":"India"},{"$f":"'Sheet1 3'!E12","v":7},43546.245988194445]
[{"$f":"IFERROR(IF(D7=\"\",\"\",INDEX(Sheet2!A:A,MATCH(Sheet1!D7,Sheet2!E:E,0))),\"\")","v":"Ali"},{"$f":"IFERROR(IF(D7=\"\",\"\",INDEX(Sheet2!B:B,MATCH(Sheet1!D7,Sheet2!E:E,0))),\"\")","v":"Muhammad"},{"$f":"IFERROR(IF(D7=\"\",\"\",INDEX(Sheet2!D:D,MATCH(Sheet1!D7,Sheet2!E:E,0))),\"\")","v":"USA"},{"$f":"'Sheet1 3'!E15","v":6},43546.245988194445]
[{"$f":"IFERROR(IF(D8=\"\",\"\",INDEX(Sheet2!A:A,MATCH(Sheet1!D8,Sheet2!E:E,0))),\"\")","v":"Gates"},{"$f":"IFERROR(IF(D8=\"\",\"\",INDEX(Sheet2!B:B,MATCH(Sheet1!D8,Sheet2!E:E,0))),\"\")","v":"Bill"},{"$f":"IFERROR(IF(D8=\"\",\"\",INDEX(Sheet2!D:D,MATCH(Sheet1!D8,Sheet2!E:E,0))),\"\")","v":"USA"},{"$f":"'Sheet1 3'!E16","v":3},43546.245988194445]
[{"$f":"IFERROR(IF(D9=\"\",\"\",INDEX(Sheet2!A:A,MATCH(Sheet1!D9,Sheet2!E:E,0))),\"\")","v":"Thatcher"},{"$f":"IFERROR(IF(D9=\"\",\"\",INDEX(Sheet2!B:B,MATCH(Sheet1!D9,Sheet2!E:E,0))),\"\")","v":"Margaret"},{"$f":"IFERROR(IF(D9=\"\",\"\",INDEX(Sheet2!D:D,MATCH(Sheet1!D9,Sheet2!E:E,0))),\"\")","v":"Britain"},{"$f":"'Sheet1 3'!E21","v":8},43546.245988194445]
[{"$f":"IFERROR(IF(D10=\"\",\"\",INDEX(Sheet2!A:A,MATCH(Sheet1!D10,Sheet2!E:E,0))),\"\")","v":"Lincoln"},{"$f":"IFERROR(IF(D10=\"\",\"\",INDEX(Sheet2!B:B,MATCH(Sheet1!D10,Sheet2!E:E,0))),\"\")","v":"Abraham"},{"$f":"IFERROR(IF(D10=\"\",\"\",INDEX(Sheet2!D:D,MATCH(Sheet1!D10,Sheet2!E:E,0))),\"\")","v":"USA"},{"$f":"'Sheet1 3'!E24","v":2},43546.245988194445]
[{"$f":"IFERROR(IF(D11=\"\",\"\",INDEX(Sheet2!A:A,MATCH(Sheet1!D11,Sheet2!E:E,0))),\"\")","v":"Darwin"},{"$f":"IFERROR(IF(D11=\"\",\"\",INDEX(Sheet2!B:B,MATCH(Sheet1!D11,Sheet2!E:E,0))),\"\")","v":"Charles"},{"$f":"IFERROR(IF(D11=\"\",\"\",INDEX(Sheet2!D:D,MATCH(Sheet1!D11,Sheet2!E:E,0))),\"\")","v":"UK"},{"$f":"'Sheet1 3'!E28","v":10},43546.245988194445]
[{"$f":"IFERROR(IF(D12=\"\",\"\",INDEX(Sheet2!A:A,MATCH(Sheet1!D12,Sheet2!E:E,0))),\"\")","v":"Presley"},{"$f":"IFERROR(IF(D12=\"\",\"\",INDEX(Sheet2!B:B,MATCH(Sheet1!D12,Sheet2!E:E,0))),\"\")","v":"Elvis"},{"$f":"IFERROR(IF(D12=\"\",\"\",INDEX(Sheet2!D:D,MATCH(Sheet1!D12,Sheet2!E:E,0))),\"\")","v":"USA"},{"$f":"'Sheet1 3'!E30","v":4},43546.246393171299]
[{"$f":"IFERROR(IF(D13=\"\",\"\",INDEX(Sheet2!A:A,MATCH(Sheet1!D13,Sheet2!E:E,0))),\"\")","v":"Gates"},{"$f":"IFERROR(IF(D13=\"\",\"\",INDEX(Sheet2!B:B,MATCH(Sheet1!D13,Sheet2!E:E,0))),\"\")","v":"Bill"},{"$f":"IFERROR(IF(D13=\"\",\"\",INDEX(Sheet2!D:D,MATCH(Sheet1!D13,Sheet2!E:E,0))),\"\")","v":"USA"},{"$f":"'Sheet1 3'!E31","v":3},43546.246393171299]
[{"$f":"IFERROR(IF(D14=\"\",\"\",INDEX(Sheet2!A:A,MATCH(Sheet1!D14,Sheet2!E:E,0))),\"\")","v":"Ali"},{"$f":"IFERROR(IF(D14=\"\",\"\",INDEX(Sheet2!B:B,MATCH(Sheet1!D14,Sheet2!E:E,0))),\"\")","v":"Muhammad"},{"$f":"IFERROR(IF(D14=\"\",\"\",INDEX(Sheet2!D:D,MATCH(Sheet1!D14,Sheet2!E:E,0))),\"\")","v":"USA"},{"$f":"'Sheet1 3'!E32","v":6},43546.246393171299]
[{"$f":"IFERROR(IF(D15=\"\",\"\",INDEX(Sheet2!A:A,MATCH(Sheet1!D15,Sheet2!E:E,0))),\"\")","v":"Jobs"},{"$f":"IFERROR(IF(D15=\"\",\"\",INDEX(Sheet2!B:B,MATCH(Sheet1!D15,Sheet2!E:E,0))),\"\")","v":"Steve"},{"$f":"IFERROR(IF(D15=\"\",\"\",INDEX(Sheet2!D:D,MATCH(Sheet1!D15,Sheet2!E:E,0))),\"\")","v":"USA"},{"$f":"'Sheet1 3'!E36","v":5},{"$f":"IF(D15<>\"\",IF(E15=\"\",NOW(),E15),\"\")","v":43546.246393171299}]
[{"$f":"IFERROR(IF(D16=\"\",\"\",INDEX(Sheet2!A:A,MATCH(Sheet1!D16,Sheet2!E:E,0))),\"\")","v":"Jackson"},{"$f":"IFERROR(IF(D16=\"\",\"\",INDEX(Sheet2!B:B,MATCH(Sheet1!D16,Sheet2!E:E,0))),\"\")","v":"Michael"},{"$f":"IFERROR(IF(D16=\"\",\"\",INDEX(Sheet2!D:D,MATCH(Sheet1!D16,Sheet2!E:E,0))),\"\")","v":"USA"},1,43549.345546990742]
[{"$f":"IFERROR(IF(D17=\"\",\"\",INDEX(Sheet2!A:A,MATCH(Sheet1!D17,Sheet2!E:E,0))),\"\")","v":""},{"$f":"IFERROR(IF(D17=\"\",\"\",INDEX(Sheet2!B:B,MATCH(Sheet1!D17,Sheet2!E:E,0))),\"\")","v":""},{"$f":"IFERROR(IF(D17=\"\",\"\",INDEX(Sheet2!D:D,MATCH(Sheet1!D17,Sheet2!E:E,0))),\"\")","v":""},null,""]
[{"$f":"IFERROR(IF(D18=\"\",\"\",INDEX(Sheet2!A:A,MATCH(Sheet1!D18,Sheet2!E:E,0))),\"\")","v":""},{"$f":"IFERROR(IF(D18=\"\",\"\",INDEX(Sheet2!B:B,MATCH(Sheet1!D18,Sheet2!E:E,0))),\"\")","v":""},{"$f":"IFERROR(IF(D18=\"\",\"\",INDEX(Sheet2!D:D,MATCH(Sheet1!D18,Sheet2!E:E,0))),\"\")","v":""},null,""]
[{"$f":"IFERROR(IF(D19=\"\",\"\",INDEX(Sheet2!A:A,MATCH(Sheet1!D19,Sheet2!E:E,0))),\"\")","v":""},{"$f":"IFERROR(IF(D19=\"\",\"\",INDEX(Sheet2!B:B,MATCH(Sheet1!D19,Sheet2!E:E,0))),\"\")","v":""},{"$f":"IFERROR(IF(D19=\"\",\"\",INDEX(Sheet2!D:D,MATCH(Sheet1!D19,Sheet2!E:E,0))),\"\")","v":""},null,""]
[{"$f":"IFERROR(IF(D20=\"\",\"\",INDEX(Sheet2!A:A,MATCH(Sheet1!D20,Sheet2!E:E,0))),\"\")","v":""},{"$f":"IFERROR(IF(D20=\"\",\"\",INDEX(Sheet2!B:B,MATCH(Sheet1!D20,Sheet2!E:E,0))),\"\")","v":""},{"$f":"IFERROR(IF(D20=\"\",\"\",INDEX(Sheet2!D:D,MATCH(Sheet1!D20,Sheet2!E:E,0))),\"\")","v":""},null,""]
[{"$f":"IFERROR(IF(D21=\"\",\"\",INDEX(Sheet2!A:A,MATCH(Sheet1!D21,Sheet2!E:E,0))),\"\")","v":""},{"$f":"IFERROR(IF(D21=\"\",\"\",INDEX(Sheet2!B:B,MATCH(Sheet1!D21,Sheet2!E:E,0))),\"\")","v":""},{"$f":"IFERROR(IF(D21=\"\",\"\",INDEX(Sheet2!D:D,MATCH(Sheet1!D21,Sheet2!E:E,0))),\"\")","v":""},null,""]
[{"$f":"IFERROR(IF(D22=\"\",\"\",INDEX(Sheet2!A:A,MATCH(Sheet1!D22,Sheet2!E:E,0))),\"\")","v":""},{"$f":"IFERROR(IF(D22=\"\",\"\",INDEX(Sheet2!B:B,MATCH(Sheet1!D22,Sheet2!E:E,0))),\"\")","v":""},{"$f":"IFERROR(IF(D22=\"\",\"\",INDEX(Sheet2!D:D,MATCH(Sheet1!D22,Sheet2!E:E,0))),\"\")","v":""},null,""]
[{"$f":"IFERROR(IF(D23=\"\",\"\",INDEX(Sheet2!A:A,MATCH(Sheet1!D23,Sheet2!E:E,0))),\"\")","v":""},{"$f":"IFERROR(IF(D23=\"\",\"\",INDEX(Sheet2!B:B,MATCH(Sheet1!D23,Sheet2!E:E,0))),\"\")","v":""},{"$f":"IFERROR(IF(D23=\"\",\"\",INDEX(Sheet2!D:D,MATCH(Sheet1!D23,Sheet2!E:E,0))),\"\")","v":""},null,""]
[{"$f":"IFERROR(IF(D24=\"\",\"\",INDEX(Sheet2!A:A,MATCH(Sheet1!D24,Sheet2!E:E,0))),\"\")","v":""},{"$f":"IFERROR(IF(D24=\"\",\"\",INDEX(Sheet2!B:B,MATCH(Sheet1!D24,Sheet2!E:E,0))),\"\")","v":""},{"$f":"IFERROR(IF(D24=\"\",\"\",INDEX(Sheet2!D:D,MATCH(Sheet1!D24,Sheet2!E:E,0))),\"\")","v":""},null,""]
[{"$f":"IFERROR(IF(D25=\"\",\"\",INDEX(Sheet2!A:A,MATCH(Sheet1!D25,Sheet2!E:E,0))),\"\")","v":""},{"$f":"IFERROR(IF(D25=\"\",\"\",INDEX(Sheet2!B:B,MATCH(Sheet1!D25,Sheet2!E:E,0))),\"\")","v":""},{"$f":"IFERROR(IF(D25=\"\",\"\",INDEX(Sheet2!D:D,MATCH(Sheet1!D25,Sheet2!E:E,0))),\"\")","v":""},null,""]
[null,{"$f":"IFERROR(IF(D26=\"\",\"\",INDEX(Sheet2!B:B,MATCH(Sheet1!D26,Sheet2!E:E,0))),\"\")","v":""},null,null,""]
[null,{"$f":"IFERROR(IF(D27=\"\",\"\",INDEX(Sheet2!B:B,MATCH(Sheet1!D27,Sheet2!E:E,0))),\"\")","v":""},null,null,""]
[null,{"$f":"IFERROR(IF(D28=\"\",\"\",INDEX(Sheet2!B:B,MATCH(Sheet1!D28,Sheet2!E:E,0))),\"\")","v":""},null,null,""]
[null,{"$f":"IFERROR(IF(D29=\"\",\"\",INDEX(Sheet2!B:B,MATCH(Sheet1!D29,Sheet2!E:E,0))),\"\")","v":""},null,null,""]

{"sheet":"Sheet2","index":1,"n_rows":11,"n_cols":5,"rows_kept":11,"cut":false,"hidden":false,"merged":[]}
["Last name","First name","Agency code","Organization","Card number"]
["Jackson","Michael",12345,"USA",1]
["Lincoln","Abraham",11111,"USA",2]
["Gates","Bill",22222,"USA",3]
["Presley","Elvis",33333,"USA",4]
["Jobs","Steve",44444,"USA",5]
["Ali","Muhammad",5555,"USA",6]
["Gandhi","Mahatma",6666,"India",7]
["Thatcher","Margaret",7777,"Britain",8]
["Columbus","Christopher",8888,"Italia",9]
["Darwin","Charles",9999,"UK",10]

{"sheet":"Sheet1 3","index":2,"n_rows":43,"n_cols":8,"rows_kept":43,"cut":false,"hidden":false,"merged":[]}
["Last name","First name","Organization",null,"Card number","Time","IN","OUT"]
[{"$f":"IFERROR(IF(E2=\"\",\"\",INDEX(Sheet2!A:A,MATCH('Sheet1 3'!E2,Sheet2!E:E,0))),\"\")","v":"Jackson"},{"$f":"IFERROR(IF(E2=\"\",\"\",INDEX(Sheet2!B:B,MATCH('Sheet1 3'!E2,Sheet2!E:E,0))),\"\")","v":"Michael"},{"$f":"IFERROR(IF(E2=\"\",\"\",INDEX(Sheet2!D:D,MATCH('Sheet1 3'!E2,Sheet2!E:E,0))),\"\")","v":"USA"},null,1,{"$f":"IF(E2<>\"\",IF(F2=\"\",NOW(),F2),\"\")","v":43545.244288310183}]
[{"$f":"IFERROR(IF(E3=\"\",\"\",INDEX(Sheet2!A:A,MATCH('Sheet1 3'!E3,Sheet2!E:E,0))),\"\")","v":"Jackson"},{"$f":"IFERROR(IF(E3=\"\",\"\",INDEX(Sheet2!B:B,MATCH('Sheet1 3'!E3,Sheet2!E:E,0))),\"\")","v":"Michael"},{"$f":"IFERROR(IF(E3=\"\",\"\",INDEX(Sheet2!D:D,MATCH('Sheet1 3'!E3,Sheet2!E:E,0))),\"\")","v":"USA"},null,1,{"$f":"IF(E3<>\"\",IF(F3=\"\",NOW(),F3),\"\")","v":43545.244288310183}]
[{"$f":"IFERROR(IF(E4=\"\",\"\",INDEX(Sheet2!A:A,MATCH('Sheet1 3'!E4,Sheet2!E:E,0))),\"\")","v":"Jackson"},{"$f":"IFERROR(IF(E4=\"\",\"\",INDEX(Sheet2!B:B,MATCH('Sheet1 3'!E4,Sheet2!E:E,0))),\"\")","v":"Michael"},{"$f":"IFERROR(IF(E4=\"\",\"\",INDEX(Sheet2!D:D,MATCH('Sheet1 3'!E4,Sheet2!E:E,0))),\"\")","v":"USA"},null,1,43545.244288310183]
[{"$f":"IFERROR(IF(E5=\"\",\"\",INDEX(Sheet2!A:A,MATCH('Sheet1 3'!E5,Sheet2!E:E,0))),\"\")","v":"Jobs"},{"$f":"IFERROR(IF(E5=\"\",\"\",INDEX(Sheet2!B:B,MATCH('Sheet1 3'!E5,Sheet2!E:E,0))),\"\")","v":"Steve"},{"$f":"IFERROR(IF(E5=\"\",\"\",INDEX(Sheet2!D:D,MATCH('Sheet1 3'!E5,Sheet2!E:E,0))),\"\")","v":"USA"},null,5,43545.244482523151]
[{"$f":"IFERROR(IF(E6=\"\",\"\",INDEX(Sheet2!A:A,MATCH('Sheet1 3'!E6,Sheet2!E:E,0))),\"\")","v":"Presley"},{"$f":"IFERROR(IF(E6=\"\",\"\",INDEX(Sheet2!B:B,MATCH('Sheet1 3'!E6,Sheet2!E:E,0))),\"\")","v":"Elvis"},{"$f":"IFERROR(IF(E6=\"\",\"\",INDEX(Sheet2!D:D,MATCH('Sheet1 3'!E6,Sheet2!E:E,0))),\"\")","v":"USA"},null,4,43545.244492824073]
[{"$f":"IFERROR(IF(E7=\"\",\"\",INDEX(Sheet2!A:A,MATCH('Sheet1 3'!E7,Sheet2!E:E,0))),\"\")","v":"Ali"},{"$f":"IFERROR(IF(E7=\"\",\"\",INDEX(Sheet2!B:B,MATCH('Sheet1 3'!E7,Sheet2!E:E,0))),\"\")","v":"Muhammad"},{"$f":"IFERROR(IF(E7=\"\",\"\",INDEX(Sheet2!D:D,MATCH('Sheet1 3'!E7,Sheet2!E:E,0))),\"\")","v":"USA"},null,6,43545.244508217591]
[{"$f":"IFERROR(IF(E8=\"\",\"\",INDEX(Sheet2!A:A,MATCH('Sheet1 3'!E8,Sheet2!E:E,0))),\"\")","v":"Ali"},{"$f":"IFERROR(IF(E8=\"\",\"\",INDEX(Sheet2!B:B,MATCH('Sheet1 3'!E8,Sheet2!E:E,0))),\"\")","v":"Muhammad"},{"$f":"IFERROR(IF(E8=\"\",\"\",INDEX(Sheet2!D:D,MATCH('Sheet1 3'!E8,Sheet2!E:E,0))),\"\")","v":"USA"},null,6,43545.24451261574]
[{"$f":"IFERROR(IF(E9=\"\",\"\",INDEX(Sheet2!A:A,MATCH('Sheet1 3'!E9,Sheet2!E:E,0))),\"\")","v":"Columbus"},{"$f":"IFERROR(IF(E9=\"\",\"\",INDEX(Sheet2!B:B,MATCH('Sheet1 3'!E9,Sheet2!E:E,0))),\"\")","v":"Christopher"},{"$f":"IFERROR(IF(E9=\"\",\"\",INDEX(Sheet2!D:D,MATCH('Sheet1 3'!E9,Sheet2!E:E,0))),\"\")","v":"Italia"},null,9,43545.244746412034]
[{"$f":"IFERROR(IF(E10=\"\",\"\",INDEX(Sheet2!A:A,MATCH('Sheet1 3'!E10,Sheet2!E:E,0))),\"\")","v":"Thatcher"},{"$f":"IFERROR(IF(E10=\"\",\"\",INDEX(Sheet2!B:B,MATCH('Sheet1 3'!E10,Sheet2!E:E,0))),\"\")","v":"Margaret"},{"$f":"IFERROR(IF(E10=\"\",\"\",INDEX(Sheet2!D:D,MATCH('Sheet1 3'!E10,Sheet2!E:E,0))),\"\")","v":"Britain"},null,8,43545.244751851853]
[{"$f":"IFERROR(IF(E11=\"\",\"\",INDEX(Sheet2!A:A,MATCH('Sheet1 3'!E11,Sheet2!E:E,0))),\"\")","v":"Ali"},{"$f":"IFERROR(IF(E11=\"\",\"\",INDEX(Sheet2!B:B,MATCH('Sheet1 3'!E11,Sheet2!E:E,0))),\"\")","v":"Muhammad"},{"$f":"IFERROR(IF(E11=\"\",\"\",INDEX(Sheet2!D:D,MATCH('Sheet1 3'!E11,Sheet2!E:E,0))),\"\")","v":"USA"},null,6,43545.244758680557]
[{"$f":"IFERROR(IF(E12=\"\",\"\",INDEX(Sheet2!A:A,MATCH('Sheet1 3'!E12,Sheet2!E:E,0))),\"\")","v":"Gandhi"},{"$f":"IFERROR(IF(E12=\"\",\"\",INDEX(Sheet2!B:B,MATCH('Sheet1 3'!E12,Sheet2!E:E,0))),\"\")","v":"Mahatma"},{"$f":"IFERROR(IF(E12=\"\",\"\",INDEX(Sheet2!D:D,MATCH('Sheet1 3'!E12,Sheet2!E:E,0))),\"\")","v":"India"},null,7,43545.244765393516]
[{"$f":"IFERROR(IF(E13=\"\",\"\",INDEX(Sheet2!A:A,MATCH('Sheet1 3'!E13,Sheet2!E:E,0))),\"\")","v":"Jobs"},{"$f":"IFERROR(IF(E13=\"\",\"\",INDEX(Sheet2!B:B,MATCH('Sheet1 3'!E13,Sheet2!E:E,0))),\"\")","v":"Steve"},{"$f":"IFERROR(IF(E13=\"\",\"\",INDEX(Sheet2!D:D,MATCH('Sheet1 3'!E13,Sheet2!E:E,0))),\"\")","v":"USA"},null,5,43545.24477222222]
[{"$f":"IFERROR(IF(E14=\"\",\"\",INDEX(Sheet2!A:A,MATCH('Sheet1 3'!E14,Sheet2!E:E,0))),\"\")","v":"Presley"},{"$f":"IFERROR(IF(E14=\"\",\"\",INDEX(Sheet2!B:B,MATCH('Sheet1 3'!E14,Sheet2!E:E,0))),\"\")","v":"Elvis"},{"$f":"IFERROR(IF(E14=\"\",\"\",INDEX(Sheet2!D:D,MATCH('Sheet1 3'!E14,Sheet2!E:E,0))),\"\")","v":"USA"},null,4,43545.244778356478]
[{"$f":"IFERROR(IF(E15=\"\",\"\",INDEX(Sheet2!A:A,MATCH('Sheet1 3'!E15,Sheet2!E:E,0))),\"\")","v":"Ali"},{"$f":"IFERROR(IF(E15=\"\",\"\",INDEX(Sheet2!B:B,MATCH('Sheet1 3'!E15,Sheet2!E:E,0))),\"\")","v":"Muhammad"},{"$f":"IFERROR(IF(E15=\"\",\"\",INDEX(Sheet2!D:D,MATCH('Sheet1 3'!E15,Sheet2!E:E,0))),\"\")","v":"USA"},null,6,43545.244785069444]
[{"$f":"IFERROR(IF(E16=\"\",\"\",INDEX(Sheet2!A:A,MATCH('Sheet1 3'!E16,Sheet2!E:E,0))),\"\")","v":"Gates"},{"$f":"IFERROR(IF(E16=\"\",\"\",INDEX(Sheet2!B:B,MATCH('Sheet1 3'!E16,Sheet2!E:E,0))),\"\")","v":"Bill"},{"$f":"IFERROR(IF(E16=\"\",\"\",INDEX(Sheet2!D:D,MATCH('Sheet1 3'!E16,Sheet2!E:E,0))),\"\")","v":"USA"},null,3,43545.244792939811]
[{"$f":"IFERROR(IF(E17=\"\",\"\",INDEX(Sheet2!A:A,MATCH('Sheet1 3'!E17,Sheet2!E:E,0))),\"\")","v":"Jobs"},{"$f":"IFERROR(IF(E17=\"\",\"\",INDEX(Sheet2!B:B,MATCH('Sheet1 3'!E17,Sheet2!E:E,0))),\"\")","v":"Steve"},{"$f":"IFERROR(IF(E17=\"\",\"\",INDEX(Sheet2!D:D,MATCH('Sheet1 3'!E17,Sheet2!E:E,0))),\"\")","v":"USA"},null,5,43545.24480104167]
[{"$f":"IFERROR(IF(E18=\"\",\"\",INDEX(Sheet2!A:A,MATCH('Sheet1 3'!E18,Sheet2!E:E,0))),\"\")","v":"Jackson"},{"$f":"IFERROR(IF(E18=\"\",\"\",INDEX(Sheet2!B:B,MATCH('Sheet1 3'!E18,Sheet2!E:E,0))),\"\")","v":"Michael"},{"$f":"IFERROR(IF(E18=\"\",\"\",INDEX(Sheet2!D:D,MATCH('Sheet1 3'!E18,Sheet2!E:E,0))),\"\")","v":"USA"},null,1,43545.24480763889]
[{"$f":"IFERROR(IF(E19=\"\",\"\",INDEX(Sheet2!A:A,MATCH('Sheet1 3'!E19,Sheet2!E:E,0))),\"\")","v":"Lincoln"},{"$f":"IFERROR(IF(E19=\"\",\"\",INDEX(Sheet2!B:B,MATCH('Sheet1 3'!E19,Sheet2!E:E,0))),\"\")","v":"Abraham"},{"$f":"IFERROR(IF(E19=\"\",\"\",INDEX(Sheet2!D:D,MATCH('Sheet1 3'!E19,Sheet2!E:E,0))),\"\")","v":"USA"},null,2,43545.244813310186]
[{"$f":"IFERROR(IF(E20=\"\",\"\",INDEX(Sheet2!A:A,MATCH('Sheet1 3'!E20,Sheet2!E:E,0))),\"\")","v":"Jobs"},{"$f":"IFERROR(IF(E20=\"\",\"\",INDEX(Sheet2!B:B,MATCH('Sheet1 3'!E20,Sheet2!E:E,0))),\"\")","v":"Steve"},{"$f":"IFERROR(IF(E20=\"\",\"\",INDEX(Sheet2!D:D,MATCH('Sheet1 3'!E20,Sheet2!E:E,0))),\"\")","v":"USA"},null,5,43545.244818865744]
[{"$f":"IFERROR(IF(E21=\"\",\"\",INDEX(Sheet2!A:A,MATCH('Sheet1 3'!E21,Sheet2!E:E,0))),\"\")","v":"Thatcher"},{"$f":"IFERROR(IF(E21=\"\",\"\",INDEX(Sheet2!B:B,MATCH('Sheet1 3'!E21,Sheet2!E:E,0))),\"\")","v":"Margaret"},{"$f":"IFERROR(IF(E21=\"\",\"\",INDEX(Sheet2!D:D,MATCH('Sheet1 3'!E21,Sheet2!E:E,0))),\"\")","v":"Britain"},null,8,43545.244824189816]
[{"$f":"IFERROR(IF(E22=\"\",\"\",INDEX(Sheet2!A:A,MATCH('Sheet1 3'!E22,Sheet2!E:E,0))),\"\")","v":"Darwin"},{"$f":"IFERROR(IF(E22=\"\",\"\",INDEX(Sheet2!B:B,MATCH('Sheet1 3'!E22,Sheet2!E:E,0))),\"\")","v":"Charles"},{"$f":"IFERROR(IF(E22=\"\",\"\",INDEX(Sheet2!D:D,MATCH('Sheet1 3'!E22,Sheet2!E:E,0))),\"\")","v":"UK"},null,10,43545.244879282407]
[{"$f":"IFERROR(IF(E23=\"\",\"\",INDEX(Sheet2!A:A,MATCH('Sheet1 3'!E23,Sheet2!E:E,0))),\"\")","v":"Jackson"},{"$f":"IFERROR(IF(E23=\"\",\"\",INDEX(Sheet2!B:B,MATCH('Sheet1 3'!E23,Sheet2!E:E,0))),\"\")","v":"Michael"},{"$f":"IFERROR(IF(E23=\"\",\"\",INDEX(Sheet2!D:D,MATCH('Sheet1 3'!E23,Sheet2!E:E,0))),\"\")","v":"USA"},null,1,43545.244846180554]
[{"$f":"IFERROR(IF(E24=\"\",\"\",INDEX(Sheet2!A:A,MATCH('Sheet1 3'!E24,Sheet2!E:E,0))),\"\")","v":"Lincoln"},{"$f":"IFERROR(IF(E24=\"\",\"\",INDEX(Sheet2!B:B,MATCH('Sheet1 3'!E24,Sheet2!E:E,0))),\"\")","v":"Abraham"},{"$f":"IFERROR(IF(E24=\"\",\"\",INDEX(Sheet2!D:D,MATCH('Sheet1 3'!E24,Sheet2!E:E,0))),\"\")","v":"USA"},null,2,43545.244849537034]
[{"$f":"IFERROR(IF(E25=\"\",\"\",INDEX(Sheet2!A:A,MATCH('Sheet1 3'!E25,Sheet2!E:E,0))),\"\")","v":"Darwin"},{"$f":"IFERROR(IF(E25=\"\",\"\",INDEX(Sheet2!B:B,MATCH('Sheet1 3'!E25,Sheet2!E:E,0))),\"\")","v":"Charles"},{"$f":"IFERROR(IF(E25=\"\",\"\",INDEX(Sheet2!D:D,MATCH('Sheet1 3'!E25,Sheet2!E:E,0))),\"\")","v":"UK"},null,10,43545.24489710648]
[{"$f":"IFERROR(IF(E26=\"\",\"\",INDEX(Sheet2!A:A,MATCH('Sheet1 3'!E26,Sheet2!E:E,0))),\"\")","v":"Presley"},{"$f":"IFERROR(IF(E26=\"\",\"\",INDEX(Sheet2!B:B,MATCH('Sheet1 3'!E26,Sheet2!E:E,0))),\"\")","v":"Elvis"},{"$f":"IFERROR(IF(E26=\"\",\"\",INDEX(Sheet2!D:D,MATCH('Sheet1 3'!E26,Sheet2!E:E,0))),\"\")","v":"USA"},null,4,43545.244858564816]
[{"$f":"IFERROR(IF(E27=\"\",\"\",INDEX(Sheet2!A:A,MATCH('Sheet1 3'!E27,Sheet2!E:E,0))),\"\")","v":"Darwin"},{"$f":"IFERROR(IF(E27=\"\",\"\",INDEX(Sheet2!B:B,MATCH('Sheet1 3'!E27,Sheet2!E:E,0))),\"\")","v":"Charles"},{"$f":"IFERROR(IF(E27=\"\",\"\",INDEX(Sheet2!D:D,MATCH('Sheet1 3'!E27,Sheet2!E:E,0))),\"\")","v":"UK"},null,10,43545.244907986111]
[{"$f":"IFERROR(IF(E28=\"\",\"\",INDEX(Sheet2!A:A,MATCH('Sheet1 3'!E28,Sheet2!E:E,0))),\"\")","v":"Darwin"},{"$f":"IFERROR(IF(E28=\"\",\"\",INDEX(Sheet2!B:B,MATCH('Sheet1 3'!E28,Sheet2!E:E,0))),\"\")","v":"Charles"},{"$f":"IFERROR(IF(E28=\"\",\"\",INDEX(Sheet2!D:D,MATCH('Sheet1 3'!E28,Sheet2!E:E,0))),\"\")","v":"UK"},null,10,{"$f":"IF(E28<>\"\",IF(F28=\"\",NOW(),F28),\"\")","v":43546.24564212963}]
[{"$f":"IFERROR(IF(E29=\"\",\"\",INDEX(Sheet2!A:A,MATCH('Sheet1 3'!E29,Sheet2!E:E,0))),\"\")","v":"Presley"},{"$f":"IFERROR(IF(E29=\"\",\"\",INDEX(Sheet2!B:B,MATCH('Sheet1 3'!E29,Sheet2!E:E,0))),\"\")","v":"Elvis"},{"$f":"IFERROR(IF(E29=\"\",\"\",INDEX(Sheet2!D:D,MATCH('Sheet1 3'!E29,Sheet2!E:E,0))),\"\")","v":"USA"},null,4,43546.24662233796]
[{"$f":"IFERROR(IF(E30=\"\",\"\",INDEX(Sheet2!A:A,MATCH('Sheet1 3'!E30,Sheet2!E:E,0))),\"\")","v":"Presley"},{"$f":"IFERROR(IF(E30=\"\",\"\",INDEX(Sheet2!B:B,MATCH('Sheet1 3'!E30,Sheet2!E:E,0))),\"\")","v":"Elvis"},{"$f":"IFERROR(IF(E30=\"\",\"\",INDEX(Sheet2!D:D,MATCH('Sheet1 3'!E30,Sheet2!E:E,0))),\"\")","v":"USA"},null,4,43546.246736226851]
[{"$f":"IFERROR(IF(E31=\"\",\"\",INDEX(Sheet2!A:A,MATCH('Sheet1 3'!E31,Sheet2!E:E,0))),\"\")","v":"Gates"},{"$f":"IFERROR(IF(E31=\"\",\"\",INDEX(Sheet2!B:B,MATCH('Sheet1 3'!E31,Sheet2!E:E,0))),\"\")","v":"Bill"},{"$f":"IFERROR(IF(E31=\"\",\"\",INDEX(Sheet2!D:D,MATCH('Sheet1 3'!E31,Sheet2!E:E,0))),\"\")","v":"USA"},null,3,43549.342310763888]
[{"$f":"IFERROR(IF(E32=\"\",\"\",INDEX(Sheet2!A:A,MATCH('Sheet1 3'!E32,Sheet2!E:E,0))),\"\")","v":"Ali"},{"$f":"IFERROR(IF(E32=\"\",\"\",INDEX(Sheet2!B:B,MATCH('Sheet1 3'!E32,Sheet2!E:E,0))),\"\")","v":"Muhammad"},{"$f":"IFERROR(IF(E32=\"\",\"\",INDEX(Sheet2!D:D,MATCH('Sheet1 3'!E32,Sheet2!E:E,0))),\"\")","v":"USA"},null,6,43549.342554282404]
[{"$f":"IFERROR(IF(E33=\"\",\"\",INDEX(Sheet2!A:A,MATCH('Sheet1 3'!E33,Sheet2!E:E,0))),\"\")","v":"Jobs"},{"$f":"IFERROR(IF(E33=\"\",\"\",INDEX(Sheet2!B:B,MATCH('Sheet1 3'!E33,Sheet2!E:E,0))),\"\")","v":"Steve"},{"$f":"IFERROR(IF(E33=\"\",\"\",INDEX(Sheet2!D:D,MATCH('Sheet1 3'!E33,Sheet2!E:E,0))),\"\")","v":"USA"},null,5,43549.343178009258]
[{"$f":"IFERROR(IF(E34=\"\",\"\",INDEX(Sheet2!A:A,MATCH('Sheet1 3'!E34,Sheet2!E:E,0))),\"\")","v":"Jobs"},{"$f":"IFERROR(IF(E34=\"\",\"\",INDEX(Sheet2!B:B,MATCH('Sheet1 3'!E34,Sheet2!E:E,0))),\"\")","v":"Steve"},{"$f":"IFERROR(IF(E34=\"\",\"\",INDEX(Sheet2!D:D,MATCH('Sheet1 3'!E34,Sheet2!E:E,0))),\"\")","v":"USA"},null,5,43549.343243750001]
[{"$f":"IFERROR(IF(E35=\"\",\"\",INDEX(Sheet2!A:A,MATCH('Sheet1 3'!E35,Sheet2!E:E,0))),\"\")","v":"Jobs"},{"$f":"IFERROR(IF(E35=\"\",\"\",INDEX(Sheet2!B:B,MATCH('Sheet1 3'!E35,Sheet2!E:E,0))),\"\")","v":"Steve"},{"$f":"IFERROR(IF(E35=\"\",\"\",INDEX(Sheet2!D:D,MATCH('Sheet1 3'!E35,Sheet2!E:E,0))),\"\")","v":"USA"},null,5,43549.343243750001]
[{"$f":"IFERROR(IF(E36=\"\",\"\",INDEX(Sheet2!A:A,MATCH('Sheet1 3'!E36,Sheet2!E:E,0))),\"\")","v":"Jobs"},{"$f":"IFERROR(IF(E36=\"\",\"\",INDEX(Sheet2!B:B,MATCH('Sheet1 3'!E36,Sheet2!E:E,0))),\"\")","v":"Steve"},{"$f":"IFERROR(IF(E36=\"\",\"\",INDEX(Sheet2!D:D,MATCH('Sheet1 3'!E36,Sheet2!E:E,0))),\"\")","v":"USA"},null,5,43549.343243750001]
[{"$f":"IFERROR(IF(E37=\"\",\"\",INDEX(Sheet2!A:A,MATCH('Sheet1 3'!E37,Sheet2!E:E,0))),\"\")","v":""},{"$f":"IFERROR(IF(E37=\"\",\"\",INDEX(Sheet2!B:B,MATCH('Sheet1 3'!E37,Sheet2!E:E,0))),\"\")","v":""},{"$f":"IFERROR(IF(E37=\"\",\"\",INDEX(Sheet2!D:D,MATCH('Sheet1 3'!E37,Sheet2!E:E,0))),\"\")","v":""},null,null,""]
[{"$f":"IFERROR(IF(E38=\"\",\"\",INDEX(Sheet2!A:A,MATCH('Sheet1 3'!E38,Sheet2!E:E,0))),\"\")","v":""},{"$f":"IFERROR(IF(E38=\"\",\"\",INDEX(Sheet2!B:B,MATCH('Sheet1 3'!E38,Sheet2!E:E,0))),\"\")","v":""},{"$f":"IFERROR(IF(E38=\"\",\"\",INDEX(Sheet2!D:D,MATCH('Sheet1 3'!E38,Sheet2!E:E,0))),\"\")","v":""},null,null,""]
[{"$f":"IFERROR(IF(E39=\"\",\"\",INDEX(Sheet2!A:A,MATCH('Sheet1 3'!E39,Sheet2!E:E,0))),\"\")","v":""},{"$f":"IFERROR(IF(E39=\"\",\"\",INDEX(Sheet2!B:B,MATCH('Sheet1 3'!E39,Sheet2!E:E,0))),\"\")","v":""},{"$f":"IFERROR(IF(E39=\"\",\"\",INDEX(Sheet2!D:D,MATCH('Sheet1 3'!E39,Sheet2!E:E,0))),\"\")","v":""},null,null,""]
[{"$f":"IFERROR(IF(E40=\"\",\"\",INDEX(Sheet2!A:A,MATCH('Sheet1 3'!E40,Sheet2!E:E,0))),\"\")","v":""},{"$f":"IFERROR(IF(E40=\"\",\"\",INDEX(Sheet2!B:B,MATCH('Sheet1 3'!E40,Sheet2!E:E,0))),\"\")","v":""},{"$f":"IFERROR(IF(E40=\"\",\"\",INDEX(Sheet2!D:D,MATCH('Sheet1 3'!E40,Sheet2!E:E,0))),\"\")","v":""},null,null,""]
[{"$f":"IFERROR(IF(E41=\"\",\"\",INDEX(Sheet2!A:A,MATCH('Sheet1 3'!E41,Sheet2!E:E,0))),\"\")","v":""},{"$f":"IFERROR(IF(E41=\"\",\"\",INDEX(Sheet2!B:B,MATCH('Sheet1 3'!E41,Sheet2!E:E,0))),\"\")","v":""},{"$f":"IFERROR(IF(E41=\"\",\"\",INDEX(Sheet2!D:D,MATCH('Sheet1 3'!E41,Sheet2!E:E,0))),\"\")","v":""},null,null,""]
[{"$f":"IFERROR(IF(E42=\"\",\"\",INDEX(Sheet2!A:A,MATCH('Sheet1 3'!E42,Sheet2!E:E,0))),\"\")","v":""},{"$f":"IFERROR(IF(E42=\"\",\"\",INDEX(Sheet2!B:B,MATCH('Sheet1 3'!E42,Sheet2!E:E,0))),\"\")","v":""},{"$f":"IFERROR(IF(E42=\"\",\"\",INDEX(Sheet2!D:D,MATCH('Sheet1 3'!E42,Sheet2!E:E,0))),\"\")","v":""},null,null,""]
[{"$f":"IFERROR(IF(E43=\"\",\"\",INDEX(Sheet2!A:A,MATCH('Sheet1 3'!E43,Sheet2!E:E,0))),\"\")","v":""},{"$f":"IFERROR(IF(E43=\"\",\"\",INDEX(Sheet2!B:B,MATCH('Sheet1 3'!E43,Sheet2!E:E,0))),\"\")","v":""}]