{"text_format":"1","workbook":"xlsx","n_sheets":3,"sheets":["Sheet1","Sheet2","Sheet1 3"],"not_rendered":{"charts":0,"images":0,"macros":1,"external_links":0,"defined_names":3,"comments":0,"pivot_tables":0},"unopened":[],"bounds":{"document_bytes":16777216,"sheet_cells":100000,"rows_first":2000,"rows_last":500,"rows_between":2000,"halvings":0,"cell_chars":16384,"cell_head_chars":4096},"cells_cut":0,"cells_raw":0,"read":"whole","date_system":"1900"}

{"sheet":"Sheet1","index":0,"n_rows":39,"n_cols":10,"rows_kept":39,"cut":false,"hidden":false,"merged":[]}
["Last name","First name","Organization","Card number","Time","POB",{"$f":"SUMPRODUCT(--(LEN(TRIM(D1:D1))>0))-1","v":0}]
[{"$f":"IFERROR(IF(INDEX($D:$D,ROW())=\"\",\"\",INDEX(Sheet2!A:A,MATCH(INDEX($D:$D,ROW()),Sheet2!$E$1:$E$999,0))),\"\")","v":"Columbus"},{"$f":"IFERROR(IF(INDEX($D:$D,ROW())=\"\",\"\",INDEX(Sheet2!B:B,MATCH(INDEX($D:$D,ROW()),Sheet2!$E$1:$E$999,0))),\"\")","v":"Christopher"},{"$f":"IFERROR(IF(INDEX($D:$D,ROW())=\"\",\"\",INDEX(Sheet2!D:D,MATCH(INDEX($D:$D,ROW()),Sheet2!$E$1:$E$999,0))),\"\")","v":"Italia"},9,{"$f":"IF(D2<>\"\",IF(E2=\"\",NOW(),E2),\"\")","v":43545.244724999997}]
[{"$f":"IFERROR(IF(INDEX($D:$D,ROW())=\"\",\"\",INDEX(Sheet2!A:A,MATCH(INDEX($D:$D,ROW()),Sheet2!$E$1:$E$999,0))),\"\")","v":"Thatcher"},{"$f":"IFERROR(IF(INDEX($D:$D,ROW())=\"\",\"\",INDEX(Sheet2!B:B,MATCH(INDEX($D:$D,ROW()),Sheet2!$E$1:$E$999,0))),\"\")","v":"Margaret"},{"$f":"IFERROR(IF(INDEX($D:$D,ROW())=\"\",\"\",INDEX(Sheet2!D:D,MATCH(INDEX($D:$D,ROW()),Sheet2!$E$1:$E$999,0))),\"\")","v":"Britain"},8,43545.244746412034]
[{"$f":"IFERROR(IF(INDEX($D:$D,ROW())=\"\",\"\",INDEX(Sheet2!A:A,MATCH(INDEX($D:$D,ROW()),Sheet2!$E$1:$E$999,0))),\"\")","v":"Ali"},{"$f":"IFERROR(IF(INDEX($D:$D,ROW())=\"\",\"\",INDEX(Sheet2!B:B,MATCH(INDEX($D:$D,ROW()),Sheet2!$E$1:$E$999,0))),\"\")","v":"Muhammad"},{"$f":"IFERROR(IF(INDEX($D:$D,ROW())=\"\",\"\",INDEX(Sheet2!D:D,MATCH(INDEX($D:$D,ROW()),Sheet2!$E$1:$E$999,0))),\"\")","v":"USA"},6,43545.244751851853]
[{"$f":"IFERROR(IF(INDEX($D:$D,ROW())=\"\",\"\",INDEX(Sheet2!A:A,MATCH(INDEX($D:$D,ROW()),Sheet2!$E$1:$E$999,0))),\"\")","v":"Gandhi"},{"$f":"IFERROR(IF(INDEX($D:$D,ROW())=\"\",\"\",INDEX(Sheet2!B:B,MATCH(INDEX($D:$D,ROW()),Sheet2!$E$1:$E$999,0))),\"\")","v":"Mahatma"},{"$f":"IFERROR(IF(INDEX($D:$D,ROW())=\"\",\"\",INDEX(Sheet2!D:D,MATCH(INDEX($D:$D,ROW()),Sheet2!$E$1:$E$999,0))),\"\")","v":"India"},7,43545.244758680557]
[{"$f":"IFERROR(IF(INDEX($D:$D,ROW())=\"\",\"\",INDEX(Sheet2!A:A,MATCH(INDEX($D:$D,ROW()),Sheet2!$E$1:$E$999,0))),\"\")","v":"Gates"},{"$f":"IFERROR(IF(INDEX($D:$D,ROW())=\"\",\"\",INDEX(Sheet2!B:B,MATCH(INDEX($D:$D,ROW()),Sheet2!$E$1:$E$999,0))),\"\")","v":"Bill"},{"$f":"IFERROR(IF(INDEX($D:$D,ROW())=\"\",\"\",INDEX(Sheet2!D:D,MATCH(INDEX($D:$D,ROW()),Sheet2!$E$1:$E$999,0))),\"\")","v":"USA"},3,43545.244785069444,null,null,null,1,43545.244288310183]
[{"$f":"IFERROR(IF(INDEX($D:$D,ROW())=\"\",\"\",INDEX(Sheet2!A:A,MATCH(INDEX($D:$D,ROW()),Sheet2!$E$1:$E$999,0))),\"\")","v":"Jobs"},{"$f":"IFERROR(IF(INDEX($D:$D,ROW())=\"\",\"\",INDEX(Sheet2!B:B,MATCH(INDEX($D:$D,ROW()),Sheet2!$E$1:$E$999,0))),\"\")","v":"Steve"},{"$f":"IFERROR(IF(INDEX($D:$D,ROW())=\"\",\"\",INDEX(Sheet2!D:D,MATCH(INDEX($D:$D,ROW()),Sheet2!$E$1:$E$999,0))),\"\")","v":"USA"},5,43545.244792939811,null,null,null,1,43545.244288310183]
[{"$f":"IFERROR(IF(INDEX($D:$D,ROW())=\"\",\"\",INDEX(Sheet2!A:A,MATCH(INDEX($D:$D,ROW()),Sheet2!$E$1:$E$999,0))),\"\")","v":"Lincoln"},{"$f":"IFERROR(IF(INDEX($D:$D,ROW())=\"\",\"\",INDEX(Sheet2!B:B,MATCH(INDEX($D:$D,ROW()),Sheet2!$E$1:$E$999,0))),\"\")","v":"Abraham"},{"$f":"IFERROR(IF(INDEX($D:$D,ROW())=\"\",\"\",INDEX(Sheet2!D:D,MATCH(INDEX($D:$D,ROW()),Sheet2!$E$1:$E$999,0))),\"\")","v":"USA"},2,43545.24480763889,null,null,null,1,43545.244288310183]
[{"$f":"IFERROR(IF(INDEX($D:$D,ROW())=\"\",\"\",INDEX(Sheet2!A:A,MATCH(INDEX($D:$D,ROW()),Sheet2!$E$1:$E$999,0))),\"\")","v":"Jackson"},{"$f":"IFERROR(IF(INDEX($D:$D,ROW())=\"\",\"\",INDEX(Sheet2!B:B,MATCH(INDEX($D:$D,ROW()),Sheet2!$E$1:$E$999,0))),\"\")","v":"Michael"},{"$f":"IFERROR(IF(INDEX($D:$D,ROW())=\"\",\"\",INDEX(Sheet2!D:D,MATCH(INDEX($D:$D,ROW()),Sheet2!$E$1:$E$999,0))),\"\")","v":"USA"},1,43545.244824189816,null,null,null,5,43545.244482523151]
[{"$f":"IFERROR(IF(INDEX($D:$D,ROW())=\"\",\"\",INDEX(Sheet2!A:A,MATCH(INDEX($D:$D,ROW()),Sheet2!$E$1:$E$999,0))),\"\")","v":"Presley"},{"$f":"IFERROR(IF(INDEX($D:$D,ROW())=\"\",\"\",INDEX(Sheet2!B:B,MATCH(INDEX($D:$D,ROW()),Sheet2!$E$1:$E$999,0))),\"\")","v":"Elvis"},{"$f":"IFERROR(IF(INDEX($D:$D,ROW())=\"\",\"\",INDEX(Sheet2!D:D,MATCH(INDEX($D:$D,ROW()),Sheet2!$E$1:$E$999,0))),\"\")","v":"USA"},4,43545.244849537034,null,null,null,4,43545.244492824073]
[{"$f":"IFERROR(IF(INDEX($D:$D,ROW())=\"\",\"\",INDEX(Sheet2!A:A,MATCH(INDEX($D:$D,ROW()),Sheet2!$E$1:$E$999,0))),\"\")","v":"Darwin"},{"$f":"IFERROR(IF(INDEX($D:$D,ROW())=\"\",\"\",INDEX(Sheet2!B:B,MATCH(INDEX($D:$D,ROW()),Sheet2!$E$1:$E$999,0))),\"\")","v":"Charles"},{"$f":"IFERROR(IF(INDEX($D:$D,ROW())=\"\",\"\",INDEX(Sheet2!D:D,MATCH(INDEX($D:$D,ROW()),Sheet2!$E$1:$E$999,0))),\"\")","v":"UK"},10,43545.244858564816,null,null,null,6,43545.244508217591]
[{"$f":"IFERROR(IF(INDEX($D:$D,ROW())=\"\",\"\",INDEX(Sheet2!A:A,MATCH(INDEX($D:$D,ROW()),Sheet2!$E$1:$E$999,0))),\"\")","v":""},{"$f":"IFERROR(IF(INDEX($D:$D,ROW())=\"\",\"\",INDEX(Sheet2!B:B,MATCH(INDEX($D:$D,ROW()),Sheet2!$E$1:$E$999,0))),\"\")","v":""},{"$f":"IFERROR(IF(INDEX($D:$D,ROW())=\"\",\"\",INDEX(Sheet2!D:D,MATCH(INDEX($D:$D,ROW()),Sheet2!$E$1:$E$999,0))),\"\")","v":""},null,null,null,null,null,6,43545.24451261574]
[{"$f":"IFERROR(IF(INDEX($D:$D,ROW())=\"\",\"\",INDEX(Sheet2!A:A,MATCH(INDEX($D:$D,ROW()),Sheet2!$E$1:$E$999,0))),\"\")","v":""},{"$f":"IFERROR(IF(INDEX($D:$D,ROW())=\"\",\"\",INDEX(Sheet2!B:B,MATCH(INDEX($D:$D,ROW()),Sheet2!$E$1:$E$999,0))),\"\")","v":""},{"$f":"IFERROR(IF(INDEX($D:$D,ROW())=\"\",\"\",INDEX(Sheet2!D:D,MATCH(INDEX($D:$D,ROW()),Sheet2!$E$1:$E$999,0))),\"\")","v":""},null,null,null,null,null,9,43545.244724999997]
[{"$f":"IFERROR(IF(INDEX($D:$D,ROW())=\"\",\"\",INDEX(Sheet2!A:A,MATCH(INDEX($D:$D,ROW()),Sheet2!$E$1:$E$999,0))),\"\")","v":""},{"$f":"IFERROR(IF(INDEX($D:$D,ROW())=\"\",\"\",INDEX(Sheet2!B:B,MATCH(INDEX($D:$D,ROW()),Sheet2!$E$1:$E$999,0))),\"\")","v":""},{"$f":"IFERROR(IF(INDEX($D:$D,ROW())=\"\",\"\",INDEX(Sheet2!D:D,MATCH(INDEX($D:$D,ROW()),Sheet2!$E$1:$E$999,0))),\"\")","v":""},null,null,null,null,null,8,43545.244746412034]
[{"$f":"IFERROR(IF(INDEX($D:$D,ROW())=\"\",\"\",INDEX(Sheet2!A:A,MATCH(INDEX($D:$D,ROW()),Sheet2!$E$1:$E$999,0))),\"\")","v":""},{"$f":"IFERROR(IF(INDEX($D:$D,ROW())=\"\",\"\",INDEX(Sheet2!B:B,MATCH(INDEX($D:$D,ROW()),Sheet2!$E$1:$E$999,0))),\"\")","v":""},{"$f":"IFERROR(IF(INDEX($D:$D,ROW())=\"\",\"\",INDEX(Sheet2!D:D,MATCH(INDEX($D:$D,ROW()),Sheet2!$E$1:$E$999,0))),\"\")","v":""},null,null,null,null,null,6,43545.244751851853]
[{"$f":"IFERROR(IF(INDEX($D:$D,ROW())=\"\",\"\",INDEX(Sheet2!A:A,MATCH(INDEX($D:$D,ROW()),Sheet2!$E$1:$E$999,0))),\"\")","v":""},{"$f":"IFERROR(IF(INDEX($D:$D,ROW())=\"\",\"\",INDEX(Sheet2!B:B,MATCH(INDEX($D:$D,ROW()),Sheet2!$E$1:$E$999,0))),\"\")","v":""},{"$f":"IFERROR(IF(INDEX($D:$D,ROW())=\"\",\"\",INDEX(Sheet2!D:D,MATCH(INDEX($D:$D,ROW()),Sheet2!$E$1:$E$999,0))),\"\")","v":""},null,null,null,null,null,7,43545.244758680557]
[{"$f":"IFERROR(IF(INDEX($D:$D,ROW())=\"\",\"\",INDEX(Sheet2!A:A,MATCH(INDEX($D:$D,ROW()),Sheet2!$E$1:$E$999,0))),\"\")","v":""},{"$f":"IFERROR(IF(INDEX($D:$D,ROW())=\"\",\"\",INDEX(Sheet2!B:B,MATCH(INDEX($D:$D,ROW()),Sheet2!$E$1:$E$999,0))),\"\")","v":""},{"$f":"IFERROR(IF(INDEX($D:$D,ROW())=\"\",\"\",INDEX(Sheet2!D:D,MATCH(INDEX($D:$D,ROW()),Sheet2!$E$1:$E$999,0))),\"\")","v":""},null,null,null,null,null,5,43545.244765393516]
[{"$f":"IFERROR(IF(INDEX($D:$D,ROW())=\"\",\"\",INDEX(Sheet2!A:A,MATCH(INDEX($D:$D,ROW()),Sheet2!$E$1:$E$999,0))),\"\")","v":""},{"$f":"IFERROR(IF(INDEX($D:$D,ROW())=\"\",\"\",INDEX(Sheet2!B:B,MATCH(INDEX($D:$D,ROW()),Sheet2!$E$1:$E$999,0))),\"\")","v":""},{"$f":"IFERROR(IF(INDEX($D:$D,ROW())=\"\",\"\",INDEX(Sheet2!D:D,MATCH(INDEX($D:$D,ROW()),Sheet2!$E$1:$E$999,0))),\"\")","v":""},null,null,null,null,null,4,43545.24477222222]
[{"$f":"IFERROR(IF(INDEX($D:$D,ROW())=\"\",\"\",INDEX(Sheet2!A:A,MATCH(INDEX($D:$D,ROW()),Sheet2!$E$1:$E$999,0))),\"\")","v":""},{"$f":"IFERROR(IF(INDEX($D:$D,ROW())=\"\",\"\",INDEX(Sheet2!B:B,MATCH(INDEX($D:$D,ROW()),Sheet2!$E$1:$E$999,0))),\"\")","v":""},{"$f":"IFERROR(IF(INDEX($D:$D,ROW())=\"\",\"\",INDEX(Sheet2!D:D,MATCH(INDEX($D:$D,ROW()),Sheet2!$E$1:$E$999,0))),\"\")","v":""},null,null,null,null,null,6,43545.244778356478]
[{"$f":"IFERROR(IF(INDEX($D:$D,ROW())=\"\",\"\",INDEX(Sheet2!A:A,MATCH(INDEX($D:$D,ROW()),Sheet2!$E$1:$E$999,0))),\"\")","v":""},{"$f":"IFERROR(IF(INDEX($D:$D,ROW())=\"\",\"\",INDEX(Sheet2!B:B,MATCH(INDEX($D:$D,ROW()),Sheet2!$E$1:$E$999,0))),\"\")","v":""},{"$f":"IFERROR(IF(INDEX($D:$D,ROW())=\"\",\"\",INDEX(Sheet2!D:D,MATCH(INDEX($D:$D,ROW()),Sheet2!$E$1:$E$999,0))),\"\")","v":""},null,null,null,null,null,3,43545.244785069444]
[{"$f":"IFERROR(IF(INDEX($D:$D,ROW())=\"\",\"\",INDEX(Sheet2!A:A,MATCH(INDEX($D:$D,ROW()),Sheet2!$E$1:$E$999,0))),\"\")","v":""},{"$f":"IFERROR(IF(INDEX($D:$D,ROW())=\"\",\"\",INDEX(Sheet2!B:B,MATCH(INDEX($D:$D,ROW()),Sheet2!$E$1:$E$999,0))),\"\")","v":""},{"$f":"IFERROR(IF(INDEX($D:$D,ROW())=\"\",\"\",INDEX(Sheet2!D:D,MATCH(INDEX($D:$D,ROW()),Sheet2!$E$1:$E$999,0))),\"\")","v":""},null,null,null,null,null,5,43545.244792939811]
[{"$f":"IFERROR(IF(INDEX($D:$D,ROW())=\"\",\"\",INDEX(Sheet2!A:A,MATCH(INDEX($D:$D,ROW()),Sheet2!$E$1:$E$999,0))),\"\")","v":""},{"$f":"IFERROR(IF(INDEX($D:$D,ROW())=\"\",\"\",INDEX(Sheet2!B:B,MATCH(INDEX($D:$D,ROW()),Sheet2!$E$1:$E$999,0))),\"\")","v":""},{"$f":"IFERROR(IF(INDEX($D:$D,ROW())=\"\",\"\",INDEX(Sheet2!D:D,MATCH(INDEX($D:$D,ROW()),Sheet2!$E$1:$E$999,0))),\"\")","v":""},null,null,null,null,null,1,43545.24480104167]
[{"$f":"IFERROR(IF(INDEX($D:$D,ROW())=\"\",\"\",INDEX(Sheet2!A:A,MATCH(INDEX($D:$D,ROW()),Sheet2!$E$1:$E$999,0))),\"\")","v":""},{"$f":"IFERROR(IF(INDEX($D:$D,ROW())=\"\",\"\",INDEX(Sheet2!B:B,MATCH(INDEX($D:$D,ROW()),Sheet2!$E$1:$E$999,0))),\"\")","v":""},{"$f":"IFERROR(IF(INDEX($D:$D,ROW())=\"\",\"\",INDEX(Sheet2!D:D,MATCH(INDEX($D:$D,ROW()),Sheet2!$E$1:$E$999,0))),\"\")","v":""},null,null,null,null,null,2,43545.24480763889]
[{"$f":"IFERROR(IF(INDEX($D:$D,ROW())=\"\",\"\",INDEX(Sheet2!A:A,MATCH(INDEX($D:$D,ROW()),Sheet2!$E$1:$E$999,0))),\"\")","v":""},{"$f":"IFERROR(IF(INDEX($D:$D,ROW())=\"\",\"\",INDEX(Sheet2!B:B,MATCH(INDEX($D:$D,ROW()),Sheet2!$E$1:$E$999,0))),\"\")","v":""},{"$f":"IFERROR(IF(INDEX($D:$D,ROW())=\"\",\"\",INDEX(Sheet2!D:D,MATCH(INDEX($D:$D,ROW()),Sheet2!$E$1:$E$999,0))),\"\")","v":""},null,null,null,null,null,5,43545.244813310186]
[{"$f":"IFERROR(IF(INDEX($D:$D,ROW())=\"\",\"\",INDEX(Sheet2!A:A,MATCH(INDEX($D:$D,ROW()),Sheet2!$E$1:$E$999,0))),\"\")","v":""},{"$f":"IFERROR(IF(INDEX($D:$D,ROW())=\"\",\"\",INDEX(Sheet2!B:B,MATCH(INDEX($D:$D,ROW()),Sheet2!$E$1:$E$999,0))),\"\")","v":""},{"$f":"IFERROR(IF(INDEX($D:$D,ROW())=\"\",\"\",INDEX(Sheet2!D:D,MATCH(INDEX($D:$D,ROW()),Sheet2!$E$1:$E$999,0))),\"\")","v":""},null,null,null,null,null,8,43545.244818865744]
[{"$f":"IFERROR(IF(INDEX($D:$D,ROW())=\"\",\"\",INDEX(Sheet2!A:A,MATCH(INDEX($D:$D,ROW()),Sheet2!$E$1:$E$999,0))),\"\")","v":""},{"$f":"IFERROR(IF(INDEX($D:$D,ROW())=\"\",\"\",INDEX(Sheet2!B:B,MATCH(INDEX($D:$D,ROW()),Sheet2!$E$1:$E$999,0))),\"\")","v":""},{"$f":"IFERROR(IF(INDEX($D:$D,ROW())=\"\",\"\",INDEX(Sheet2!D:D,MATCH(INDEX($D:$D,ROW()),Sheet2!$E$1:$E$999,0))),\"\")","v":""},null,null,null,null,null,1,43545.244824189816]
[{"$f":"IFERROR(IF(INDEX($D:$D,ROW())=\"\",\"\",INDEX(Sheet2!A:A,MATCH(INDEX($D:$D,ROW()),Sheet2!$E$1:$E$999,0))),\"\")","v":""},{"$f":"IFERROR(IF(INDEX($D:$D,ROW())=\"\",\"\",INDEX(Sheet2!B:B,MATCH(INDEX($D:$D,ROW()),Sheet2!$E$1:$E$999,0))),\"\")","v":""},{"$f":"IFERROR(IF(INDEX($D:$D,ROW())=\"\",\"\",INDEX(Sheet2!D:D,MATCH(INDEX($D:$D,ROW()),Sheet2!$E$1:$E$999,0))),\"\")","v":""},null,null,null,null,null,2,43545.244879282407]
[{"$f":"IFERROR(IF(INDEX($D:$D,ROW())=\"\",\"\",INDEX(Sheet2!A:A,MATCH(INDEX($D:$D,ROW()),Sheet2!$E$1:$E$999,0))),\"\")","v":""},{"$f":"IFERROR(IF(INDEX($D:$D,ROW())=\"\",\"\",INDEX(Sheet2!B:B,MATCH(INDEX($D:$D,ROW()),Sheet2!$E$1:$E$999,0))),\"\")","v":""},{"$f":"IFERROR(IF(INDEX($D:$D,ROW())=\"\",\"\",INDEX(Sheet2!D:D,MATCH(INDEX($D:$D,ROW()),Sheet2!$E$1:$E$999,0))),\"\")","v":""},null,null,null,null,null,10,43545.244846180554]
[{"$f":"IFERROR(IF(INDEX($D:$D,ROW())=\"\",\"\",INDEX(Sheet2!A:A,MATCH(INDEX($D:$D,ROW()),Sheet2!$E$1:$E$999,0))),\"\")","v":""},{"$f":"IFERROR(IF(INDEX($D:$D,ROW())=\"\",\"\",INDEX(Sheet2!B:B,MATCH(INDEX($D:$D,ROW()),Sheet2!$E$1:$E$999,0))),\"\")","v":""},{"$f":"IFERROR(IF(INDEX($D:$D,ROW())=\"\",\"\",INDEX(Sheet2!D:D,MATCH(INDEX($D:$D,ROW()),Sheet2!$E$1:$E$999,0))),\"\")","v":""},null,null,null,null,null,4,43545.244849537034]
[{"$f":"IFERROR(IF(INDEX($D:$D,ROW())=\"\",\"\",INDEX(Sheet2!A:A,MATCH(INDEX($D:$D,ROW()),Sheet2!$E$1:$E$999,0))),\"\")","v":""},{"$f":"IFERROR(IF(INDEX($D:$D,ROW())=\"\",\"\",INDEX(Sheet2!B:B,MATCH(INDEX($D:$D,ROW()),Sheet2!$E$1:$E$999,0))),\"\")","v":""},{"$f":"IFERROR(IF(INDEX($D:$D,ROW())=\"\",\"\",INDEX(Sheet2!D:D,MATCH(INDEX($D:$D,ROW()),Sheet2!$E$1:$E$999,0))),\"\")","v":""},null,null,null,null,null,10,43545.24489710648]
[{"$f":"IFERROR(IF(INDEX($D:$D,ROW())=\"\",\"\",INDEX(Sheet2!A:A,MATCH(INDEX($D:$D,ROW()),Sheet2!$E$1:$E$999,0))),\"\")","v":""},{"$f":"IFERROR(IF(INDEX($D:$D,ROW())=\"\",\"\",INDEX(Sheet2!B:B,MATCH(INDEX($D:$D,ROW()),Sheet2!$E$1:$E$999,0))),\"\")","v":""},{"$f":"IFERROR(IF(INDEX($D:$D,ROW())=\"\",\"\",INDEX(Sheet2!D:D,MATCH(INDEX($D:$D,ROW()),Sheet2!$E$1:$E$999,0))),\"\")","v":""},null,null,null,null,null,10,43545.244858564816]
[{"$f":"IFERROR(IF(INDEX($D:$D,ROW())=\"\",\"\",INDEX(Sheet2!A:A,MATCH(INDEX($D:$D,ROW()),Sheet2!$E$1:$E$999,0))),\"\")","v":""},{"$f":"IFERROR(IF(INDEX($D:$D,ROW())=\"\",\"\",INDEX(Sheet2!B:B,MATCH(INDEX($D:$D,ROW()),Sheet2!$E$1:$E$999,0))),\"\")","v":""},{"$f":"IFERROR(IF(INDEX($D:$D,ROW())=\"\",\"\",INDEX(Sheet2!D:D,MATCH(INDEX($D:$D,ROW()),Sheet2!$E$1:$E$999,0))),\"\")","v":""}]
[{"$f":"IFERROR(IF(INDEX($D:$D,ROW())=\"\",\"\",INDEX(Sheet2!A:A,MATCH(INDEX($D:$D,ROW()),Sheet2!$E$1:$E$999,0))),\"\")","v":""},{"$f":"IFERROR(IF(INDEX($D:$D,ROW())=\"\",\"\",INDEX(Sheet2!B:B,MATCH(INDEX($D:$D,ROW()),Sheet2!$E$1:$E$999,0))),\"\")","v":""},{"$f":"IFERROR(IF(INDEX($D:$D,ROW())=\"\",\"\",INDEX(Sheet2!D:D,MATCH(INDEX($D:$D,ROW()),Sheet2!$E$1:$E$999,0))),\"\")","v":""}]
[{"$f":"IFERROR(IF(INDEX($D:$D,ROW())=\"\",\"\",INDEX(Sheet2!A:A,MATCH(INDEX($D:$D,ROW()),Sheet2!$E$1:$E$999,0))),\"\")","v":""},{"$f":"IFERROR(IF(INDEX($D:$D,ROW())=\"\",\"\",INDEX(Sheet2!B:B,MATCH(INDEX($D:$D,ROW()),Sheet2!$E$1:$E$999,0))),\"\")","v":""},{"$f":"IFERROR(IF(INDEX($D:$D,ROW())=\"\",\"\",INDEX(Sheet2!D:D,MATCH(INDEX($D:$D,ROW()),Sheet2!$E$1:$E$999,0))),\"\")","v":""}]
[{"$f":"IFERROR(IF(INDEX($D:$D,ROW())=\"\",\"\",INDEX(Sheet2!A:A,MATCH(INDEX($D:$D,ROW()),Sheet2!$E$1:$E$999,0))),\"\")","v":""},{"$f":"IFERROR(IF(INDEX($D:$D,ROW())=\"\",\"\",INDEX(Sheet2!B:B,MATCH(INDEX($D:$D,ROW()),Sheet2!$E$1:$E$999,0))),\"\")","v":""},{"$f":"IFERROR(IF(INDEX($D:$D,ROW())=\"\",\"\",INDEX(Sheet2!D:D,MATCH(INDEX($D:$D,ROW()),Sheet2!$E$1:$E$999,0))),\"\")","v":""}]
[{"$f":"IFERROR(IF(INDEX($D:$D,ROW())=\"\",\"\",INDEX(Sheet2!A:A,MATCH(INDEX($D:$D,ROW()),Sheet2!$E$1:$E$999,0))),\"\")","v":""},{"$f":"IFERROR(IF(INDEX($D:$D,ROW())=\"\",\"\",INDEX(Sheet2!B:B,MATCH(INDEX($D:$D,ROW()),Sheet2!$E$1:$E$999,0))),\"\")","v":""},{"$f":"IFERROR(IF(INDEX($D:$D,ROW())=\"\",\"\",INDEX(Sheet2!D:D,MATCH(INDEX($D:$D,ROW()),Sheet2!$E$1:$E$999,0))),\"\")","v":""}]
[{"$f":"IFERROR(IF(INDEX($D:$D,ROW())=\"\",\"\",INDEX(Sheet2!A:A,MATCH(INDEX($D:$D,ROW()),Sheet2!$E$1:$E$999,0))),\"\")","v":""},{"$f":"IFERROR(IF(INDEX($D:$D,ROW())=\"\",\"\",INDEX(Sheet2!B:B,MATCH(INDEX($D:$D,ROW()),Sheet2!$E$1:$E$999,0))),\"\")","v":""},{"$f":"IFERROR(IF(INDEX($D:$D,ROW())=\"\",\"\",INDEX(Sheet2!D:D,MATCH(INDEX($D:$D,ROW()),Sheet2!$E$1:$E$999,0))),\"\")","v":""}]
[{"$f":"IFERROR(IF(INDEX($D:$D,ROW())=\"\",\"\",INDEX(Sheet2!A:A,MATCH(INDEX($D:$D,ROW()),Sheet2!$E$1:$E$999,0))),\"\")","v":""},{"$f":"IFERROR(IF(INDEX($D:$D,ROW())=\"\",\"\",INDEX(Sheet2!B:B,MATCH(INDEX($D:$D,ROW()),Sheet2!$E$1:$E$999,0))),\"\")","v":""},{"$f":"IFERROR(IF(INDEX($D:$D,ROW())=\"\",\"\",INDEX(Sheet2!D:D,MATCH(INDEX($D:$D,ROW()),Sheet2!$E$1:$E$999,0))),\"\")","v":""}]
[{"$f":"IFERROR(IF(INDEX($D:$D,ROW())=\"\",\"\",INDEX(Sheet2!A:A,MATCH(INDEX($D:$D,ROW()),Sheet2!$E$1:$E$999,0))),\"\")","v":""},{"$f":"IFERROR(IF(INDEX($D:$D,ROW())=\"\",\"\",INDEX(Sheet2!B:B,MATCH(INDEX($D:$D,ROW()),Sheet2!$E$1:$E$999,0))),\"\")","v":""},{"$f":"IFERROR(IF(INDEX($D:$D,ROW())=\"\",\"\",INDEX(Sheet2!D:D,MATCH(INDEX($D:$D,ROW()),Sheet2!$E$1:$E$999,0))),\"\")","v":""}]

{"sheet":"Sheet2","index":1,"n_rows":11,"n_cols":5,"rows_kept":11,"cut":false,"hidden":false,"merged":[]}
["Last name","First name","Agency code","Organization","Card number"]
["Jackson","Michael",12345,"USA",1]
["Lincoln","Abraham",11111,"USA",2]
["Gates","Bill",22222,"USA",3]
["Presley","Elvis",33333,"USA",4]
["Jobs","Steve",44444,"USA",5]
["Ali","Muhammad",5555,"USA",6]
["Gandhi","Mahatma",6666,"India",7]
["Thatcher","Margaret",7777,"Britain",8]
["Columbus","Christopher",8888,"Italia",9]
["Darwin","Charles",9999,"UK",10]

{"sheet":"Sheet1 3","index":2,"n_rows":36,"n_cols":8,"rows_kept":36,"cut":false,"hidden":false,"merged":[]}
["Last name","First name","Organization","Total","Card number","Time","POB",{"$f":"SUMPRODUCT(--(LEN(TRIM(D1:D36))>0))-1","v":0}]
[{"$f":"IFERROR(IF(INDEX($E:$E,ROW())=\"\",\"\",INDEX(Sheet2!A:A,MATCH(INDEX($E:$E,ROW()),Sheet2!$E$1:$E$999,0))),\"\")","v":"Jackson"},{"$f":"IFERROR(IF(INDEX($E:$E,ROW())=\"\",\"\",INDEX(Sheet2!B:B,MATCH(INDEX($E:$E,ROW()),Sheet2!$E$1:$E$999,0))),\"\")","v":"Michael"},{"$f":"IFERROR(IF(INDEX($E:$E,ROW())=\"\",\"\",INDEX(Sheet2!D:D,MATCH(INDEX($E:$E,ROW()),Sheet2!$E$1:$E$999,0))),\"\")","v":"USA"},null,1,{"$f":"IF(E2<>\"\",IF(F2=\"\",NOW(),F2),\"\")","v":43545.244288310183}]
[{"$f":"IFERROR(IF(INDEX($E:$E,ROW())=\"\",\"\",INDEX(Sheet2!A:A,MATCH(INDEX($E:$E,ROW()),Sheet2!$E$1:$E$999,0))),\"\")","v":"Jackson"},{"$f":"IFERROR(IF(INDEX($E:$E,ROW())=\"\",\"\",INDEX(Sheet2!B:B,MATCH(INDEX($E:$E,ROW()),Sheet2!$E$1:$E$999,0))),\"\")","v":"Michael"},{"$f":"IFERROR(IF(INDEX($E:$E,ROW())=\"\",\"\",INDEX(Sheet2!D:D,MATCH(INDEX($E:$E,ROW()),Sheet2!$E$1:$E$999,0))),\"\")","v":"USA"},null,1,{"$f":"IF(E3<>\"\",IF(F3=\"\",NOW(),F3),\"\")","v":43545.244288310183}]
[{"$f":"IFERROR(IF(INDEX($E:$E,ROW())=\"\",\"\",INDEX(Sheet2!A:A,MATCH(INDEX($E:$E,ROW()),Sheet2!$E$1:$E$999,0))),\"\")","v":"Jackson"},{"$f":"IFERROR(IF(INDEX($E:$E,ROW())=\"\",\"\",INDEX(Sheet2!B:B,MATCH(INDEX($E:$E,ROW()),Sheet2!$E$1:$E$999,0))),\"\")","v":"Michael"},{"$f":"IFERROR(IF(INDEX($E:$E,ROW())=\"\",\"\",INDEX(Sheet2!D:D,MATCH(INDEX($E:$E,ROW()),Sheet2!$E$1:$E$999,0))),\"\")","v":"USA"},null,1,43545.244288310183]
[{"$f":"IFERROR(IF(INDEX($E:$E,ROW())=\"\",\"\",INDEX(Sheet2!A:A,MATCH(INDEX($E:$E,ROW()),Sheet2!$E$1:$E$999,0))),\"\")","v":"Jobs"},{"$f":"IFERROR(IF(INDEX($E:$E,ROW())=\"\",\"\",INDEX(Sheet2!B:B,MATCH(INDEX($E:$E,ROW()),Sheet2!$E$1:$E$999,0))),\"\")","v":"Steve"},{"$f":"IFERROR(IF(INDEX($E:$E,ROW())=\"\",\"\",INDEX(Sheet2!D:D,MATCH(INDEX($E:$E,ROW()),Sheet2!$E$1:$E$999,0))),\"\")","v":"USA"},null,5,43545.244482523151]
[{"$f":"IFERROR(IF(INDEX($E:$E,ROW())=\"\",\"\",INDEX(Sheet2!A:A,MATCH(INDEX($E:$E,ROW()),Sheet2!$E$1:$E$999,0))),\"\")","v":"Presley"},{"$f":"IFERROR(IF(INDEX($E:$E,ROW())=\"\",\"\",INDEX(Sheet2!B:B,MATCH(INDEX($E:$E,ROW()),Sheet2!$E$1:$E$999,0))),\"\")","v":"Elvis"},{"$f":"IFERROR(IF(INDEX($E:$E,ROW())=\"\",\"\",INDEX(Sheet2!D:D,MATCH(INDEX($E:$E,ROW()),Sheet2!$E$1:$E$999,0))),\"\")","v":"USA"},null,4,43545.244492824073]
[{"$f":"IFERROR(IF(INDEX($E:$E,ROW())=\"\",\"\",INDEX(Sheet2!A:A,MATCH(INDEX($E:$E,ROW()),Sheet2!$E$1:$E$999,0))),\"\")","v":"Ali"},{"$f":"IFERROR(IF(INDEX($E:$E,ROW())=\"\",\"\",INDEX(Sheet2!B:B,MATCH(INDEX($E:$E,ROW()),Sheet2!$E$1:$E$999,0))),\"\")","v":"Muhammad"},{"$f":"IFERROR(IF(INDEX($E:$E,ROW())=\"\",\"\",INDEX(Sheet2!D:D,MATCH(INDEX($E:$E,ROW()),Sheet2!$E$1:$E$999,0))),\"\")","v":"USA"},null,6,43545.244508217591]
[{"$f":"IFERROR(IF(INDEX($E:$E,ROW())=\"\",\"\",INDEX(Sheet2!A:A,MATCH(INDEX($E:$E,ROW()),Sheet2!$E$1:$E$999,0))),\"\")","v":"Ali"},{"$f":"IFERROR(IF(INDEX($E:$E,ROW())=\"\",\"\",INDEX(Sheet2!B:B,MATCH(INDEX($E:$E,ROW()),Sheet2!$E$1:$E$999,0))),\"\")","v":"Muhammad"},{"$f":"IFERROR(IF(INDEX($E:$E,ROW())=\"\",\"\",INDEX(Sheet2!D:D,MATCH(INDEX($E:$E,ROW()),Sheet2!$E$1:$E$999,0))),\"\")","v":"USA"},null,6,43545.24451261574]
[{"$f":"IFERROR(IF(INDEX($E:$E,ROW())=\"\",\"\",INDEX(Sheet2!A:A,MATCH(INDEX($E:$E,ROW()),Sheet2!$E$1:$E$999,0))),\"\")","v":"Columbus"},{"$f":"IFERROR(IF(INDEX($E:$E,ROW())=\"\",\"\",INDEX(Sheet2!B:B,MATCH(INDEX($E:$E,ROW()),Sheet2!$E$1:$E$999,0))),\"\")","v":"Christopher"},{"$f":"IFERROR(IF(INDEX($E:$E,ROW())=\"\",\"\",INDEX(Sheet2!D:D,MATCH(INDEX($E:$E,ROW()),Sheet2!$E$1:$E$999,0))),\"\")","v":"Italia"},null,9,43545.244724999997]
[{"$f":"IFERROR(IF(INDEX($E:$E,ROW())=\"\",\"\",INDEX(Sheet2!A:A,MATCH(INDEX($E:$E,ROW()),Sheet2!$E$1:$E$999,0))),\"\")","v":"Thatcher"},{"$f":"IFERROR(IF(INDEX($E:$E,ROW())=\"\",\"\",INDEX(Sheet2!B:B,MATCH(INDEX($E:$E,ROW()),Sheet2!$E$1:$E$999,0))),\"\")","v":"Margaret"},{"$f":"IFERROR(IF(INDEX($E:$E,ROW())=\"\",\"\",INDEX(Sheet2!D:D,MATCH(INDEX($E:$E,ROW()),Sheet2!$E$1:$E$999,0))),\"\")","v":"Britain"},null,8,43545.244746412034]
[{"$f":"IFERROR(IF(INDEX($E:$E,ROW())=\"\",\"\",INDEX(Sheet2!A:A,MATCH(INDEX($E:$E,ROW()),Sheet2!$E$1:$E$999,0))),\"\")","v":"Ali"},{"$f":"IFERROR(IF(INDEX($E:$E,ROW())=\"\",\"\",INDEX(Sheet2!B:B,MATCH(INDEX($E:$E,ROW()),Sheet2!$E$1:$E$999,0))),\"\")","v":"Muhammad"},{"$f":"IFERROR(IF(INDEX($E:$E,ROW())=\"\",\"\",INDEX(Sheet2!D:D,MATCH(INDEX($E:$E,ROW()),Sheet2!$E$1:$E$999,0))),\"\")","v":"USA"},null,6,43545.244751851853]
[{"$f":"IFERROR(IF(INDEX($E:$E,ROW())=\"\",\"\",INDEX(Sheet2!A:A,MATCH(INDEX($E:$E,ROW()),Sheet2!$E$1:$E$999,0))),\"\")","v":"Gandhi"},{"$f":"IFERROR(IF(INDEX($E:$E,ROW())=\"\",\"\",INDEX(Sheet2!B:B,MATCH(INDEX($E:$E,ROW()),Sheet2!$E$1:$E$999,0))),\"\")","v":"Mahatma"},{"$f":"IFERROR(IF(INDEX($E:$E,ROW())=\"\",\"\",INDEX(Sheet2!D:D,MATCH(INDEX($E:$E,ROW()),Sheet2!$E$1:$E$999,0))),\"\")","v":"India"},null,7,43545.244758680557]
[{"$f":"IFERROR(IF(INDEX($E:$E,ROW())=\"\",\"\",INDEX(Sheet2!A:A,MATCH(INDEX($E:$E,ROW()),Sheet2!$E$1:$E$999,0))),\"\")","v":"Jobs"},{"$f":"IFERROR(IF(INDEX($E:$E,ROW())=\"\",\"\",INDEX(Sheet2!B:B,MATCH(INDEX($E:$E,ROW()),Sheet2!$E$1:$E$999,0))),\"\")","v":"Steve"},{"$f":"IFERROR(IF(INDEX($E:$E,ROW())=\"\",\"\",INDEX(Sheet2!D:D,MATCH(INDEX($E:$E,ROW()),Sheet2!$E$1:$E$999,0))),\"\")","v":"USA"},null,5,43545.244765393516]
[{"$f":"IFERROR(IF(INDEX($E:$E,ROW())=\"\",\"\",INDEX(Sheet2!A:A,MATCH(INDEX($E:$E,ROW()),Sheet2!$E$1:$E$999,0))),\"\")","v":"Presley"},{"$f":"IFERROR(IF(INDEX($E:$E,ROW())=\"\",\"\",INDEX(Sheet2!B:B,MATCH(INDEX($E:$E,ROW()),Sheet2!$E$1:$E$999,0))),\"\")","v":"Elvis"},{"$f":"IFERROR(IF(INDEX($E:$E,ROW())=\"\",\"\",INDEX(Sheet2!D:D,MATCH(INDEX($E:$E,ROW()),Sheet2!$E$1:$E$999,0))),\"\")","v":"USA"},null,4,43545.24477222222]
[{"$f":"IFERROR(IF(INDEX($E:$E,ROW())=\"\",\"\",INDEX(Sheet2!A:A,MATCH(INDEX($E:$E,ROW()),Sheet2!$E$1:$E$999,0))),\"\")","v":"Ali"},{"$f":"IFERROR(IF(INDEX($E:$E,ROW())=\"\",\"\",INDEX(Sheet2!B:B,MATCH(INDEX($E:$E,ROW()),Sheet2!$E$1:$E$999,0))),\"\")","v":"Muhammad"},{"$f":"IFERROR(IF(INDEX($E:$E,ROW())=\"\",\"\",INDEX(Sheet2!D:D,MATCH(INDEX($E:$E,ROW()),Sheet2!$E$1:$E$999,0))),\"\")","v":"USA"},null,6,43545.244778356478]
[{"$f":"IFERROR(IF(INDEX($E:$E,ROW())=\"\",\"\",INDEX(Sheet2!A:A,MATCH(INDEX($E:$E,ROW()),Sheet2!$E$1:$E$999,0))),\"\")","v":"Gates"},{"$f":"IFERROR(IF(INDEX($E:$E,ROW())=\"\",\"\",INDEX(Sheet2!B:B,MATCH(INDEX($E:$E,ROW()),Sheet2!$E$1:$E$999,0))),\"\")","v":"Bill"},{"$f":"IFERROR(IF(INDEX($E:$E,ROW())=\"\",\"\",INDEX(Sheet2!D:D,MATCH(INDEX($E:$E,ROW()),Sheet2!$E$1:$E$999,0))),\"\")","v":"USA"},null,3,43545.244785069444]
[{"$f":"IFERROR(IF(INDEX($E:$E,ROW())=\"\",\"\",INDEX(Sheet2!A:A,MATCH(INDEX($E:$E,ROW()),Sheet2!$E$1:$E$999,0))),\"\")","v":"Jobs"},{"$f":"IFERROR(IF(INDEX($E:$E,ROW())=\"\",\"\",INDEX(Sheet2!B:B,MATCH(INDEX($E:$E,ROW()),Sheet2!$E$1:$E$999,0))),\"\")","v":"Steve"},{"$f":"IFERROR(IF(INDEX($E:$E,ROW())=\"\",\"\",INDEX(Sheet2!D:D,MATCH(INDEX($E:$E,ROW()),Sheet2!$E$1:$E$999,0))),\"\")","v":"USA"},null,5,43545.244792939811]
[{"$f":"IFERROR(IF(INDEX($E:$E,ROW())=\"\",\"\",INDEX(Sheet2!A:A,MATCH(INDEX($E:$E,ROW()),Sheet2!$E$1:$E$999,0))),\"\")","v":"Jackson"},{"$f":"IFERROR(IF(INDEX($E:$E,ROW())=\"\",\"\",INDEX(Sheet2!B:B,MATCH(INDEX($E:$E,ROW()),Sheet2!$E$1:$E$999,0))),\"\")","v":"Michael"},{"$f":"IFERROR(IF(INDEX($E:$E,ROW())=\"\",\"\",INDEX(Sheet2!D:D,MATCH(INDEX($E:$E,ROW()),Sheet2!$E$1:$E$999,0))),\"\")","v":"USA"},null,1,43545.24480104167]
[{"$f":"IFERROR(IF(INDEX($E:$E,ROW())=\"\",\"\",INDEX(Sheet2!A:A,MATCH(INDEX($E:$E,ROW()),Sheet2!$E$1:$E$999,0))),\"\")","v":"Lincoln"},{"$f":"IFERROR(IF(INDEX($E:$E,ROW())=\"\",\"\",INDEX(Sheet2!B:B,MATCH(INDEX($E:$E,ROW()),Sheet2!$E$1:$E$999,0))),\"\")","v":"Abraham"},{"$f":"IFERROR(IF(INDEX($E:$E,ROW())=\"\",\"\",INDEX(Sheet2!D:D,MATCH(INDEX($E:$E,ROW()),Sheet2!$E$1:$E$999,0))),\"\")","v":"USA"},null,2,43545.24480763889]
[{"$f":"IFERROR(IF(INDEX($E:$E,ROW())=\"\",\"\",INDEX(Sheet2!A:A,MATCH(INDEX($E:$E,ROW()),Sheet2!$E$1:$E$999,0))),\"\")","v":"Jobs"},{"$f":"IFERROR(IF(INDEX($E:$E,ROW())=\"\",\"\",INDEX(Sheet2!B:B,MATCH(INDEX($E:$E,ROW()),Sheet2!$E$1:$E$999,0))),\"\")","v":"Steve"},{"$f":"IFERROR(IF(INDEX($E:$E,ROW())=\"\",\"\",INDEX(Sheet2!D:D,MATCH(INDEX($E:$E,ROW()),Sheet2!$E$1:$E$999,0))),\"\")","v":"USA"},null,5,43545.244813310186]
[{"$f":"IFERROR(IF(INDEX($E:$E,ROW())=\"\",\"\",INDEX(Sheet2!A:A,MATCH(INDEX($E:$E,ROW()),Sheet2!$E$1:$E$999,0))),\"\")","v":"Thatcher"},{"$f":"IFERROR(IF(INDEX($E:$E,ROW())=\"\",\"\",INDEX(Sheet2!B:B,MATCH(INDEX($E:$E,ROW()),Sheet2!$E$1:$E$999,0))),\"\")","v":"Margaret"},{"$f":"IFERROR(IF(INDEX($E:$E,ROW())=\"\",\"\",INDEX(Sheet2!D:D,MATCH(INDEX($E:$E,ROW()),Sheet2!$E$1:$E$999,0))),\"\")","v":"Britain"},null,8,43545.244818865744]
[{"$f":"IFERROR(IF(INDEX($E:$E,ROW())=\"\",\"\",INDEX(Sheet2!A:A,MATCH(INDEX($E:$E,ROW()),Sheet2!$E$1:$E$999,0))),\"\")","v":"Jackson"},{"$f":"IFERROR(IF(INDEX($E:$E,ROW())=\"\",\"\",INDEX(Sheet2!B:B,MATCH(INDEX($E:$E,ROW()),Sheet2!$E$1:$E$999,0))),\"\")","v":"Michael"},{"$f":"IFERROR(IF(INDEX($E:$E,ROW())=\"\",\"\",INDEX(Sheet2!D:D,MATCH(INDEX($E:$E,ROW()),Sheet2!$E$1:$E$999,0))),\"\")","v":"USA"},null,1,43545.244824189816]
[{"$f":"IFERROR(IF(INDEX($E:$E,ROW())=\"\",\"\",INDEX(Sheet2!A:A,MATCH(INDEX($E:$E,ROW()),Sheet2!$E$1:$E$999,0))),\"\")","v":"Lincoln"},{"$f":"IFERROR(IF(INDEX($E:$E,ROW())=\"\",\"\",INDEX(Sheet2!B:B,MATCH(INDEX($E:$E,ROW()),Sheet2!$E$1:$E$999,0))),\"\")","v":"Abraham"},{"$f":"IFERROR(IF(INDEX($E:$E,ROW())=\"\",\"\",INDEX(Sheet2!D:D,MATCH(INDEX($E:$E,ROW()),Sheet2!$E$1:$E$999,0))),\"\")","v":"USA"},null,2,43545.244879282407]
[{"$f":"IFERROR(IF(INDEX($E:$E,ROW())=\"\",\"\",INDEX(Sheet2!A:A,MATCH(INDEX($E:$E,ROW()),Sheet2!$E$1:$E$999,0))),\"\")","v":"Darwin"},{"$f":"IFERROR(IF(INDEX($E:$E,ROW())=\"\",\"\",INDEX(Sheet2!B:B,MATCH(INDEX($E:$E,ROW()),Sheet2!$E$1:$E$999,0))),\"\")","v":"Charles"},{"$f":"IFERROR(IF(INDEX($E:$E,ROW())=\"\",\"\",INDEX(Sheet2!D:D,MATCH(INDEX($E:$E,ROW()),Sheet2!$E$1:$E$999,0))),\"\")","v":"UK"},null,10,43545.244846180554]
[{"$f":"IFERROR(IF(INDEX($E:$E,ROW())=\"\",\"\",INDEX(Sheet2!A:A,MATCH(INDEX($E:$E,ROW()),Sheet2!$E$1:$E$999,0))),\"\")","v":"Presley"},{"$f":"IFERROR(IF(INDEX($E:$E,ROW())=\"\",\"\",INDEX(Sheet2!B:B,MATCH(INDEX($E:$E,ROW()),Sheet2!$E$1:$E$999,0))),\"\")","v":"Elvis"},{"$f":"IFERROR(IF(INDEX($E:$E,ROW())=\"\",\"\",INDEX(Sheet2!D:D,MATCH(INDEX($E:$E,ROW()),Sheet2!$E$1:$E$999,0))),\"\")","v":"USA"},null,4,43545.244849537034]
[{"$f":"IFERROR(IF(INDEX($E:$E,ROW())=\"\",\"\",INDEX(Sheet2!A:A,MATCH(INDEX($E:$E,ROW()),Sheet2!$E$1:$E$999,0))),\"\")","v":"Darwin"},{"$f":"IFERROR(IF(INDEX($E:$E,ROW())=\"\",\"\",INDEX(Sheet2!B:B,MATCH(INDEX($E:$E,ROW()),Sheet2!$E$1:$E$999,0))),\"\")","v":"Charles"},{"$f":"IFERROR(IF(INDEX($E:$E,ROW())=\"\",\"\",INDEX(Sheet2!D:D,MATCH(INDEX($E:$E,ROW()),Sheet2!$E$1:$E$999,0))),\"\")","v":"UK"},null,10,43545.24489710648]
[{"$f":"IFERROR(IF(INDEX($E:$E,ROW())=\"\",\"\",INDEX(Sheet2!A:A,MATCH(INDEX($E:$E,ROW()),Sheet2!$E$1:$E$999,0))),\"\")","v":"Darwin"},{"$f":"IFERROR(IF(INDEX($E:$E,ROW())=\"\",\"\",INDEX(Sheet2!B:B,MATCH(INDEX($E:$E,ROW()),Sheet2!$E$1:$E$999,0))),\"\")","v":"Charles"},{"$f":"IFERROR(IF(INDEX($E:$E,ROW())=\"\",\"\",INDEX(Sheet2!D:D,MATCH(INDEX($E:$E,ROW()),Sheet2!$E$1:$E$999,0))),\"\")","v":"UK"},null,10,43545.244858564816]
[{"$f":"IFERROR(IF(INDEX($E:$E,ROW())=\"\",\"\",INDEX(Sheet2!A:A,MATCH(INDEX($E:$E,ROW()),Sheet2!$E$1:$E$999,0))),\"\")","v":""},{"$f":"IFERROR(IF(INDEX($E:$E,ROW())=\"\",\"\",INDEX(Sheet2!B:B,MATCH(INDEX($E:$E,ROW()),Sheet2!$E$1:$E$999,0))),\"\")","v":""},{"$f":"IFERROR(IF(INDEX($E:$E,ROW())=\"\",\"\",INDEX(Sheet2!D:D,MATCH(INDEX($E:$E,ROW()),Sheet2!$E$1:$E$999,0))),\"\")","v":""}]
[{"$f":"IFERROR(IF(INDEX($E:$E,ROW())=\"\",\"\",INDEX(Sheet2!A:A,MATCH(INDEX($E:$E,ROW()),Sheet2!$E$1:$E$999,0))),\"\")","v":""},{"$f":"IFERROR(IF(INDEX($E:$E,ROW())=\"\",\"\",INDEX(Sheet2!B:B,MATCH(INDEX($E:$E,ROW()),Sheet2!$E$1:$E$999,0))),\"\")","v":""},{"$f":"IFERROR(IF(INDEX($E:$E,ROW())=\"\",\"\",INDEX(Sheet2!D:D,MATCH(INDEX($E:$E,ROW()),Sheet2!$E$1:$E$999,0))),\"\")","v":""}]
[{"$f":"IFERROR(IF(INDEX($E:$E,ROW())=\"\",\"\",INDEX(Sheet2!A:A,MATCH(INDEX($E:$E,ROW()),Sheet2!$E$1:$E$999,0))),\"\")","v":""},{"$f":"IFERROR(IF(INDEX($E:$E,ROW())=\"\",\"\",INDEX(Sheet2!B:B,MATCH(INDEX($E:$E,ROW()),Sheet2!$E$1:$E$999,0))),\"\")","v":""},{"$f":"IFERROR(IF(INDEX($E:$E,ROW())=\"\",\"\",INDEX(Sheet2!D:D,MATCH(INDEX($E:$E,ROW()),Sheet2!$E$1:$E$999,0))),\"\")","v":""},null,null,""]
[{"$f":"IFERROR(IF(INDEX($E:$E,ROW())=\"\",\"\",INDEX(Sheet2!A:A,MATCH(INDEX($E:$E,ROW()),Sheet2!$E$1:$E$999,0))),\"\")","v":""},{"$f":"IFERROR(IF(INDEX($E:$E,ROW())=\"\",\"\",INDEX(Sheet2!B:B,MATCH(INDEX($E:$E,ROW()),Sheet2!$E$1:$E$999,0))),\"\")","v":""},{"$f":"IFERROR(IF(INDEX($E:$E,ROW())=\"\",\"\",INDEX(Sheet2!D:D,MATCH(INDEX($E:$E,ROW()),Sheet2!$E$1:$E$999,0))),\"\")","v":""},null,null,""]
[{"$f":"IFERROR(IF(INDEX($E:$E,ROW())=\"\",\"\",INDEX(Sheet2!A:A,MATCH(INDEX($E:$E,ROW()),Sheet2!$E$1:$E$999,0))),\"\")","v":""},{"$f":"IFERROR(IF(INDEX($E:$E,ROW())=\"\",\"\",INDEX(Sheet2!B:B,MATCH(INDEX($E:$E,ROW()),Sheet2!$E$1:$E$999,0))),\"\")","v":""},{"$f":"IFERROR(IF(INDEX($E:$E,ROW())=\"\",\"\",INDEX(Sheet2!D:D,MATCH(INDEX($E:$E,ROW()),Sheet2!$E$1:$E$999,0))),\"\")","v":""},null,null,""]
[{"$f":"IFERROR(IF(INDEX($E:$E,ROW())=\"\",\"\",INDEX(Sheet2!A:A,MATCH(INDEX($E:$E,ROW()),Sheet2!$E$1:$E$999,0))),\"\")","v":""},{"$f":"IFERROR(IF(INDEX($E:$E,ROW())=\"\",\"\",INDEX(Sheet2!B:B,MATCH(INDEX($E:$E,ROW()),Sheet2!$E$1:$E$999,0))),\"\")","v":""},{"$f":"IFERROR(IF(INDEX($E:$E,ROW())=\"\",\"\",INDEX(Sheet2!D:D,MATCH(INDEX($E:$E,ROW()),Sheet2!$E$1:$E$999,0))),\"\")","v":""},null,null,""]
[{"$f":"IFERROR(IF(INDEX($E:$E,ROW())=\"\",\"\",INDEX(Sheet2!A:A,MATCH(INDEX($E:$E,ROW()),Sheet2!$E$1:$E$999,0))),\"\")","v":""},{"$f":"IFERROR(IF(INDEX($E:$E,ROW())=\"\",\"\",INDEX(Sheet2!B:B,MATCH(INDEX($E:$E,ROW()),Sheet2!$E$1:$E$999,0))),\"\")","v":""},{"$f":"IFERROR(IF(INDEX($E:$E,ROW())=\"\",\"\",INDEX(Sheet2!D:D,MATCH(INDEX($E:$E,ROW()),Sheet2!$E$1:$E$999,0))),\"\")","v":""},null,null,""]
[{"$f":"IFERROR(IF(INDEX($E:$E,ROW())=\"\",\"\",INDEX(Sheet2!A:A,MATCH(INDEX($E:$E,ROW()),Sheet2!$E$1:$E$999,0))),\"\")","v":""},{"$f":"IFERROR(IF(INDEX($E:$E,ROW())=\"\",\"\",INDEX(Sheet2!B:B,MATCH(INDEX($E:$E,ROW()),Sheet2!$E$1:$E$999,0))),\"\")","v":""},{"$f":"IFERROR(IF(INDEX($E:$E,ROW())=\"\",\"\",INDEX(Sheet2!D:D,MATCH(INDEX($E:$E,ROW()),Sheet2!$E$1:$E$999,0))),\"\")","v":""},null,null,""]
[{"$f":"IFERROR(IF(INDEX($E:$E,ROW())=\"\",\"\",INDEX(Sheet2!A:A,MATCH(INDEX($E:$E,ROW()),Sheet2!$E$1:$E$999,0))),\"\")","v":""},{"$f":"IFERROR(IF(INDEX($E:$E,ROW())=\"\",\"\",INDEX(Sheet2!B:B,MATCH(INDEX($E:$E,ROW()),Sheet2!$E$1:$E$999,0))),\"\")","v":""},{"$f":"IFERROR(IF(INDEX($E:$E,ROW())=\"\",\"\",INDEX(Sheet2!D:D,MATCH(INDEX($E:$E,ROW()),Sheet2!$E$1:$E$999,0))),\"\")","v":""},null,null,""]