{"text_format":"1","workbook":"xlsx","n_sheets":2,"sheets":["Форма ввода","База данных"],"not_rendered":{"charts":0,"images":2,"macros":1,"external_links":0,"defined_names":6,"comments":0,"pivot_tables":0},"unopened":[],"bounds":{"document_bytes":16777216,"sheet_cells":100000,"rows_first":2000,"rows_last":500,"rows_between":2000,"halvings":0,"cell_chars":16384,"cell_head_chars":4096},"cells_cut":0,"cells_raw":0,"read":"whole","date_system":"1900"}

{"sheet":"Форма ввода","index":0,"n_rows":24,"n_cols":17,"rows_kept":24,"cut":false,"hidden":false,"merged":[[0,1,0,4],[4,0,4,1],[6,0,6,1],[10,5,12,5],[15,5,17,5],[8,0,8,1],[10,0,10,1],[12,0,12,1],[11,0,11,3],[9,0,9,2],[14,0,14,2],[15,0,15,1],[17,0,17,1],[16,0,16,3],[7,3,8,3]]}
[null,"Форма ввода данных ремонта"]
[]
[null,"Дата",{"$f":"NOW()","v":"2019-04-15T12:15:04.490"}]
[]
["Клиент:",null,"Виталий Киров"]
[]
["Чей он:",null,{"$f":"IFERROR(INDEX(Базаданных[Чей клиент],MATCH('Форма ввода'!$C$5,Базаданных[Клиент],0)),\"\")","v":"Пименов Алексей"}]
[null,null,null,"           Заполняется только в том случае если не понятно чей клиент!!!"]
["К кому отнести:"]
["Д     Е     Б     И     Т",null,null,"Комментарий",null,"Должен НАМ"]
["Дали:",null,null,null,null,{"$f":"SUMIFS(Базаданных[ДД],Базаданных[Клиент],C5)-SUMIFS(Базаданных[ГД],Базаданных[Клиент],C5)","v":3878}]
[]
["Гашение:"]
[]
["К    Р    Е    Д    И    Т",null,null,"Комментарий",null,"Должны МЫ"]
["Взяли:",null,null,null,null,{"$f":"SUMIFS('База данных'!K2:K2,'База данных'!P2:P2,C5)-SUMIFS('База данных'!M2:M2,'База данных'!P2:P2,C5)","v":0}]
[]
["Гашение:"]
[]
[]
{"$rows_left_out":5}
{"sheet":"База данных","index":1,"n_rows":143,"n_cols":22,"rows_kept":143,"cut":false,"hidden":false,"merged":[]}
["Дата","Время","День","День Прописью","Месяц","Год","ДД","Комментарий \"Дебит дали\"","ГД","Комментарий \"Дебит загосили\"","КВ","Комментарий \"Кредит взяли\"","ГК","Комментарий \"Кредит загасили\"","Чей клиент","Клиент","Статус","Индекс","Фильтр","Статус2","Индекс3","Фильтр4"]
["2019-04-01","10:00:00",5,"суббота","Май",2018,110000,null,null,null,null,null,null,null,"Пименов Алексей","Нерсес П-96 (Савеловский)",{"$f":"NOT(ISERROR(SEARCH('Форма ввода'!$C$5,Базаданных[[#This Row],[Клиент]])))","v":false},{"$f":"IF(Базаданных[[#This Row],[Статус]],COUNTIF($Q$2:Базаданных[[#This Row],[Статус]],TRUE),\"\")","v":""},{"$f":"IFERROR(INDEX(Базаданных[Клиент],MATCH(ROWS($R$2:Базаданных[[#This Row],[Индекс]]),Базаданных[Индекс],0)),\"\")","v":"Виталий Киров"},{"$f":"NOT(ISERROR(SEARCH('Форма ввода'!$C$9,Базаданных[[#This Row],[Чей клиент]])))","v":true},{"$f":"IF(Базаданных[[#This Row],[Статус2]],COUNTIF($T$2:Базаданных[[#This Row],[Статус2]],TRUE),\"\")","v":1},{"$f":"IFERROR(INDEX(Базаданных[Чей клиент],MATCH(ROWS($U$2:Базаданных[[#This Row],[Индекс3]]),Базаданных[Индекс3],0)),\"\")","v":"Пименов Алексей"}]
["2019-04-01",43566.83271516204,11,"четверг","Апрель","2019",55000,"-",0,"-",0,"-",0,"-","Пименов Алексей","Саша Криле",{"$f":"NOT(ISERROR(SEARCH('Форма ввода'!$C$5,Базаданных[[#This Row],[Клиент]])))","v":false},{"$f":"IF(Базаданных[[#This Row],[Статус]],COUNTIF($Q$2:Базаданных[[#This Row],[Статус]],TRUE),\"\")","v":""},{"$f":"IFERROR(INDEX(Базаданных[Клиент],MATCH(ROWS($R$2:Базаданных[[#This Row],[Индекс]]),Базаданных[Индекс],0)),\"\")","v":"Виталий Киров"},{"$f":"NOT(ISERROR(SEARCH('Форма ввода'!$C$9,Базаданных[[#This Row],[Чей клиент]])))","v":true},{"$f":"IF(Базаданных[[#This Row],[Статус2]],COUNTIF($T$2:Базаданных[[#This Row],[Статус2]],TRUE),\"\")","v":2},{"$f":"IFERROR(INDEX(Базаданных[Чей клиент],MATCH(ROWS($U$2:Базаданных[[#This Row],[Индекс3]]),Базаданных[Индекс3],0)),\"\")","v":"Пименов Алексей"}]
["2019-04-01",43566.833922337966,11,"четверг","Апрель","2019",75650,"-",0,"-",0,"-",0,"-","Пименов Алексей","Влад П-87",{"$f":"NOT(ISERROR(SEARCH('Форма ввода'!$C$5,Базаданных[[#This Row],[Клиент]])))","v":false},{"$f":"IF(Базаданных[[#This Row],[Статус]],COUNTIF($Q$2:Базаданных[[#This Row],[Статус]],TRUE),\"\")","v":""},{"$f":"IFERROR(INDEX(Базаданных[Клиент],MATCH(ROWS($R$2:Базаданных[[#This Row],[Индекс]]),Базаданных[Индекс],0)),\"\")","v":""},{"$f":"NOT(ISERROR(SEARCH('Форма ввода'!$C$9,Базаданных[[#This Row],[Чей клиент]])))","v":true},{"$f":"IF(Базаданных[[#This Row],[Статус2]],COUNTIF($T$2:Базаданных[[#This Row],[Статус2]],TRUE),\"\")","v":3},{"$f":"IFERROR(INDEX(Базаданных[Чей клиент],MATCH(ROWS($U$2:Базаданных[[#This Row],[Индекс3]]),Базаданных[Индекс3],0)),\"\")","v":"Пименов Алексей"}]
["2019-04-01",43566.834338310182,11,"четверг","Апрель","2019",331000,"-",0,"-",0,"-",0,"-","Пименов Алексей","Армения",{"$f":"NOT(ISERROR(SEARCH('Форма ввода'!$C$5,Базаданных[[#This Row],[Клиент]])))","v":false},{"$f":"IF(Базаданных[[#This Row],[Статус]],COUNTIF($Q$2:Базаданных[[#This Row],[Статус]],TRUE),\"\")","v":""},{"$f":"IFERROR(INDEX(Базаданных[Клиент],MATCH(ROWS($R$2:Базаданных[[#This Row],[Индекс]]),Базаданных[Индекс],0)),\"\")","v":""},{"$f":"NOT(ISERROR(SEARCH('Форма ввода'!$C$9,Базаданных[[#This Row],[Чей клиент]])))","v":true},{"$f":"IF(Базаданных[[#This Row],[Статус2]],COUNTIF($T$2:Базаданных[[#This Row],[Статус2]],TRUE),\"\")","v":4},{"$f":"IFERROR(INDEX(Базаданных[Чей клиент],MATCH(ROWS($U$2:Базаданных[[#This Row],[Индекс3]]),Базаданных[Индекс3],0)),\"\")","v":"Пименов Алексей"}]
["2019-04-01",43567.775615162034,12,"пятница","Апрель","2019",18000,"-",0,"-",0,"-",0,"-","Пименов Алексей","Дмитрий (Вокзалы)",{"$f":"NOT(ISERROR(SEARCH('Форма ввода'!$C$5,Базаданных[[#This Row],[Клиент]])))","v":false},{"$f":"IF(Базаданных[[#This Row],[Статус]],COUNTIF($Q$2:Базаданных[[#This Row],[Статус]],TRUE),\"\")","v":""},{"$f":"IFERROR(INDEX(Базаданных[Клиент],MATCH(ROWS($R$2:Базаданных[[#This Row],[Индекс]]),Базаданных[Индекс],0)),\"\")","v":""},{"$f":"NOT(ISERROR(SEARCH('Форма ввода'!$C$9,Базаданных[[#This Row],[Чей клиент]])))","v":true},{"$f":"IF(Базаданных[[#This Row],[Статус2]],COUNTIF($T$2:Базаданных[[#This Row],[Статус2]],TRUE),\"\")","v":5},{"$f":"IFERROR(INDEX(Базаданных[Чей клиент],MATCH(ROWS($U$2:Базаданных[[#This Row],[Индекс3]]),Базаданных[Индекс3],0)),\"\")","v":"Пименов Алексей"}]
["2019-04-01",43567.776317013886,12,"пятница","Апрель","2019",364648,"-",0,"-",0,"-",0,"-","Пименов Алексей","Дебит Митино",{"$f":"NOT(ISERROR(SEARCH('Форма ввода'!$C$5,Базаданных[[#This Row],[Клиент]])))","v":false},{"$f":"IF(Базаданных[[#This Row],[Статус]],COUNTIF($Q$2:Базаданных[[#This Row],[Статус]],TRUE),\"\")","v":""},{"$f":"IFERROR(INDEX(Базаданных[Клиент],MATCH(ROWS($R$2:Базаданных[[#This Row],[Индекс]]),Базаданных[Индекс],0)),\"\")","v":""},{"$f":"NOT(ISERROR(SEARCH('Форма ввода'!$C$9,Базаданных[[#This Row],[Чей клиент]])))","v":true},{"$f":"IF(Базаданных[[#This Row],[Статус2]],COUNTIF($T$2:Базаданных[[#This Row],[Статус2]],TRUE),\"\")","v":6},{"$f":"IFERROR(INDEX(Базаданных[Чей клиент],MATCH(ROWS($U$2:Базаданных[[#This Row],[Индекс3]]),Базаданных[Индекс3],0)),\"\")","v":"Пименов Алексей"}]
["2019-04-01",43567.776613310183,12,"пятница","Апрель","2019",5000,"-",0,"-",0,"-",0,"-","Пименов Алексей","Брат Сергея",{"$f":"NOT(ISERROR(SEARCH('Форма ввода'!$C$5,Базаданных[[#This Row],[Клиент]])))","v":false},{"$f":"IF(Базаданных[[#This Row],[Статус]],COUNTIF($Q$2:Базаданных[[#This Row],[Статус]],TRUE),\"\")","v":""},{"$f":"IFERROR(INDEX(Базаданных[Клиент],MATCH(ROWS($R$2:Базаданных[[#This Row],[Индекс]]),Базаданных[Индекс],0)),\"\")","v":""},{"$f":"NOT(ISERROR(SEARCH('Форма ввода'!$C$9,Базаданных[[#This Row],[Чей клиент]])))","v":true},{"$f":"IF(Базаданных[[#This Row],[Статус2]],COUNTIF($T$2:Базаданных[[#This Row],[Статус2]],TRUE),\"\")","v":7},{"$f":"IFERROR(INDEX(Базаданных[Чей клиент],MATCH(ROWS($U$2:Базаданных[[#This Row],[Индекс3]]),Базаданных[Индекс3],0)),\"\")","v":"Пименов Алексей"}]
["2019-04-01",43567.776920833334,12,"пятница","Апрель","2019",311370,"-",0,"-",0,"-",0,"-","Пименов Алексей","Эдик (От Сергея)",{"$f":"NOT(ISERROR(SEARCH('Форма ввода'!$C$5,Базаданных[[#This Row],[Клиент]])))","v":false},{"$f":"IF(Базаданных[[#This Row],[Статус]],COUNTIF($Q$2:Базаданных[[#This Row],[Статус]],TRUE),\"\")","v":""},{"$f":"IFERROR(INDEX(Базаданных[Клиент],MATCH(ROWS($R$2:Базаданных[[#This Row],[Индекс]]),Базаданных[Индекс],0)),\"\")","v":""},{"$f":"NOT(ISERROR(SEARCH('Форма ввода'!$C$9,Базаданных[[#This Row],[Чей клиент]])))","v":true},{"$f":"IF(Базаданных[[#This Row],[Статус2]],COUNTIF($T$2:Базаданных[[#This Row],[Статус2]],TRUE),\"\")","v":8},{"$f":"IFERROR(INDEX(Базаданных[Чей клиент],MATCH(ROWS($U$2:Базаданных[[#This Row],[Индекс3]]),Базаданных[Индекс3],0)),\"\")","v":"Пименов Алексей"}]
["2019-04-01",43567.777210879627,12,"пятница","Апрель","2019",3878,"-",0,"-",0,"-",0,"-","Пименов Алексей","Виталий Киров",{"$f":"NOT(ISERROR(SEARCH('Форма ввода'!$C$5,Базаданных[[#This Row],[Клиент]])))","v":true},{"$f":"IF(Базаданных[[#This Row],[Статус]],COUNTIF($Q$2:Базаданных[[#This Row],[Статус]],TRUE),\"\")","v":1},{"$f":"IFERROR(INDEX(Базаданных[Клиент],MATCH(ROWS($R$2:Базаданных[[#This Row],[Индекс]]),Базаданных[Индекс],0)),\"\")","v":""},{"$f":"NOT(ISERROR(SEARCH('Форма ввода'!$C$9,Базаданных[[#This Row],[Чей клиент]])))","v":true},{"$f":"IF(Базаданных[[#This Row],[Статус2]],COUNTIF($T$2:Базаданных[[#This Row],[Статус2]],TRUE),\"\")","v":9},{"$f":"IFERROR(INDEX(Базаданных[Чей клиент],MATCH(ROWS($U$2:Базаданных[[#This Row],[Индекс3]]),Базаданных[Индекс3],0)),\"\")","v":"Пименов Алексей"}]
["2019-04-01",43567.777559259259,12,"пятница","Апрель","2019",300,"-",0,"-",0,"-",0,"-","Пименов Алексей","Мурад (Казахстан)",{"$f":"NOT(ISERROR(SEARCH('Форма ввода'!$C$5,Базаданных[[#This Row],[Клиент]])))","v":false},{"$f":"IF(Базаданных[[#This Row],[Статус]],COUNTIF($Q$2:Базаданных[[#This Row],[Статус]],TRUE),\"\")","v":""},{"$f":"IFERROR(INDEX(Базаданных[Клиент],MATCH(ROWS($R$2:Базаданных[[#This Row],[Индекс]]),Базаданных[Индекс],0)),\"\")","v":""},{"$f":"NOT(ISERROR(SEARCH('Форма ввода'!$C$9,Базаданных[[#This Row],[Чей клиент]])))","v":true},{"$f":"IF(Базаданных[[#This Row],[Статус2]],COUNTIF($T$2:Базаданных[[#This Row],[Статус2]],TRUE),\"\")","v":10},{"$f":"IFERROR(INDEX(Базаданных[Чей клиент],MATCH(ROWS($U$2:Базаданных[[#This Row],[Индекс3]]),Базаданных[Индекс3],0)),\"\")","v":"Пименов Алексей"}]
["2019-04-01",43567.777834143519,12,"пятница","Апрель","2019",10732,"-",0,"-",0,"-",0,"-","Пименов Алексей","Алексей Бердников \"Титан\" (Киров)",{"$f":"NOT(ISERROR(SEARCH('Форма ввода'!$C$5,Базаданных[[#This Row],[Клиент]])))","v":false},{"$f":"IF(Базаданных[[#This Row],[Статус]],COUNTIF($Q$2:Базаданных[[#This Row],[Статус]],TRUE),\"\")","v":""},{"$f":"IFERROR(INDEX(Базаданных[Клиент],MATCH(ROWS($R$2:Базаданных[[#This Row],[Индекс]]),Базаданных[Индекс],0)),\"\")","v":""},{"$f":"NOT(ISERROR(SEARCH('Форма ввода'!$C$9,Базаданных[[#This Row],[Чей клиент]])))","v":true},{"$f":"IF(Базаданных[[#This Row],[Статус2]],COUNTIF($T$2:Базаданных[[#This Row],[Статус2]],TRUE),\"\")","v":11},{"$f":"IFERROR(INDEX(Базаданных[Чей клиент],MATCH(ROWS($U$2:Базаданных[[#This Row],[Индекс3]]),Базаданных[Индекс3],0)),\"\")","v":"Пименов Алексей"}]
["2019-04-01",43567.778109953702,12,"пятница","Апрель","2019",475,"-",0,"-",0,"-",0,"-","Пименов Алексей","Олег Гетманец (Ростов)",{"$f":"NOT(ISERROR(SEARCH('Форма ввода'!$C$5,Базаданных[[#This Row],[Клиент]])))","v":false},{"$f":"IF(Базаданных[[#This Row],[Статус]],COUNTIF($Q$2:Базаданных[[#This Row],[Статус]],TRUE),\"\")","v":""},{"$f":"IFERROR(INDEX(Базаданных[Клиент],MATCH(ROWS($R$2:Базаданных[[#This Row],[Индекс]]),Базаданных[Индекс],0)),\"\")","v":""},{"$f":"NOT(ISERROR(SEARCH('Форма ввода'!$C$9,Базаданных[[#This Row],[Чей клиент]])))","v":true},{"$f":"IF(Базаданных[[#This Row],[Статус2]],COUNTIF($T$2:Базаданных[[#This Row],[Статус2]],TRUE),\"\")","v":12},{"$f":"IFERROR(INDEX(Базаданных[Чей клиент],MATCH(ROWS($U$2:Базаданных[[#This Row],[Индекс3]]),Базаданных[Индекс3],0)),\"\")","v":"Пименов Алексей"}]
["2019-04-01",43567.778473842591,12,"пятница","Апрель","2019",64620,"-",0,"-",0,"-",0,"-","Пименов Алексей","Пименов Алексей (АлексСтор)",{"$f":"NOT(ISERROR(SEARCH('Форма ввода'!$C$5,Базаданных[[#This Row],[Клиент]])))","v":false},{"$f":"IF(Базаданных[[#This Row],[Статус]],COUNTIF($Q$2:Базаданных[[#This Row],[Статус]],TRUE),\"\")","v":""},{"$f":"IFERROR(INDEX(Базаданных[Клиент],MATCH(ROWS($R$2:Базаданных[[#This Row],[Индекс]]),Базаданных[Индекс],0)),\"\")","v":""},{"$f":"NOT(ISERROR(SEARCH('Форма ввода'!$C$9,Базаданных[[#This Row],[Чей клиент]])))","v":true},{"$f":"IF(Базаданных[[#This Row],[Статус2]],COUNTIF($T$2:Базаданных[[#This Row],[Статус2]],TRUE),\"\")","v":13},{"$f":"IFERROR(INDEX(Базаданных[Чей клиент],MATCH(ROWS($U$2:Базаданных[[#This Row],[Индекс3]]),Базаданных[Индекс3],0)),\"\")","v":"Пименов Алексей"}]
["2019-04-01",43567.778741203707,12,"пятница","Апрель","2019",5370,"-",0,"-",0,"-",0,"-","Пименов Алексей","Венера (Нижний Новгород)",{"$f":"NOT(ISERROR(SEARCH('Форма ввода'!$C$5,Базаданных[[#This Row],[Клиент]])))","v":false},{"$f":"IF(Базаданных[[#This Row],[Статус]],COUNTIF($Q$2:Базаданных[[#This Row],[Статус]],TRUE),\"\")","v":""},{"$f":"IFERROR(INDEX(Базаданных[Клиент],MATCH(ROWS($R$2:Базаданных[[#This Row],[Индекс]]),Базаданных[Индекс],0)),\"\")","v":""},{"$f":"NOT(ISERROR(SEARCH('Форма ввода'!$C$9,Базаданных[[#This Row],[Чей клиент]])))","v":true},{"$f":"IF(Базаданных[[#This Row],[Статус2]],COUNTIF($T$2:Базаданных[[#This Row],[Статус2]],TRUE),\"\")","v":14},{"$f":"IFERROR(INDEX(Базаданных[Чей клиент],MATCH(ROWS($U$2:Базаданных[[#This Row],[Индекс3]]),Базаданных[Индекс3],0)),\"\")","v":"Пименов Алексей"}]
["2019-04-01",43567.779061921297,12,"пятница","Апрель","2019",1500,"-",0,"-",0,"-",0,"-","Пименов Алексей","Альфатек ООО (Комтехнолоджи Самара)",{"$f":"NOT(ISERROR(SEARCH('Форма ввода'!$C$5,Базаданных[[#This Row],[Клиент]])))","v":false},{"$f":"IF(Базаданных[[#This Row],[Статус]],COUNTIF($Q$2:Базаданных[[#This Row],[Статус]],TRUE),\"\")","v":""},{"$f":"IFERROR(INDEX(Базаданных[Клиент],MATCH(ROWS($R$2:Базаданных[[#This Row],[Индекс]]),Базаданных[Индекс],0)),\"\")","v":""},{"$f":"NOT(ISERROR(SEARCH('Форма ввода'!$C$9,Базаданных[[#This Row],[Чей клиент]])))","v":true},{"$f":"IF(Базаданных[[#This Row],[Статус2]],COUNTIF($T$2:Базаданных[[#This Row],[Статус2]],TRUE),\"\")","v":15},{"$f":"IFERROR(INDEX(Базаданных[Чей клиент],MATCH(ROWS($U$2:Базаданных[[#This Row],[Индекс3]]),Базаданных[Индекс3],0)),\"\")","v":"Пименов Алексей"}]
["2019-04-01",43567.779373958336,12,"пятница","Апрель","2019",200,"-",0,"-",0,"-",0,"-","Пименов Алексей","КМТ Сервис (Клин)",{"$f":"NOT(ISERROR(SEARCH('Форма ввода'!$C$5,Базаданных[[#This Row],[Клиент]])))","v":false},{"$f":"IF(Базаданных[[#This Row],[Статус]],COUNTIF($Q$2:Базаданных[[#This Row],[Статус]],TRUE),\"\")","v":""},{"$f":"IFERROR(INDEX(Базаданных[Клиент],MATCH(ROWS($R$2:Базаданных[[#This Row],[Индекс]]),Базаданных[Индекс],0)),\"\")","v":""},{"$f":"NOT(ISERROR(SEARCH('Форма ввода'!$C$9,Базаданных[[#This Row],[Чей клиент]])))","v":true},{"$f":"IF(Базаданных[[#This Row],[Статус2]],COUNTIF($T$2:Базаданных[[#This Row],[Статус2]],TRUE),\"\")","v":16},{"$f":"IFERROR(INDEX(Базаданных[Чей клиент],MATCH(ROWS($U$2:Базаданных[[#This Row],[Индекс3]]),Базаданных[Индекс3],0)),\"\")","v":"Пименов Алексей"}]
["2019-04-01",43567.779649884258,12,"пятница","Апрель","2019",130,"-",0,"-",0,"-",0,"-","Пименов Алексей","Самвел (Нижний Новгнород)",{"$f":"NOT(ISERROR(SEARCH('Форма ввода'!$C$5,Базаданных[[#This Row],[Клиент]])))","v":false},{"$f":"IF(Базаданных[[#This Row],[Статус]],COUNTIF($Q$2:Базаданных[[#This Row],[Статус]],TRUE),\"\")","v":""},{"$f":"IFERROR(INDEX(Базаданных[Клиент],MATCH(ROWS($R$2:Базаданных[[#This Row],[Индекс]]),Базаданных[Индекс],0)),\"\")","v":""},{"$f":"NOT(ISERROR(SEARCH('Форма ввода'!$C$9,Базаданных[[#This Row],[Чей клиент]])))","v":true},{"$f":"IF(Базаданных[[#This Row],[Статус2]],COUNTIF($T$2:Базаданных[[#This Row],[Статус2]],TRUE),\"\")","v":17},{"$f":"IFERROR(INDEX(Базаданных[Чей клиент],MATCH(ROWS($U$2:Базаданных[[#This Row],[Индекс3]]),Базаданных[Индекс3],0)),\"\")","v":"Пименов Алексей"}]
["2019-04-01",43567.779920138892,12,"пятница","Апрель","2019",24230,"-",0,"-",0,"-",0,"-","Пименов Алексей","Скупка Розовая Жуковский",{"$f":"NOT(ISERROR(SEARCH('Форма ввода'!$C$5,Базаданных[[#This Row],[Клиент]])))","v":false},{"$f":"IF(Базаданных[[#This Row],[Статус]],COUNTIF($Q$2:Базаданных[[#This Row],[Статус]],TRUE),\"\")","v":""},{"$f":"IFERROR(INDEX(Базаданных[Клиент],MATCH(ROWS($R$2:Базаданных[[#This Row],[Индекс]]),Базаданных[Индекс],0)),\"\")","v":""},{"$f":"NOT(ISERROR(SEARCH('Форма ввода'!$C$9,Базаданных[[#This Row],[Чей клиент]])))","v":true},{"$f":"IF(Базаданных[[#This Row],[Статус2]],COUNTIF($T$2:Базаданных[[#This Row],[Статус2]],TRUE),\"\")","v":18},{"$f":"IFERROR(INDEX(Базаданных[Чей клиент],MATCH(ROWS($U$2:Базаданных[[#This Row],[Индекс3]]),Базаданных[Индекс3],0)),\"\")","v":"Пименов Алексей"}]
["2019-04-01",43567.78395138889,12,"пятница","Апрель","2019",100,"-",0,"-",0,"-",0,"-","Пименов Алексей","Дмитрий (Комиссионка Наро-Фоминск)",{"$f":"NOT(ISERROR(SEARCH('Форма ввода'!$C$5,Базаданных[[#This Row],[Клиент]])))","v":false},{"$f":"IF(Базаданных[[#This Row],[Статус]],COUNTIF($Q$2:Базаданных[[#This Row],[Статус]],TRUE),\"\")","v":""},{"$f":"IFERROR(INDEX(Базаданных[Клиент],MATCH(ROWS($R$2:Базаданных[[#This Row],[Индекс]]),Базаданных[Индекс],0)),\"\")","v":""},{"$f":"NOT(ISERROR(SEARCH('Форма ввода'!$C$9,Базаданных[[#This Row],[Чей клиент]])))","v":true},{"$f":"IF(Базаданных[[#This Row],[Статус2]],COUNTIF($T$2:Базаданных[[#This Row],[Статус2]],TRUE),\"\")","v":19},{"$f":"IFERROR(INDEX(Базаданных[Чей клиент],MATCH(ROWS($U$2:Базаданных[[#This Row],[Индекс3]]),Базаданных[Индекс3],0)),\"\")","v":"Пименов Алексей"}]
{"$rows_left_out":123}