{"text_format":"1","workbook":"xlsx","n_sheets":2,"sheets":["Стимуляторы","Таблицы стимуляторов"],"not_rendered":{"charts":0,"images":1,"macros":0,"external_links":0,"defined_names":1,"comments":0,"pivot_tables":0},"unopened":[],"bounds":{"document_bytes":16777216,"sheet_cells":100000,"rows_first":2000,"rows_last":500,"rows_between":2000,"halvings":0,"cell_chars":16384,"cell_head_chars":4096},"cells_cut":0,"cells_raw":0,"read":"whole","date_system":"1900"}

{"sheet":"Стимуляторы","index":0,"n_rows":14,"n_cols":13,"rows_kept":14,"cut":false,"hidden":false,"merged":[[23,10,24,10],[4,5,5,5],[4,4,5,4],[4,3,5,3],[4,1,5,1],[21,10,22,10],[4,10,5,10],[4,0,5,0],[4,6,5,6],[4,7,5,7],[4,8,5,8],[4,9,5,9],[2,5,3,5],[2,4,3,4],[2,3,3,3],[2,12,3,12],[2,11,3,11],[2,10,3,10],[2,9,3,9],[4,12,5,12],[4,11,5,11],[0,0,1,1],[12,14,12,15],[13,14,13,15],[2,14,2,15],[3,14,3,15],[4,14,4,15],[5,14,5,15],[6,14,6,15],[2,0,3,0],[2,8,3,8],[2,1,3,1],[0,3,1,12],[2,7,3,7],[2,6,3,6],[14,14,14,15],[7,14,7,15],[8,14,8,15],[9,14,9,15],[10,14,10,15],[11,14,11,15]]}
[]
[]
[null,null,null,"Рекуперант альфа М","Перцептил бета М","Перцептил альфа М","Перцептил бета М","Перцептил альфа","Перцептил бета","Перцептил альфа М","Перцептил бета М","Перцептил альфа","Перцептил бета"]
[]
[]
[]
[null,null,null,{"$f":"VLOOKUP(D3,'Таблицы стимуляторов'!$A$2:$N$43,13,0)","v":"токсичность"},{"$f":"VLOOKUP(E3,'Таблицы стимуляторов'!$A$2:$N$43,13,0)","v":"токсичность"},{"$f":"VLOOKUP(F3,'Таблицы стимуляторов'!$A$2:$N$43,13,0)","v":"токсичность"},{"$f":"VLOOKUP(G3,'Таблицы стимуляторов'!$A$2:$N$43,13,0)","v":"токсичность"},{"$f":"VLOOKUP(H3,'Таблицы стимуляторов'!$A$2:$N$43,13,0)","v":"токсичность"},{"$f":"VLOOKUP(I3,'Таблицы стимуляторов'!$A$2:$N$43,13,0)","v":"токсичность"},{"$f":"VLOOKUP(J3,'Таблицы стимуляторов'!$A$2:$N$43,13,0)","v":"токсичность"},{"$f":"VLOOKUP(K3,'Таблицы стимуляторов'!$A$2:$N$43,13,0)","v":"токсичность"},{"$f":"VLOOKUP(L3,'Таблицы стимуляторов'!$A$2:$N$43,13,0)","v":"токсичность"},{"$f":"VLOOKUP(M3,'Таблицы стимуляторов'!$A$2:$N$43,13,0)","v":"токсичность"}]
[null,null,null,{"$f":"VLOOKUP(D3,'Таблицы стимуляторов'!$A$2:$N$43,14,0)","v":4},{"$f":"VLOOKUP(E3,'Таблицы стимуляторов'!$A$2:$N$43,14,0)","v":4},{"$f":"VLOOKUP(F3,'Таблицы стимуляторов'!$A$2:$N$43,14,0)","v":5},{"$f":"VLOOKUP(G3,'Таблицы стимуляторов'!$A$2:$N$43,14,0)","v":4},{"$f":"VLOOKUP(H3,'Таблицы стимуляторов'!$A$2:$N$43,14,0)","v":5},{"$f":"VLOOKUP(I3,'Таблицы стимуляторов'!$A$2:$N$43,14,0)","v":4},{"$f":"VLOOKUP(J3,'Таблицы стимуляторов'!$A$2:$N$43,14,0)","v":5},{"$f":"VLOOKUP(K3,'Таблицы стимуляторов'!$A$2:$N$43,14,0)","v":4},{"$f":"VLOOKUP(L3,'Таблицы стимуляторов'!$A$2:$N$43,14,0)","v":5},{"$f":"VLOOKUP(M3,'Таблицы стимуляторов'!$A$2:$N$43,14,0)","v":4}]
[null,null,null,{"$f":"VLOOKUP(D3,Таблица_стимуляторы[],3,0)","v":"регенирация"},{"$f":"VLOOKUP(E3,Таблица_стимуляторы[],3,0)","v":"Точность"},{"$f":"VLOOKUP(F3,Таблица_стимуляторы[],3,0)","v":"Точность"},{"$f":"VLOOKUP(G3,Таблица_стимуляторы[],3,0)","v":"Точность"},{"$f":"VLOOKUP(H3,Таблица_стимуляторы[],3,0)","v":"Точность"},{"$f":"VLOOKUP(I3,Таблица_стимуляторы[],3,0)","v":"Точность"},{"$f":"VLOOKUP(J3,Таблица_стимуляторы[],3,0)","v":"Точность"},{"$f":"VLOOKUP(K3,Таблица_стимуляторы[],3,0)","v":"Точность"},{"$f":"VLOOKUP(L3,Таблица_стимуляторы[],3,0)","v":"Точность"},{"$f":"VLOOKUP(M3,Таблица_стимуляторы[],3,0)","v":"Точность"}]
[null,null,null,{"$f":"VLOOKUP(D3,Таблица_расчета_стимуляторов[],VALUE(3),0)","v":0.11},{"$f":"VLOOKUP(E3,Таблица_расчета_стимуляторов[],VALUE(4),0)","v":2.1875000000000002E-3},{"$f":"VLOOKUP(F3,Таблица_расчета_стимуляторов[],VALUE(5),0)","v":7.4999999999999997E-3},{"$f":"VLOOKUP(G3,Таблица_расчета_стимуляторов[],VALUE(6),0)","v":1.0937500000000001E-3},{"$f":"VLOOKUP(H3,Таблица_расчета_стимуляторов[],VALUE(7),0)","v":0.1},{"$f":"VLOOKUP(I3,Таблица_расчета_стимуляторов[],VALUE(8),0)","v":0.03},{"$f":"VLOOKUP(J3,Таблица_расчета_стимуляторов[],VALUE(9),0)","v":3.7499999999999999E-3},{"$f":"VLOOKUP(K3,Таблица_расчета_стимуляторов[],VALUE(10),0)","v":5.4687500000000005E-4},{"$f":"VLOOKUP(L3,Таблица_расчета_стимуляторов[],VALUE(11),0)","v":0.05},{"$f":"VLOOKUP(M3,Таблица_расчета_стимуляторов[],VALUE(12),0)","v":1.4999999999999999E-2}]
{"$rows_left_out":5}
{"sheet":"Таблицы стимуляторов","index":1,"n_rows":43,"n_cols":52,"rows_kept":43,"cut":false,"hidden":false,"merged":[[0,16,0,51]]}
[null,null,null,null,null,null,null,null,null,null,null,null,null,null,null,null,"Таблица расчетов стимуляторов"]
[null,null,null,null,null,null,null,null,null,null,null,null,null,null,null,"Столбец1","Столбец2","Столбец3","Столбец4","Столбец5","Столбец6","Столбец7","Столбец8","Столбец9","Столбец10","Столбец11","Столбец12","Кол-во","Столбец13","Столбец14","Столбец15","Столбец16","Столбец17","Столбец18","Столбец19","Столбец20","Столбец21","Столбец22","Столбец23","Кол-во2","Столбец24","Столбец25","Столбец26","Столбец27","Столбец28","Столбец29","Столбец30","Столбец31","Столбец32","Столбец33","Столбец34","Кол-во4"]
[null,null,null,null,null,null,null,null,null,null,null,null,null,null,null,"Выберите стимулятор",0,0,0,0,0,0,0,0,0,0,0,0,0,0,0,0,0,0,0,0,0,0,0,0]
[null,null,null,null,null,null,null,null,null,null,null,null,null,null,null,"Гемобуфер Альфа","Здоровье",{"$f":"IF(Стимуляторы!$D$3=\"гемобуфер альфа\",0.5^(COUNTIF(Стимуляторы!$D$3,\"гемобуфер альфа\")-1)*$D$17,0)","v":0},{"$f":"IF(Стимуляторы!E3=\"гемобуфер альфа\",0.5^(COUNTIF(Стимуляторы!$D$3:E3,\"гемобуфер альфа\")-1)*$D$17,0)","v":0},{"$f":"IF(Стимуляторы!F3=\"гемобуфер альфа\",0.5^(COUNTIF(Стимуляторы!D3:F3,\"гемобуфер альфа\")-1)*$D$17,0)","v":0},{"$f":"IF(Стимуляторы!G3=\"гемобуфер альфа\",0.5^(COUNTIF(Стимуляторы!D3:G3,\"гемобуфер альфа\")-1)*$D$17,0)","v":0},{"$f":"IF(Стимуляторы!H3=\"гемобуфер альфа\",0.5^(COUNTIF(Стимуляторы!D3:H3,\"гемобуфер альфа\")-1)*$D$17,0)","v":0},{"$f":"IF(Стимуляторы!I3=\"гемобуфер альфа\",0.5^(COUNTIF(Стимуляторы!D3:I3,\"гемобуфер альфа\")-1)*$D$17,0)","v":0},{"$f":"IF(Стимуляторы!J3=\"гемобуфер альфа\",0.5^(COUNTIF(Стимуляторы!D3:J3,\"гемобуфер альфа\")-1)*$D$17,0)","v":0},{"$f":"IF(Стимуляторы!K3=\"гемобуфер альфа\",0.5^(COUNTIF(Стимуляторы!D3:K3,\"гемобуфер альфа\")-1)*$D$17,0)","v":0},{"$f":"IF(Стимуляторы!L3=\"гемобуфер альфа\",0.5^(COUNTIF(Стимуляторы!D3:L3,\"гемобуфер альфа\")-1)*$D$17,0)","v":0},{"$f":"IF(Стимуляторы!M3=\"гемобуфер альфа\",0.5^(COUNTIF(Стимуляторы!D3:M3,\"гемобуфер альфа\")-1)*$D$17,0)","v":0},{"$f":"COUNTIF(R4:AA4,\">0\")","v":0},"Сопр. эфф.",{"$f":"IF(Стимуляторы!D3=\"гемобуфер альфа\",0.5^(COUNTIF(Стимуляторы!$D$3,\"гемобуфер альфа\")-1)*$F$17,0)","v":0},{"$f":"IF(Стимуляторы!E3=\"гемобуфер альфа\",0.5^(COUNTIF(Стимуляторы!$D$3:E3,\"гемобуфер альфа\")-1)*$F$17,0)","v":0},{"$f":"IF(Стимуляторы!F3=\"гемобуфер альфа\",0.5^(COUNTIF(Стимуляторы!$D$3:F3,\"гемобуфер альфа\")-1)*$F$17,0)","v":0},{"$f":"IF(Стимуляторы!G3=\"гемобуфер альфа\",0.5^(COUNTIF(Стимуляторы!$D$3:G3,\"гемобуфер альфа\")-1)*$F$17,0)","v":0},{"$f":"IF(Стимуляторы!H3=\"гемобуфер альфа\",0.5^(COUNTIF(Стимуляторы!$D$3:H3,\"гемобуфер альфа\")-1)*$F$17,0)","v":0},{"$f":"IF(Стимуляторы!I3=\"гемобуфер альфа\",0.5^(COUNTIF(Стимуляторы!$D$3:I3,\"гемобуфер альфа\")-1)*$F$17,0)","v":0},{"$f":"IF(Стимуляторы!J3=\"гемобуфер альфа\",0.5^(COUNTIF(Стимуляторы!$D$3:J3,\"гемобуфер альфа\")-1)*$F$17,0)","v":0},{"$f":"IF(Стимуляторы!K3=\"гемобуфер альфа\",0.5^(COUNTIF(Стимуляторы!$D$3:K3,\"гемобуфер альфа\")-1)*$F$17,0)","v":0},{"$f":"IF(Стимуляторы!L3=\"гемобуфер альфа\",0.5^(COUNTIF(Стимуляторы!$D$3:L3,\"гемобуфер альфа\")-1)*$F$17,0)","v":0},{"$f":"IF(Стимуляторы!M3=\"гемобуфер альфа\",0.5^(COUNTIF(Стимуляторы!$D$3:M3,\"гемобуфер альфа\")-1)*$F$17,0)","v":0},{"$f":"COUNTIF(AD4:AM4,\">0\")","v":0}]
[null,null,null,null,null,null,null,null,null,null,null,null,null,null,null,"Гемобуфер бета","Здоровье",{"$f":"IF(Стимуляторы!D3=\"гемобуфер бета\",0.5^(COUNTIF(Стимуляторы!$D$3,\"гемобуфер бета\")+$AB$4-1)*$D$24,0)","v":0},{"$f":"IF(Стимуляторы!E3=\"гемобуфер бета\",0.5^(COUNTIF(Стимуляторы!$D$3:E3,\"гемобуфер бета\")+$AB$4-1)*$D$24,0)","v":0},{"$f":"IF(Стимуляторы!F3=\"гемобуфер бета\",0.5^(COUNTIF(Стимуляторы!$D$3:F3,\"гемобуфер бета\")+$AB$4-1)*$D$24,0)","v":0},{"$f":"IF(Стимуляторы!G3=\"гемобуфер бета\",0.5^(COUNTIF(Стимуляторы!$D$3:G3,\"гемобуфер бета\")+$AB$4-1)*$D$24,0)","v":0},{"$f":"IF(Стимуляторы!H3=\"гемобуфер бета\",0.5^(COUNTIF(Стимуляторы!$D$3:H3,\"гемобуфер бета\")+$AB$4-1)*$D$24,0)","v":0},{"$f":"IF(Стимуляторы!I3=\"гемобуфер бета\",0.5^(COUNTIF(Стимуляторы!$D$3:I3,\"гемобуфер бета\")+$AB$4-1)*$D$24,0)","v":0},{"$f":"IF(Стимуляторы!J3=\"гемобуфер бета\",0.5^(COUNTIF(Стимуляторы!$D$3:J3,\"гемобуфер бета\")+$AB$4-1)*$D$24,0)","v":0},{"$f":"IF(Стимуляторы!K3=\"гемобуфер бета\",0.5^(COUNTIF(Стимуляторы!$D$3:K3,\"гемобуфер бета\")+$AB$4-1)*$D$24,0)","v":0},{"$f":"IF(Стимуляторы!L3=\"гемобуфер бета\",0.5^(COUNTIF(Стимуляторы!$D$3:L3,\"гемобуфер бета\")+$AB$4-1)*$D$24,0)","v":0},{"$f":"IF(Стимуляторы!M3=\"гемобуфер бета\",0.5^(COUNTIF(Стимуляторы!$D$3:M3,\"гемобуфер бета\")+$AB$4-1)*$D$24,0)","v":0},0,"Сопр. эфф.",{"$f":"IF(Стимуляторы!D3=\"гемобуфер бета\",0.5^(COUNTIF(Стимуляторы!$D$3,\"гемобуфер бета\")+$AN$4-1)*$F$24,0)","v":0},{"$f":"IF(Стимуляторы!E3=\"гемобуфер бета\",0.5^(COUNTIF(Стимуляторы!$D$3:E3,\"гемобуфер бета\")+$AN$4-1)*$F$24,0)","v":0},{"$f":"IF(Стимуляторы!F3=\"гемобуфер бета\",0.5^(COUNTIF(Стимуляторы!$D$3:F3,\"гемобуфер бета\")+$AN$4-1)*$F$24,0)","v":0},{"$f":"IF(Стимуляторы!G3=\"гемобуфер бета\",0.5^(COUNTIF(Стимуляторы!$D$3:G3,\"гемобуфер бета\")+$AN$4-1)*$F$24,0)","v":0},{"$f":"IF(Стимуляторы!H3=\"гемобуфер бета\",0.5^(COUNTIF(Стимуляторы!$D$3:H3,\"гемобуфер бета\")+$AN$4-1)*$F$24,0)","v":0},{"$f":"IF(Стимуляторы!I3=\"гемобуфер бета\",0.5^(COUNTIF(Стимуляторы!$D$3:I3,\"гемобуфер бета\")+$AN$4-1)*$F$24,0)","v":0},{"$f":"IF(Стимуляторы!J3=\"гемобуфер бета\",0.5^(COUNTIF(Стимуляторы!$D$3:J3,\"гемобуфер бета\")+$AN$4-1)*$F$24,0)","v":0},{"$f":"IF(Стимуляторы!K3=\"гемобуфер бета\",0.5^(COUNTIF(Стимуляторы!$D$3:K3,\"гемобуфер бета\")+$AN$4-1)*$F$24,0)","v":0},{"$f":"IF(Стимуляторы!L3=\"гемобуфер бета\",0.5^(COUNTIF(Стимуляторы!$D$3:L3,\"гемобуфер бета\")+$AN$4-1)*$F$24,0)","v":0},{"$f":"IF(Стимуляторы!M3=\"гемобуфер бета\",0.5^(COUNTIF(Стимуляторы!$D$3:M3,\"гемобуфер бета\")+$AN$4-1)*$F$24,0)","v":0},{"$f":"COUNTIF(AD5:AM5,\">0\")","v":0}]
[null,null,null,null,null,null,null,null,null,null,null,null,null,null,null,"Гемобуфер Альфа М","Здоровье",{"$f":"IF(Стимуляторы!D3=\"гемобуфер альфа М\",0.5^(COUNTIF(Стимуляторы!$D$3,\"гемобуфер альфа М\")+AB4+AB5-1)*$D$31,0)","v":0},{"$f":"IF(Стимуляторы!E3=\"гемобуфер альфа М\",0.5^(COUNTIF(Стимуляторы!$D$3:E3,\"гемобуфер альфа М\")+$AB$4+$AB$5-1)*$D$31,0)","v":0},{"$f":"IF(Стимуляторы!F3=\"гемобуфер альфа М\",0.5^(COUNTIF(Стимуляторы!$D$3:F3,\"гемобуфер альфа М\")+$AB$4+$AB$5-1)*$D$31,0)","v":0},{"$f":"IF(Стимуляторы!G3=\"гемобуфер альфа М\",0.5^(COUNTIF(Стимуляторы!$D$3:G3,\"гемобуфер альфа М\")+$AB$4+$AB$5-1)*$D$31,0)","v":0},{"$f":"IF(Стимуляторы!H3=\"гемобуфер альфа М\",0.5^(COUNTIF(Стимуляторы!$D$3:H3,\"гемобуфер альфа М\")+$AB$4+$AB$5-1)*$D$31,0)","v":0},{"$f":"IF(Стимуляторы!I3=\"гемобуфер альфа М\",0.5^(COUNTIF(Стимуляторы!$D$3:I3,\"гемобуфер альфа М\")+$AB$4+$AB$5-1)*$D$31,0)","v":0},{"$f":"IF(Стимуляторы!J3=\"гемобуфер альфа М\",0.5^(COUNTIF(Стимуляторы!$D$3:J3,\"гемобуфер альфа М\")+$AB$4+$AB$5-1)*$D$31,0)","v":0},{"$f":"IF(Стимуляторы!K3=\"гемобуфер альфа М\",0.5^(COUNTIF(Стимуляторы!$D$3:K3,\"гемобуфер альфа М\")+$AB$4+$AB$5-1)*$D$31,0)","v":0},{"$f":"IF(Стимуляторы!L3=\"гемобуфер альфа М\",0.5^(COUNTIF(Стимуляторы!$D$3:L3,\"гемобуфер альфа М\")+$AB$4+$AB$5-1)*$D$31,0)","v":0},{"$f":"IF(Стимуляторы!M3=\"гемобуфер альфа М\",0.5^(COUNTIF(Стимуляторы!$D$3:M3,\"гемобуфер альфа М\")+$AB$4+$AB$5-1)*$D$31,0)","v":0},{"$f":"COUNTIF(R6:AA6,\">0\")","v":0},"Сопр. эфф.",{"$f":"IF(Стимуляторы!D3=\"гемобуфер альфа М\",0.5^(COUNTIF(Стимуляторы!$D$3,\"гемобуфер альфа М\")+AN4+AN5-1)*$F$31,0)","v":0},{"$f":"IF(Стимуляторы!E3=\"гемобуфер альфа М\",0.5^(COUNTIF(Стимуляторы!$D$3:E3,\"гемобуфер альфа М\")+$AN$4+$AN$5-1)*$F$31,0)","v":0},{"$f":"IF(Стимуляторы!F3=\"гемобуфер альфа М\",0.5^(COUNTIF(Стимуляторы!$D$3:F3,\"гемобуфер альфа М\")+$AN$4+$AN$5-1)*$F$31,0)","v":0},{"$f":"IF(Стимуляторы!G3=\"гемобуфер альфа М\",0.5^(COUNTIF(Стимуляторы!$D$3:G3,\"гемобуфер альфа М\")+$AN$4+$AN$5-1)*$F$31,0)","v":0},{"$f":"IF(Стимуляторы!H3=\"гемобуфер альфа М\",0.5^(COUNTIF(Стимуляторы!$D$3:H3,\"гемобуфер альфа М\")+$AN$4+$AN$5-1)*$F$31,0)","v":0},{"$f":"IF(Стимуляторы!I3=\"гемобуфер альфа М\",0.5^(COUNTIF(Стимуляторы!$D$3:I3,\"гемобуфер альфа М\")+$AN$4+$AN$5-1)*$F$31,0)","v":0},{"$f":"IF(Стимуляторы!J3=\"гемобуфер альфа М\",0.5^(COUNTIF(Стимуляторы!$D$3:J3,\"гемобуфер альфа М\")+$AN$4+$AN$5-1)*$F$31,0)","v":0},{"$f":"IF(Стимуляторы!K3=\"гемобуфер альфа М\",0.5^(COUNTIF(Стимуляторы!$D$3:K3,\"гемобуфер альфа М\")+$AN$4+$AN$5-1)*$F$31,0)","v":0},{"$f":"IF(Стимуляторы!L3=\"гемобуфер альфа М\",0.5^(COUNTIF(Стимуляторы!$D$3:L3,\"гемобуфер альфа М\")+$AN$4+$AN$5-1)*$F$31,0)","v":0},{"$f":"IF(Стимуляторы!M3=\"гемобуфер альфа М\",0.5^(COUNTIF(Стимуляторы!$D$3:M3,\"гемобуфер альфа М\")+$AN$4+$AN$5-1)*$F$31,0)","v":0},0]
[null,null,null,null,null,null,null,null,null,null,null,null,null,null,null,"Гемобуфер бета М","Здоровье",{"$f":"IF(Стимуляторы!$D$3=\"гемобуфер бета М\",0.5^(COUNTIF(Стимуляторы!$D$3,\"гемобуфер бета М\")+$AB$4+$AB$5+$AB$6-1)*$D$38,0)","v":0},{"$f":"IF(Стимуляторы!E3=\"гемобуфер бета М\",0.5^(COUNTIF(Стимуляторы!$D$3:E3,\"гемобуфер бета М\")+$AB$4+$AB$5+$AB$6-1)*$D$38,0)","v":0},{"$f":"IF(Стимуляторы!F3=\"гемобуфер бета М\",0.5^(COUNTIF(Стимуляторы!$D$3:F3,\"гемобуфер бета М\")+$AB$4+$AB$5+$AB$6-1)*$D$38,0)","v":0},{"$f":"IF(Стимуляторы!G3=\"гемобуфер бета М\",0.5^(COUNTIF(Стимуляторы!$D$3:G3,\"гемобуфер бета М\")+$AB$4+$AB$5+$AB$6-1)*$D$38,0)","v":0},{"$f":"IF(Стимуляторы!H3=\"гемобуфер бета М\",0.5^(COUNTIF(Стимуляторы!$D$3:H3,\"гемобуфер бета М\")+$AB$4+$AB$5+$AB$6-1)*$D$38,0)","v":0},{"$f":"IF(Стимуляторы!I3=\"гемобуфер бета М\",0.5^(COUNTIF(Стимуляторы!$D$3:I3,\"гемобуфер бета М\")+$AB$4+$AB$5+$AB$6-1)*$D$38,0)","v":0},{"$f":"IF(Стимуляторы!J3=\"гемобуфер бета М\",0.5^(COUNTIF(Стимуляторы!$D$3:J3,\"гемобуфер бета М\")+$AB$4+$AB$5+$AB$6-1)*$D$38,0)","v":0},{"$f":"IF(Стимуляторы!K3=\"гемобуфер бета М\",0.5^(COUNTIF(Стимуляторы!$D$3:K3,\"гемобуфер бета М\")+$AB$4+$AB$5+$AB$6-1)*$D$38,0)","v":0},{"$f":"IF(Стимуляторы!L3=\"гемобуфер бета М\",0.5^(COUNTIF(Стимуляторы!$D$3:L3,\"гемобуфер бета М\")+$AB$4+$AB$5+$AB$6-1)*$D$38,0)","v":0},{"$f":"IF(Стимуляторы!M3=\"гемобуфер бета М\",0.5^(COUNTIF(Стимуляторы!$D$3:M3,\"гемобуфер бета М\")+$AB$4+$AB$5+$AB$6-1)*$D$38,0)","v":0},{"$f":"COUNTIF(R7:AA7,\">0\")","v":0},"Сопр. эфф.",{"$f":"IF(Стимуляторы!D3=\"гемобуфер бета М\",0.5^(COUNTIF(Стимуляторы!$D$3,\"гемобуфер бета М\")+$AN$4+$AN$5+$AN$6-1)*$F$38,0)","v":0},{"$f":"IF(Стимуляторы!E3=\"гемобуфер бета М\",0.5^(COUNTIF(Стимуляторы!$D$3:E3,\"гемобуфер бета М\")+$AN$4+$AN$5+$AN$6-1)*$F$38,0)","v":0},{"$f":"IF(Стимуляторы!F3=\"гемобуфер бета М\",0.5^(COUNTIF(Стимуляторы!$D$3:F3,\"гемобуфер бета М\")+$AN$4+$AN$5+$AN$6-1)*$F$38,0)","v":0},{"$f":"IF(Стимуляторы!G3=\"гемобуфер бета М\",0.5^(COUNTIF(Стимуляторы!$D$3:G3,\"гемобуфер бета М\")+$AN$4+$AN$5+$AN$6-1)*$F$38,0)","v":0},{"$f":"IF(Стимуляторы!H3=\"гемобуфер бета М\",0.5^(COUNTIF(Стимуляторы!$D$3:H3,\"гемобуфер бета М\")+$AN$4+$AN$5+$AN$6-1)*$F$38,0)","v":0},{"$f":"IF(Стимуляторы!I3=\"гемобуфер бета М\",0.5^(COUNTIF(Стимуляторы!$D$3:I3,\"гемобуфер бета М\")+$AN$4+$AN$5+$AN$6-1)*$F$38,0)","v":0},{"$f":"IF(Стимуляторы!J3=\"гемобуфер бета М\",0.5^(COUNTIF(Стимуляторы!$D$3:J3,\"гемобуфер бета М\")+$AN$4+$AN$5+$AN$6-1)*$F$38,0)","v":0},{"$f":"IF(Стимуляторы!K3=\"гемобуфер бета М\",0.5^(COUNTIF(Стимуляторы!$D$3:K3,\"гемобуфер бета М\")+$AN$4+$AN$5+$AN$6-1)*$F$38,0)","v":0},{"$f":"IF(Стимуляторы!L3=\"гемобуфер бета М\",0.5^(COUNTIF(Стимуляторы!$D$3:L3,\"гемобуфер бета М\")+$AN$4+$AN$5+$AN$6-1)*$F$38,0)","v":0},{"$f":"IF(Стимуляторы!M3=\"гемобуфер бета М\",0.5^(COUNTIF(Стимуляторы!$D$3:M3,\"гемобуфер бета М\")+$AN$4+$AN$5+$AN$6-1)*$F$38,0)","v":0},0]
[null,null,null,null,null,null,null,null,null,null,null,null,null,null,null,null,null,{"$f":"IF(Стимуляторы!D8=\"гемобуфер альфа\",0.5^(COUNTIF(Стимуляторы!D8,\"гемобуфер альфа\")+AB7-1)*$D$24,0)","v":0},{"$f":"IF(Стимуляторы!E7=\"гемобуфер бета\",0.5^(COUNTIF(Стимуляторы!D13:E13,\"Здоровье\")-1)*$D$24,0)","v":0},{"$f":"IF(Стимуляторы!F8=\"гемобуфер альфа\",0.5^(COUNTIF(Стимуляторы!D8:F9,\"гемобуфер альфа\")-1)*$D$17,0)","v":0},{"$f":"IF(Стимуляторы!G8=\"гемобуфер альфа\",0.5^(COUNTIF(Стимуляторы!D8:G9,\"гемобуфер альфа\")-1)*$D$17,0)","v":0},{"$f":"IF(Стимуляторы!H8=\"гемобуфер альфа\",0.5^(COUNTIF(Стимуляторы!D8:H9,\"гемобуфер альфа\")-1)*$D$17,0)","v":0},{"$f":"IF(Стимуляторы!I8=\"гемобуфер альфа\",0.5^(COUNTIF(Стимуляторы!D8:I9,\"гемобуфер альфа\")-1)*$D$17,0)","v":0},{"$f":"IF(Стимуляторы!J8=\"гемобуфер альфа\",0.5^(COUNTIF(Стимуляторы!D8:J9,\"гемобуфер альфа\")-1)*$D$17,0)","v":0},{"$f":"IF(Стимуляторы!K8=\"гемобуфер альфа\",0.5^(COUNTIF(Стимуляторы!D8:K9,\"гемобуфер альфа\")-1)*$D$17,0)","v":0},{"$f":"IF(Стимуляторы!L8=\"гемобуфер альфа\",0.5^(COUNTIF(Стимуляторы!D8:L9,\"гемобуфер альфа\")-1)*$D$17,0)","v":0},{"$f":"IF(Стимуляторы!M8=\"гемобуфер альфа\",0.5^(COUNTIF(Стимуляторы!D8:M9,\"гемобуфер альфа\")-1)*$D$17,0)","v":0},{"$f":"COUNTIF(R8:AA8,\">0\")","v":0}]
[null,null,null,null,null,null,null,null,null,null,null,null,null,null,null,"Моториум альфа","ОД",{"$f":"IF(Стимуляторы!$D$3=\"Моториум альфа\",0.5^(COUNTIF(Стимуляторы!$D$3,\"Моториум альфа\")-1)*$D$18,0)","v":0},{"$f":"IF(Стимуляторы!$E$3=\"Моториум альфа\",0.5^(COUNTIF(Стимуляторы!$D$3:E3,\"Моториум альфа\")-1)*$D$18,0)","v":0},{"$f":"IF(Стимуляторы!F3=\"Моториум альфа\",0.5^(COUNTIF(Стимуляторы!$D$3:F3,\"Моториум альфа\")-1)*$D$18,0)","v":0},{"$f":"IF(Стимуляторы!G3=\"Моториум альфа\",0.5^(COUNTIF(Стимуляторы!$D$3:G3,\"Моториум альфа\")-1)*$D$18,0)","v":0},{"$f":"IF(Стимуляторы!H3=\"Моториум альфа\",0.5^(COUNTIF(Стимуляторы!$D$3:H3,\"Моториум альфа\")-1)*$D$18,0)","v":0},{"$f":"IF(Стимуляторы!I3=\"Моториум альфа\",0.5^(COUNTIF(Стимуляторы!$D$3:I3,\"Моториум альфа\")-1)*$D$18,0)","v":0},{"$f":"IF(Стимуляторы!J3=\"Моториум альфа\",0.5^(COUNTIF(Стимуляторы!$D$3:J3,\"Моториум альфа\")-1)*$D$18,0)","v":0},{"$f":"IF(Стимуляторы!K3=\"Моториум альфа\",0.5^(COUNTIF(Стимуляторы!$D$3:K3,\"Моториум альфа\")-1)*$D$18,0)","v":0},{"$f":"IF(Стимуляторы!L3=\"Моториум альфа\",0.5^(COUNTIF(Стимуляторы!$D$3:L3,\"Моториум альфа\")-1)*$D$18,0)","v":0},{"$f":"IF(Стимуляторы!M3=\"Моториум альфа\",0.5^(COUNTIF(Стимуляторы!$D$3:M3,\"Моториум альфа\")-1)*$D$18,0)","v":0},{"$f":"COUNTIF(R9:AA9,\">0\")","v":0},null,null,null,null,null,null,null,null,null,null,null,0]
[null,null,null,null,null,null,null,null,null,null,null,null,null,null,null,"Моториум бета","ОД",{"$f":"IF(Стимуляторы!$D$3=\"Моториум бета\",0.5^(COUNTIF(Стимуляторы!$D$3,\"Моториум бета\")-1)*$D$25,0)","v":0},{"$f":"IF(Стимуляторы!E3=\"Моториум бета\",0.5^(COUNTIF(Стимуляторы!$D$3:E3,\"Моториум бета\")+$AB$9-1)*$D$25,0)","v":0},{"$f":"IF(Стимуляторы!F3=\"Моториум бета\",0.5^(COUNTIF(Стимуляторы!$D$3:F3,\"Моториум бета\")+$AB$9-1)*$D$25,0)","v":0},{"$f":"IF(Стимуляторы!G3=\"Моториум бета\",0.5^(COUNTIF(Стимуляторы!$D$3:G3,\"Моториум бета\")+$AB$9-1)*$D$25,0)","v":0},{"$f":"IF(Стимуляторы!H3=\"Моториум бета\",0.5^(COUNTIF(Стимуляторы!$D$3:H3,\"Моториум бета\")+$AB$9-1)*$D$25,0)","v":0},{"$f":"IF(Стимуляторы!I3=\"Моториум бета\",0.5^(COUNTIF(Стимуляторы!$D$3:I3,\"Моториум бета\")+$AB$9-1)*$D$25,0)","v":0},{"$f":"IF(Стимуляторы!J3=\"Моториум бета\",0.5^(COUNTIF(Стимуляторы!$D$3:J3,\"Моториум бета\")+$AB$9-1)*$D$25,0)","v":0},{"$f":"IF(Стимуляторы!K3=\"Моториум бета\",0.5^(COUNTIF(Стимуляторы!$D$3:K3,\"Моториум бета\")+$AB$9-1)*$D$25,0)","v":0},{"$f":"IF(Стимуляторы!L3=\"Моториум бета\",0.5^(COUNTIF(Стимуляторы!$D$3:L3,\"Моториум бета\")+$AB$9-1)*$D$25,0)","v":0},{"$f":"IF(Стимуляторы!M3=\"Моториум бета\",0.5^(COUNTIF(Стимуляторы!$D$3:M3,\"Моториум бета\")+$AB$9-1)*$D$25,0)","v":0},{"$f":"COUNTIF(R10:AA10,\">0\")","v":0},null,null,null,null,null,null,null,null,null,null,null,0]
{"$rows_left_out":33}