{"text_format":"1","workbook":"xlsx","n_sheets":8,"sheets":["z","l","db","in","out","tot","zav","!!!"],"not_rendered":{"charts":0,"images":0,"macros":1,"external_links":0,"defined_names":13,"comments":4,"pivot_tables":0},"unopened":[],"bounds":{"document_bytes":16777216,"sheet_cells":100000,"rows_first":2000,"rows_last":500,"rows_between":2000,"halvings":0,"cell_chars":16384,"cell_head_chars":4096},"cells_cut":0,"cells_raw":0,"read":"whole","date_system":"1900"}

{"sheet":"z","index":0,"n_rows":101,"n_cols":6,"rows_kept":101,"cut":false,"hidden":true,"merged":[]}
[null,{"$f":"#N/A","v":{"$error":"#N/A"}},null,{"$f":"SUM(D2:D101)","v":0},{"$f":"COUNTIF(A2:A101,\"><\"\"\")","v":0},{"$f":"E1<>B1","v":{"$error":"#N/A"}}]
[{"$f":"#N/A","v":{"$error":"#N/A"}}]
[{"$f":"#N/A","v":{"$error":"#N/A"}}]
[{"$f":"#N/A","v":{"$error":"#N/A"}}]
[{"$f":"#N/A","v":{"$error":"#N/A"}}]
[{"$f":"#N/A","v":{"$error":"#N/A"}}]
[{"$f":"#N/A","v":{"$error":"#N/A"}}]
[{"$f":"#N/A","v":{"$error":"#N/A"}}]
[{"$f":"#N/A","v":{"$error":"#N/A"}}]
[{"$f":"#N/A","v":{"$error":"#N/A"}}]
{"$rows_left_out":92}
{"sheet":"l","index":1,"n_rows":11,"n_cols":14,"rows_kept":11,"cut":false,"hidden":false,"merged":[]}
[]
["NN","Категория","Наимeнование","ед изм","дата посл поставки","цена посл поставки","Столбец2","Действ цена","с даты","01.07.17","02.08.17","15.02.17","03.08.17","Столбец1"]
[{"$f":"ROW()-ROW($A$2)","v":1},"кат1","имя1",null,{"$f":"LOOKUP(tot!$A$1,_db[дата]/(_db[приход]>0)/(_pr[[#This Row],[Наимeнование]]=_db[наименование]))","v":"2017-11-10"},{"$f":"LOOKUP(tot!$A$1,_db[дата]/(_db[приход]>0)/(_pr[[#This Row],[Наимeнование]]=_db[наименование]),_db[цена с НДС])","v":11},null,{"$f":"LOOKUP(99^99,$J3:$BK3)","v":5},{"$f":"--LOOKUP(_pr[[#This Row],[Действ цена]],$J3:$BP3,$J$2:$BP$2)","v":"2017-08-03"},1,4,null,5]
[{"$f":"ROW()-ROW($A$2)","v":2},"кат1","имя2",null,{"$f":"LOOKUP(tot!$A$1,_db[дата]/(_db[приход]>0)/(_pr[[#This Row],[Наимeнование]]=_db[наименование]))","v":"2017-11-11"},{"$f":"LOOKUP(tot!$A$1,_db[дата]/(_db[приход]>0)/(_pr[[#This Row],[Наимeнование]]=_db[наименование]),_db[цена с НДС])","v":11},null,{"$f":"LOOKUP(99^99,$J4:$BK4)","v":2},{"$f":"--LOOKUP(_pr[[#This Row],[Действ цена]],$J4:$BP4,$J$2:$BP$2)","v":"2017-07-01"},2]
[3,"кат1","имя3",null,{"$f":"LOOKUP(tot!$A$1,_db[дата]/(_db[приход]>0)/(_pr[[#This Row],[Наимeнование]]=_db[наименование]))","v":"2017-11-12"},{"$f":"LOOKUP(tot!$A$1,_db[дата]/(_db[приход]>0)/(_pr[[#This Row],[Наимeнование]]=_db[наименование]),_db[цена с НДС])","v":11},null,3,{"$f":"--LOOKUP(_pr[[#This Row],[Действ цена]],$J5:$BP5,$J$2:$BP$2)","v":"2017-07-01"},3]
[4,"кат2","имя4",null,{"$f":"LOOKUP(tot!$A$1,_db[дата]/(_db[приход]>0)/(_pr[[#This Row],[Наимeнование]]=_db[наименование]))","v":"2017-11-13"},{"$f":"LOOKUP(tot!$A$1,_db[дата]/(_db[приход]>0)/(_pr[[#This Row],[Наимeнование]]=_db[наименование]),_db[цена с НДС])","v":11},null,4,{"$f":"--LOOKUP(_pr[[#This Row],[Действ цена]],$J6:$BP6,$J$2:$BP$2)","v":"2017-07-01"},4]
[5,"кат2","имя5",null,{"$f":"LOOKUP(tot!$A$1,_db[дата]/(_db[приход]>0)/(_pr[[#This Row],[Наимeнование]]=_db[наименование]))","v":"2017-11-14"},{"$f":"LOOKUP(tot!$A$1,_db[дата]/(_db[приход]>0)/(_pr[[#This Row],[Наимeнование]]=_db[наименование]),_db[цена с НДС])","v":11},null,5,{"$f":"--LOOKUP(_pr[[#This Row],[Действ цена]],$J7:$BP7,$J$2:$BP$2)","v":"2017-07-01"},5]
[6,"кат2","имя6",null,{"$f":"LOOKUP(tot!$A$1,_db[дата]/(_db[приход]>0)/(_pr[[#This Row],[Наимeнование]]=_db[наименование]))","v":"2017-11-15"},{"$f":"LOOKUP(tot!$A$1,_db[дата]/(_db[приход]>0)/(_pr[[#This Row],[Наимeнование]]=_db[наименование]),_db[цена с НДС])","v":11},null,8,{"$f":"--LOOKUP(_pr[[#This Row],[Действ цена]],$J8:$BP8,$J$2:$BP$2)","v":"2017-02-15"},6,null,8]
[7,"кат3","имя7",null,{"$f":"LOOKUP(tot!$A$1,_db[дата]/(_db[приход]>0)/(_pr[[#This Row],[Наимeнование]]=_db[наименование]))","v":"2017-11-16"},{"$f":"LOOKUP(tot!$A$1,_db[дата]/(_db[приход]>0)/(_pr[[#This Row],[Наимeнование]]=_db[наименование]),_db[цена с НДС])","v":11},null,7,{"$f":"--LOOKUP(_pr[[#This Row],[Действ цена]],$J9:$BP9,$J$2:$BP$2)","v":"2017-07-01"},7]
[8,"кат3","имя8",null,{"$f":"LOOKUP(tot!$A$1,_db[дата]/(_db[приход]>0)/(_pr[[#This Row],[Наимeнование]]=_db[наименование]))","v":"2017-11-17"},{"$f":"LOOKUP(tot!$A$1,_db[дата]/(_db[приход]>0)/(_pr[[#This Row],[Наимeнование]]=_db[наименование]),_db[цена с НДС])","v":11},null,8,{"$f":"--LOOKUP(_pr[[#This Row],[Действ цена]],$J10:$BP10,$J$2:$BP$2)","v":"2017-07-01"},8]
{"$rows_left_out":2}
{"sheet":"db","index":2,"n_rows":23,"n_cols":14,"rows_kept":23,"cut":false,"hidden":false,"merged":[]}
["2019-05-05",null,null,null,{"$f":"_xlfn.AGGREGATE(9,5,_db[приход])","v":40},{"$f":"_xlfn.AGGREGATE(9,5,_db[расход])","v":6},null,null,null,{"$f":"MATCH(\"дата/время формирования накладной\",2:2,)","v":13}]
["категория","наименование","дата","ед изм","приход","расход","От кого","Кому","основание/назначение","ном вх накладной","дата накл","цена с НДС","дата/время формирования накладной","прим"]
["кат1","имя1","2017-09-01",null,2,null,null,null,null,null,null,11]
["кат2","имя4","2017-10-01",null,2,null,null,null,null,null,null,11]
["кат1","имя1","2017-11-01",null,1,null,null,null,null,null,null,13]
["кат1","имя3","2017-11-01",null,1,3,"rhhe","врврве","ui7io7",null,null,10,"2018-07-02T18:09:02"]
["кат2","имя5","2017-11-01",null,1,null,"rhhe","врврве",null,null,null,10]
["кат2","имя6","2017-11-01",null,2,3,"rhhe","врврве",null,null,null,11,"2018-07-02T18:09:02"]
["кат3","имя7","2017-11-01",null,1,null,"555e",null,null,null,null,10]
["кат3","имя8","2017-11-03",null,4,null,null,null,null,null,null,8]
{"$rows_left_out":14}
{"sheet":"in","index":3,"n_rows":58,"n_cols":10,"rows_kept":58,"cut":false,"hidden":false,"merged":[[4,1,4,3]]}
["НАКЛАДНАЯ НА ПРИЕМ ТМЦ НА СКЛАД",null,null,null,null,"служебный столбец и правее, не влезать, не менять ничего",{"$f":"MATCH(\"Наименование\",B1:B18,)+1","v":7},"первый ряд таблицы",{"$f":"MATCH(\"сдал\",A1:A64,)-G1","v":50},"кол-во рядов таблицы"]
["Дата/время",{"$f":"INDEX(_db[дата],in!F7-F2)","v":"2017-11-01"},null,null,null,{"$f":"MATCH(\"дата\",db!C1:C6,)","v":2}]
["От кого",{"$f":"B57","v":"rhhe"}]
["Кому","СКЛАД"]
["Основание/\nназначение",null,null,null,null,null,{"$f":"OR(H5<>F57,I5<>F57)","v":false},{"$f":"COUNTIF(H7:H56,B2)","v":2},{"$f":"COUNTIF(I7:I56,B57)","v":2}]
["ном","Наименование","ед изм","кол-во"]
[1,{"$f":"IF($F7=0,\"\",INDEX(_db[наименование],$F7-$F$2))","v":"имя3"},{"$f":"IF($F7=0,\"\",INDEX(_db[ед изм],$F7-$F$2))","v":0},{"$f":"IF(F7=0,\"\",INDEX(_db[расход],$F7-$F$2))","v":3},null,6,null,{"$f":"IF($F7=0,\"\",INDEX(_db[дата],$F7-$F$2))","v":"2017-11-01"},{"$f":"IF($F7=0,\"\",INDEX(_db[От кого],$F7-$F$2))","v":"rhhe"}]
[2,{"$f":"IF($F8=0,\"\",INDEX(_db[наименование],$F8-$F$2))","v":"имя6"},{"$f":"IF($F8=0,\"\",INDEX(_db[ед изм],$F8-$F$2))","v":0},{"$f":"IF(F8=0,\"\",INDEX(_db[расход],$F8-$F$2))","v":3},null,8,null,{"$f":"IF($F8=0,\"\",INDEX(_db[дата],$F8-$F$2))","v":"2017-11-01"},{"$f":"IF($F8=0,\"\",INDEX(_db[От кого],$F8-$F$2))","v":"rhhe"}]
[3,{"$f":"IF($F9=0,\"\",INDEX(_db[наименование],$F9-$F$2))","v":""},{"$f":"IF($F9=0,\"\",INDEX(_db[ед изм],$F9-$F$2))","v":""},{"$f":"IF(F9=0,\"\",INDEX(_db[расход],$F9-$F$2))","v":""},null,null,null,{"$f":"IF($F9=0,\"\",INDEX(_db[дата],$F9-$F$2))","v":""},{"$f":"IF($F9=0,\"\",INDEX(_db[От кого],$F9-$F$2))","v":""}]
[4,{"$f":"IF($F10=0,\"\",INDEX(_db[наименование],$F10-$F$2))","v":""},{"$f":"IF($F10=0,\"\",INDEX(_db[ед изм],$F10-$F$2))","v":""},{"$f":"IF(F10=0,\"\",INDEX(_db[расход],$F10-$F$2))","v":""},null,null,null,{"$f":"IF($F10=0,\"\",INDEX(_db[дата],$F10-$F$2))","v":""},{"$f":"IF($F10=0,\"\",INDEX(_db[От кого],$F10-$F$2))","v":""}]
{"$rows_left_out":49}
{"sheet":"out","index":4,"n_rows":58,"n_cols":10,"rows_kept":58,"cut":false,"hidden":false,"merged":[[4,1,4,3]]}
["НАКЛАДНАЯ НА ОТПУСК ТМЦ СО СКЛАДА",null,null,null,null,"служебный столбец и строка, не влезать, не менять ничего",{"$f":"MATCH(\"Наименование\",B1:B18,)+1","v":7},"первый ряд таблицы",{"$f":"MATCH(\"сдал\",A1:A64,)-G1","v":50},"кол-во рядов таблицы"]
["Дата/время",{"$f":"INDEX(_db[дата],out!F7-F2)","v":"2017-11-01"},null,null,null,{"$f":"MATCH(\"дата\",db!C1:C6,)","v":2}]
["От кого","СКЛАД"]
["Кому",{"$f":"INDEX(_db[Кому],out!F7-F2)","v":"врврве"}]
["Основание/\nназначение",{"$f":"INDEX(db!I3:I23,out!F7-F2)","v":"ui7io7"},null,null,null,null,{"$f":"OR(H5<>F57,I5<>F57)","v":false},{"$f":"COUNTIF(H7:H56,B2)","v":2},{"$f":"COUNTIF(I7:I56,B4)","v":2}]
["ном","Наименование","Ед изм","кол-во"]
[1,{"$f":"IF($F7=0,\"\",INDEX(_db[наименование],$F7-$F$2))","v":"имя3"},{"$f":"IF($F7=0,\"\",INDEX(_db[ед изм],$F7-$F$2))","v":0},{"$f":"IF(F7=0,\"\",INDEX(_db[расход],$F7-$F$2))","v":3},null,{"$f":"in!F7","v":6},null,{"$f":"IF($F7=0,\"\",INDEX(_db[дата],$F7-$F$2))","v":"2017-11-01"},{"$f":"IF($F7=0,\"\",INDEX(_db[Кому],$F7-$F$2))","v":"врврве"}]
[2,{"$f":"IF($F8=0,\"\",INDEX(_db[наименование],$F8-$F$2))","v":"имя6"},{"$f":"IF($F8=0,\"\",INDEX(_db[ед изм],$F8-$F$2))","v":0},{"$f":"IF(F8=0,\"\",INDEX(_db[расход],$F8-$F$2))","v":3},null,{"$f":"in!F8","v":8},null,{"$f":"IF($F8=0,\"\",INDEX(_db[дата],$F8-$F$2))","v":"2017-11-01"},{"$f":"IF($F8=0,\"\",INDEX(_db[Кому],$F8-$F$2))","v":"врврве"}]
[3,{"$f":"IF($F9=0,\"\",INDEX(_db[наименование],$F9-$F$2))","v":""},{"$f":"IF($F9=0,\"\",INDEX(_db[ед изм],$F9-$F$2))","v":""},{"$f":"IF(F9=0,\"\",INDEX(_db[расход],$F9-$F$2))","v":""},null,{"$f":"in!F9","v":0},null,{"$f":"IF($F9=0,\"\",INDEX(_db[дата],$F9-$F$2))","v":""},{"$f":"IF($F9=0,\"\",INDEX(_db[Кому],$F9-$F$2))","v":""}]
[4,{"$f":"IF($F10=0,\"\",INDEX(_db[наименование],$F10-$F$2))","v":""},{"$f":"IF($F10=0,\"\",INDEX(_db[ед изм],$F10-$F$2))","v":""},{"$f":"IF(F10=0,\"\",INDEX(_db[расход],$F10-$F$2))","v":""},null,{"$f":"in!F10","v":0},null,{"$f":"IF($F10=0,\"\",INDEX(_db[дата],$F10-$F$2))","v":""},{"$f":"IF($F10=0,\"\",INDEX(_db[Кому],$F10-$F$2))","v":""}]
{"$rows_left_out":49}
{"sheet":"tot","index":5,"n_rows":13,"n_cols":16,"rows_kept":13,"cut":false,"hidden":false,"merged":[[0,0,0,1]]}
[{"$f":"db!A1","v":"2019-05-05"},null,null,"начало периода",null,{"$f":"IF(E1=0,DATE(YEAR(A1),MONTH(A1),1),E1)","v":"2019-05-01"}]
[null,null,null,"окончание периода",null,{"$f":"IF(E2=0,DATE(YEAR(A1),1+MONTH(A1),),E2)","v":"2019-05-31"}]
[null,null,null,{"$f":"_xlfn.AGGREGATE(9,5,_tot[Кол-во на начало])","v":34},{"$f":"_xlfn.AGGREGATE(9,5,_tot[Кол-во на окончание])","v":34},{"$f":"_xlfn.AGGREGATE(9,5,_tot[Сумма на начало])","v":374},{"$f":"_xlfn.AGGREGATE(9,5,_tot[Сумма на окончание])","v":374},null,null,{"$f":"_xlfn.AGGREGATE(9,5,_tot[Кол-во приход])","v":0},{"$f":"_xlfn.AGGREGATE(9,5,_tot[Кол-во расход])","v":0},{"$f":"_xlfn.AGGREGATE(9,5,_tot[Кол-во оборот])","v":0},{"$f":"_xlfn.AGGREGATE(9,5,_tot[сумма приход])","v":0},{"$f":"_xlfn.AGGREGATE(9,5,_tot[сумма расход])","v":0},{"$f":"_xlfn.AGGREGATE(9,5,_tot[сумма оборот])","v":0}]
["NN","Категория","Нaименование","Кол-во на начало","Кол-во на окончание","Сумма на начало","Сумма на окончание","Столбец1","цена на окончание","Кол-во приход","Кол-во расход","Кол-во оборот","сумма приход","сумма расход","сумма оборот","Примечание"]
[{"$f":"ROW()-ROW($A$4)","v":1},null,"имя1",{"$f":"SUMIFS(_db[приход],_db[наименование],_tot[[#This Row],[Нaименование]],_db[дата],\"<\"&$F$1)-SUMIFS(_db[расход],_db[наименование],_tot[[#This Row],[Нaименование]],_db[дата],\"<\"&$F$1)","v":5},{"$f":"SUMIFS(_db[приход],_db[наименование],_tot[[#This Row],[Нaименование]],_db[дата],\"<\"&$F$2)-SUMIFS(_db[расход],_db[наименование],_tot[[#This Row],[Нaименование]],_db[дата],\"<\"&$F$2)","v":5},{"$f":"_tot[[#This Row],[Кол-во на начало]]*_tot[[#This Row],[цена на окончание]]","v":55},{"$f":"_tot[[#This Row],[Кол-во на окончание]]*_tot[[#This Row],[цена на окончание]]","v":55},null,{"$f":"LOOKUP($F$2,_db[дата]/(_db[наименование]=_tot[[#This Row],[Нaименование]])/(_db[приход]>0),_db[цена с НДС])","v":11},{"$f":"SUMIFS(_db[приход],_db[наименование],_tot[[#This Row],[Нaименование]],_db[дата],\">=\"&$F$1,_db[дата],\"<=\"&$F$2)","v":0},{"$f":"SUMIFS(_db[расход],_db[наименование],_tot[[#This Row],[Нaименование]],_db[дата],\">=\"&$F$1,_db[дата],\"<=\"&$F$2)","v":0},{"$f":"_tot[[#This Row],[Кол-во на начало]]+_tot[[#This Row],[Кол-во приход]]-_tot[[#This Row],[Кол-во на окончание]]","v":0},{"$f":"_tot[[#This Row],[цена на окончание]]*_tot[[#This Row],[Кол-во приход]]","v":0},{"$f":"_tot[[#This Row],[Кол-во расход]]*_tot[[#This Row],[цена на окончание]]","v":0},{"$f":"_tot[[#This Row],[Кол-во оборот]]*_tot[[#This Row],[цена на окончание]]","v":0}]
[{"$f":"ROW()-ROW($A$4)","v":2},null,"имя2",{"$f":"SUMIFS(_db[приход],_db[наименование],_tot[[#This Row],[Нaименование]],_db[дата],\"<\"&$F$1)-SUMIFS(_db[расход],_db[наименование],_tot[[#This Row],[Нaименование]],_db[дата],\"<\"&$F$1)","v":2},{"$f":"SUMIFS(_db[приход],_db[наименование],_tot[[#This Row],[Нaименование]],_db[дата],\"<\"&$F$2)-SUMIFS(_db[расход],_db[наименование],_tot[[#This Row],[Нaименование]],_db[дата],\"<\"&$F$2)","v":2},{"$f":"_tot[[#This Row],[Кол-во на начало]]*_tot[[#This Row],[цена на окончание]]","v":22},{"$f":"_tot[[#This Row],[Кол-во на окончание]]*_tot[[#This Row],[цена на окончание]]","v":22},null,{"$f":"LOOKUP($F$2,_db[дата]/(_db[наименование]=_tot[[#This Row],[Нaименование]])/(_db[приход]>0),_db[цена с НДС])","v":11},{"$f":"SUMIFS(_db[приход],_db[наименование],_tot[[#This Row],[Нaименование]],_db[дата],\">=\"&$F$1,_db[дата],\"<=\"&$F$2)","v":0},{"$f":"SUMIFS(_db[расход],_db[наименование],_tot[[#This Row],[Нaименование]],_db[дата],\">=\"&$F$1,_db[дата],\"<=\"&$F$2)","v":0},{"$f":"_tot[[#This Row],[Кол-во на начало]]+_tot[[#This Row],[Кол-во приход]]-_tot[[#This Row],[Кол-во на окончание]]","v":0},{"$f":"_tot[[#This Row],[цена на окончание]]*_tot[[#This Row],[Кол-во приход]]","v":0},{"$f":"_tot[[#This Row],[Кол-во расход]]*_tot[[#This Row],[цена на окончание]]","v":0},{"$f":"_tot[[#This Row],[Кол-во оборот]]*_tot[[#This Row],[цена на окончание]]","v":0}]
[3,null,"имя3",{"$f":"SUMIFS(_db[приход],_db[наименование],_tot[[#This Row],[Нaименование]],_db[дата],\"<\"&$F$1)-SUMIFS(_db[расход],_db[наименование],_tot[[#This Row],[Нaименование]],_db[дата],\"<\"&$F$1)","v":0},{"$f":"SUMIFS(_db[приход],_db[наименование],_tot[[#This Row],[Нaименование]],_db[дата],\"<\"&$F$2)-SUMIFS(_db[расход],_db[наименование],_tot[[#This Row],[Нaименование]],_db[дата],\"<\"&$F$2)","v":0},{"$f":"_tot[[#This Row],[Кол-во на начало]]*_tot[[#This Row],[цена на окончание]]","v":0},{"$f":"_tot[[#This Row],[Кол-во на окончание]]*_tot[[#This Row],[цена на окончание]]","v":0},null,{"$f":"LOOKUP($F$2,_db[дата]/(_db[наименование]=_tot[[#This Row],[Нaименование]])/(_db[приход]>0),_db[цена с НДС])","v":11},{"$f":"SUMIFS(_db[приход],_db[наименование],_tot[[#This Row],[Нaименование]],_db[дата],\">=\"&$F$1,_db[дата],\"<=\"&$F$2)","v":0},{"$f":"SUMIFS(_db[расход],_db[наименование],_tot[[#This Row],[Нaименование]],_db[дата],\">=\"&$F$1,_db[дата],\"<=\"&$F$2)","v":0},{"$f":"_tot[[#This Row],[Кол-во на начало]]+_tot[[#This Row],[Кол-во приход]]-_tot[[#This Row],[Кол-во на окончание]]","v":0},{"$f":"_tot[[#This Row],[цена на окончание]]*_tot[[#This Row],[Кол-во приход]]","v":0},{"$f":"_tot[[#This Row],[Кол-во расход]]*_tot[[#This Row],[цена на окончание]]","v":0},{"$f":"_tot[[#This Row],[Кол-во оборот]]*_tot[[#This Row],[цена на окончание]]","v":0}]
[4,null,"имя4",{"$f":"SUMIFS(_db[приход],_db[наименование],_tot[[#This Row],[Нaименование]],_db[дата],\"<\"&$F$1)-SUMIFS(_db[расход],_db[наименование],_tot[[#This Row],[Нaименование]],_db[дата],\"<\"&$F$1)","v":4},{"$f":"SUMIFS(_db[приход],_db[наименование],_tot[[#This Row],[Нaименование]],_db[дата],\"<\"&$F$2)-SUMIFS(_db[расход],_db[наименование],_tot[[#This Row],[Нaименование]],_db[дата],\"<\"&$F$2)","v":4},{"$f":"_tot[[#This Row],[Кол-во на начало]]*_tot[[#This Row],[цена на окончание]]","v":44},{"$f":"_tot[[#This Row],[Кол-во на окончание]]*_tot[[#This Row],[цена на окончание]]","v":44},null,{"$f":"LOOKUP($F$2,_db[дата]/(_db[наименование]=_tot[[#This Row],[Нaименование]])/(_db[приход]>0),_db[цена с НДС])","v":11},{"$f":"SUMIFS(_db[приход],_db[наименование],_tot[[#This Row],[Нaименование]],_db[дата],\">=\"&$F$1,_db[дата],\"<=\"&$F$2)","v":0},{"$f":"SUMIFS(_db[расход],_db[наименование],_tot[[#This Row],[Нaименование]],_db[дата],\">=\"&$F$1,_db[дата],\"<=\"&$F$2)","v":0},{"$f":"_tot[[#This Row],[Кол-во на начало]]+_tot[[#This Row],[Кол-во приход]]-_tot[[#This Row],[Кол-во на окончание]]","v":0},{"$f":"_tot[[#This Row],[цена на окончание]]*_tot[[#This Row],[Кол-во приход]]","v":0},{"$f":"_tot[[#This Row],[Кол-во расход]]*_tot[[#This Row],[цена на окончание]]","v":0},{"$f":"_tot[[#This Row],[Кол-во оборот]]*_tot[[#This Row],[цена на окончание]]","v":0}]
[5,null,"имя5",{"$f":"SUMIFS(_db[приход],_db[наименование],_tot[[#This Row],[Нaименование]],_db[дата],\"<\"&$F$1)-SUMIFS(_db[расход],_db[наименование],_tot[[#This Row],[Нaименование]],_db[дата],\"<\"&$F$1)","v":3},{"$f":"SUMIFS(_db[приход],_db[наименование],_tot[[#This Row],[Нaименование]],_db[дата],\"<\"&$F$2)-SUMIFS(_db[расход],_db[наименование],_tot[[#This Row],[Нaименование]],_db[дата],\"<\"&$F$2)","v":3},{"$f":"_tot[[#This Row],[Кол-во на начало]]*_tot[[#This Row],[цена на окончание]]","v":33},{"$f":"_tot[[#This Row],[Кол-во на окончание]]*_tot[[#This Row],[цена на окончание]]","v":33},null,{"$f":"LOOKUP($F$2,_db[дата]/(_db[наименование]=_tot[[#This Row],[Нaименование]])/(_db[приход]>0),_db[цена с НДС])","v":11},{"$f":"SUMIFS(_db[приход],_db[наименование],_tot[[#This Row],[Нaименование]],_db[дата],\">=\"&$F$1,_db[дата],\"<=\"&$F$2)","v":0},{"$f":"SUMIFS(_db[расход],_db[наименование],_tot[[#This Row],[Нaименование]],_db[дата],\">=\"&$F$1,_db[дата],\"<=\"&$F$2)","v":0},{"$f":"_tot[[#This Row],[Кол-во на начало]]+_tot[[#This Row],[Кол-во приход]]-_tot[[#This Row],[Кол-во на окончание]]","v":0},{"$f":"_tot[[#This Row],[цена на окончание]]*_tot[[#This Row],[Кол-во приход]]","v":0},{"$f":"_tot[[#This Row],[Кол-во расход]]*_tot[[#This Row],[цена на окончание]]","v":0},{"$f":"_tot[[#This Row],[Кол-во оборот]]*_tot[[#This Row],[цена на окончание]]","v":0}]
[6,null,"имя6",{"$f":"SUMIFS(_db[приход],_db[наименование],_tot[[#This Row],[Нaименование]],_db[дата],\"<\"&$F$1)-SUMIFS(_db[расход],_db[наименование],_tot[[#This Row],[Нaименование]],_db[дата],\"<\"&$F$1)","v":1},{"$f":"SUMIFS(_db[приход],_db[наименование],_tot[[#This Row],[Нaименование]],_db[дата],\"<\"&$F$2)-SUMIFS(_db[расход],_db[наименование],_tot[[#This Row],[Нaименование]],_db[дата],\"<\"&$F$2)","v":1},{"$f":"_tot[[#This Row],[Кол-во на начало]]*_tot[[#This Row],[цена на окончание]]","v":11},{"$f":"_tot[[#This Row],[Кол-во на окончание]]*_tot[[#This Row],[цена на окончание]]","v":11},null,{"$f":"LOOKUP($F$2,_db[дата]/(_db[наименование]=_tot[[#This Row],[Нaименование]])/(_db[приход]>0),_db[цена с НДС])","v":11},{"$f":"SUMIFS(_db[приход],_db[наименование],_tot[[#This Row],[Нaименование]],_db[дата],\">=\"&$F$1,_db[дата],\"<=\"&$F$2)","v":0},{"$f":"SUMIFS(_db[расход],_db[наименование],_tot[[#This Row],[Нaименование]],_db[дата],\">=\"&$F$1,_db[дата],\"<=\"&$F$2)","v":0},{"$f":"_tot[[#This Row],[Кол-во на начало]]+_tot[[#This Row],[Кол-во приход]]-_tot[[#This Row],[Кол-во на окончание]]","v":0},{"$f":"_tot[[#This Row],[цена на окончание]]*_tot[[#This Row],[Кол-во приход]]","v":0},{"$f":"_tot[[#This Row],[Кол-во расход]]*_tot[[#This Row],[цена на окончание]]","v":0},{"$f":"_tot[[#This Row],[Кол-во оборот]]*_tot[[#This Row],[цена на окончание]]","v":0}]
{"$rows_left_out":4}
{"sheet":"zav","index":6,"n_rows":1,"n_cols":2,"rows_kept":1,"cut":false,"hidden":false,"merged":[]}
["2017-01-01","пупкин"]

{"sheet":"!!!","index":7,"n_rows":13,"n_cols":2,"rows_kept":13,"cut":false,"hidden":false,"merged":[]}
[{"$f":"ROW()","v":1},"для формирования накладных выделить нужные строки на листе db целиком (кликать в области номера строки листа) (если не подряд, то с нажатым Ctrl)"]
[{"$f":"ROW()","v":2},"если даты, фио в каких либо выделенных строках не равны самой верхней выделенной, то область таблицы накладных заливается цветом"]
[{"$f":"ROW()","v":3},"отправлять каждый месяц строки переданных прорабам ТМЦ для подготовки ими служебок на их списание"]
[{"$f":"ROW()","v":4},"сиотрите примечания к ячейкам"]
[{"$f":"ROW()","v":5},"для работы файла макросы д/б разрешены"]
[{"$f":"ROW()","v":6}]
[{"$f":"ROW()","v":7}]
[{"$f":"ROW()","v":8}]
[{"$f":"ROW()","v":9}]
[{"$f":"ROW()","v":10}]
{"$rows_left_out":3}