{"text_format":"1","workbook":"xlsx","n_sheets":6,"sheets":["СКЛАД","ПОИСК","Заказ","DX","LR","Общий"],"not_rendered":{"charts":0,"images":0,"macros":1,"external_links":0,"defined_names":0,"comments":0,"pivot_tables":0},"unopened":[],"bounds":{"document_bytes":16777216,"sheet_cells":100000,"rows_first":2000,"rows_last":500,"rows_between":2000,"halvings":0,"cell_chars":16384,"cell_head_chars":4096},"cells_cut":0,"cells_raw":0,"read":"whole","date_system":"1900"}

{"sheet":"СКЛАД","index":0,"n_rows":19,"n_cols":4,"rows_kept":19,"cut":false,"hidden":false,"merged":[[18,0,18,2]]}
[]
[]
["№","Производитель","Категория","Ссылка"]
[1,"Gira","Электроустановка"]
[2,"Legrand","Щиты и комплектующие"]
[3,"Legrand","Sagane (электроустановка)"]
[4,"Legrand","Valena (электроустановка)"]
[5,"Legrand","Suno (электроустановка)"]
[6,"Legrand","Cariva (электроустановка)"]
[7,"Legrand","Galea Life (электроустановка)"]
[8,"Legrand","DX (автоматика)"]
[9,"Legrand","LR (автоматика)"]
[10,"ABB","Электроустановка"]
[12,"Simon","Электроустановка"]
[13,"Bticino","Электроустановка"]
[14,"Merten","M-Smart (электроустановка)"]
[15,"SLV","Блоки питания"]
[16,"Donolux","Светильник"]
["Если Вам известен артикул нужного товара, воспользуйтесь поиском. "]

{"sheet":"ПОИСК","index":1,"n_rows":357,"n_cols":6,"rows_kept":357,"cut":false,"hidden":false,"merged":[]}
[]
[]
["Арт.","Наименование","Остаток","Кол-во","Цена, руб.","Сумма, руб."]
["774301",{"$f":"IFERROR(VLOOKUP(A4,Общий!A:D,2,0), \"Товар отсутствует на складе\")","v":"Выключатель одноклавишный - Valena - 10 A - 250 В~ - слоновая кость"},{"$f":"IFERROR(VLOOKUP(A4,Общий!A:D,3,0), \"\")","v":1},null,{"$f":"IFERROR(VLOOKUP(A4,Общий!A:D,4,0), \"\")","v":217.81},{"$f":"IFERROR(D4*E4,\"\")","v":0}]
["774420",{"$f":"IFERROR(VLOOKUP(A5,Общий!A:D,2,0), \"Товар отсутствует на складе\")","v":"Товар отсутствует на складе"},{"$f":"IFERROR(VLOOKUP(A5,Общий!A:D,3,0), \"\")","v":""},null,{"$f":"IFERROR(VLOOKUP(A5,Общий!A:D,4,0), \"\")","v":""},{"$f":"IFERROR(D5*E5,\"\")","v":""}]
[null,{"$f":"IFERROR(VLOOKUP(A6,Общий!A:D,2,0),\"Товар отсутствует на складе\")","v":"Товар отсутствует на складе"},{"$f":"IFERROR(VLOOKUP(A6,Общий!A:D,3,0), \"\")","v":""},null,{"$f":"IFERROR(VLOOKUP(A6,Общий!A:D,4,0), \"\")","v":""},""]
[null,{"$f":"IFERROR(VLOOKUP(A7,Общий!A:D,2,0),\"Товар отсутствует на складе\")","v":"Товар отсутствует на складе"},{"$f":"IFERROR(VLOOKUP(A7,Общий!A:D,3,0), \"\")","v":""},null,{"$f":"IFERROR(VLOOKUP(A7,Общий!A:D,4,0), \"\")","v":""},""]
[null,{"$f":"IFERROR(VLOOKUP(A8,Общий!A:D,2,0),\"Товар отсутствует на складе\")","v":"Товар отсутствует на складе"},{"$f":"IFERROR(VLOOKUP(A8,Общий!A:D,3,0), \"\")","v":""},null,{"$f":"IFERROR(VLOOKUP(A8,Общий!A:D,4,0), \"\")","v":""},""]
[null,{"$f":"IFERROR(VLOOKUP(A9,Общий!A:D,2,0),\"Товар отсутствует на складе\")","v":"Товар отсутствует на складе"},{"$f":"IFERROR(VLOOKUP(A9,Общий!A:D,3,0), \"\")","v":""},null,{"$f":"IFERROR(VLOOKUP(A9,Общий!A:D,4,0), \"\")","v":""},""]
[null,{"$f":"IFERROR(VLOOKUP(A10,Общий!A:D,2,0),\"Товар отсутствует на складе\")","v":"Товар отсутствует на складе"},{"$f":"IFERROR(VLOOKUP(A10,Общий!A:D,3,0), \"\")","v":""},null,{"$f":"IFERROR(VLOOKUP(A10,Общий!A:D,4,0), \"\")","v":""},""]
[null,{"$f":"IFERROR(VLOOKUP(A11,Общий!A:D,2,0),\"Товар отсутствует на складе\")","v":"Товар отсутствует на складе"},{"$f":"IFERROR(VLOOKUP(A11,Общий!A:D,3,0), \"\")","v":""},null,{"$f":"IFERROR(VLOOKUP(A11,Общий!A:D,4,0), \"\")","v":""},""]
[null,{"$f":"IFERROR(VLOOKUP(A12,Общий!A:D,2,0),\"Товар отсутствует на складе\")","v":"Товар отсутствует на складе"},{"$f":"IFERROR(VLOOKUP(A12,Общий!A:D,3,0), \"\")","v":""},null,{"$f":"IFERROR(VLOOKUP(A12,Общий!A:D,4,0), \"\")","v":""},""]
[null,{"$f":"IFERROR(VLOOKUP(A13,Общий!A:D,2,0),\"Товар отсутствует на складе\")","v":"Товар отсутствует на складе"},{"$f":"IFERROR(VLOOKUP(A13,Общий!A:D,3,0), \"\")","v":""},null,{"$f":"IFERROR(VLOOKUP(A13,Общий!A:D,4,0), \"\")","v":""},""]
[null,{"$f":"IFERROR(VLOOKUP(A14,Общий!A:D,2,0),\"Товар отсутствует на складе\")","v":"Товар отсутствует на складе"},{"$f":"IFERROR(VLOOKUP(A14,Общий!A:D,3,0), \"\")","v":""},null,{"$f":"IFERROR(VLOOKUP(A14,Общий!A:D,4,0), \"\")","v":""},""]
[null,{"$f":"IFERROR(VLOOKUP(A15,Общий!A:D,2,0),\"Товар отсутствует на складе\")","v":"Товар отсутствует на складе"},{"$f":"IFERROR(VLOOKUP(A15,Общий!A:D,3,0), \"\")","v":""},null,{"$f":"IFERROR(VLOOKUP(A15,Общий!A:D,4,0), \"\")","v":""},""]
[null,{"$f":"IFERROR(VLOOKUP(A16,Общий!A:D,2,0),\"Товар отсутствует на складе\")","v":"Товар отсутствует на складе"},{"$f":"IFERROR(VLOOKUP(A16,Общий!A:D,3,0), \"\")","v":""},null,{"$f":"IFERROR(VLOOKUP(A16,Общий!A:D,4,0), \"\")","v":""},""]
[null,{"$f":"IFERROR(VLOOKUP(A17,Общий!A:D,2,0),\"Товар отсутствует на складе\")","v":"Товар отсутствует на складе"},{"$f":"IFERROR(VLOOKUP(A17,Общий!A:D,3,0), \"\")","v":""},null,{"$f":"IFERROR(VLOOKUP(A17,Общий!A:D,4,0), \"\")","v":""},{"$f":"IFERROR(D17*E17,\"\")","v":""}]
[null,{"$f":"IFERROR(VLOOKUP(A18,Общий!A:D,2,0),\"Товар отсутствует на складе\")","v":"Товар отсутствует на складе"},{"$f":"IFERROR(VLOOKUP(A18,Общий!A:D,3,0), \"\")","v":""},null,{"$f":"IFERROR(VLOOKUP(A18,Общий!A:D,4,0), \"\")","v":""},""]
[null,{"$f":"IFERROR(VLOOKUP(A19,Общий!A:D,2,0),\"Товар отсутствует на складе\")","v":"Товар отсутствует на складе"},{"$f":"IFERROR(VLOOKUP(A19,Общий!A:D,3,0), \"\")","v":""},null,{"$f":"IFERROR(VLOOKUP(A19,Общий!A:D,4,0), \"\")","v":""},""]
[null,{"$f":"IFERROR(VLOOKUP(A20,Общий!A:D,2,0),\"Товар отсутствует на складе\")","v":"Товар отсутствует на складе"},{"$f":"IFERROR(VLOOKUP(A20,Общий!A:D,3,0), \"\")","v":""},null,{"$f":"IFERROR(VLOOKUP(A20,Общий!A:D,4,0), \"\")","v":""},""]
[null,{"$f":"IFERROR(VLOOKUP(A21,Общий!A:D,2,0),\"Товар отсутствует на складе\")","v":"Товар отсутствует на складе"},{"$f":"IFERROR(VLOOKUP(A21,Общий!A:D,3,0), \"\")","v":""},null,{"$f":"IFERROR(VLOOKUP(A21,Общий!A:D,4,0), \"\")","v":""},""]
[null,{"$f":"IFERROR(VLOOKUP(A22,Общий!A:D,2,0),\"Товар отсутствует на складе\")","v":"Товар отсутствует на складе"},{"$f":"IFERROR(VLOOKUP(A22,Общий!A:D,3,0), \"\")","v":""},null,{"$f":"IFERROR(VLOOKUP(A22,Общий!A:D,4,0), \"\")","v":""},""]
[null,{"$f":"IFERROR(VLOOKUP(A23,Общий!A:D,2,0),\"Товар отсутствует на складе\")","v":"Товар отсутствует на складе"},{"$f":"IFERROR(VLOOKUP(A23,Общий!A:D,3,0), \"\")","v":""},null,{"$f":"IFERROR(VLOOKUP(A23,Общий!A:D,4,0), \"\")","v":""},""]
[null,{"$f":"IFERROR(VLOOKUP(A24,Общий!A:D,2,0),\"Товар отсутствует на складе\")","v":"Товар отсутствует на складе"},{"$f":"IFERROR(VLOOKUP(A24,Общий!A:D,3,0), \"\")","v":""},null,{"$f":"IFERROR(VLOOKUP(A24,Общий!A:D,4,0), \"\")","v":""},""]
[null,{"$f":"IFERROR(VLOOKUP(A25,Общий!A:D,2,0),\"Товар отсутствует на складе\")","v":"Товар отсутствует на складе"},{"$f":"IFERROR(VLOOKUP(A25,Общий!A:D,3,0), \"\")","v":""},null,{"$f":"IFERROR(VLOOKUP(A25,Общий!A:D,4,0), \"\")","v":""},""]
[null,{"$f":"IFERROR(VLOOKUP(A26,Общий!A:D,2,0),\"Товар отсутствует на складе\")","v":"Товар отсутствует на складе"},{"$f":"IFERROR(VLOOKUP(A26,Общий!A:D,3,0), \"\")","v":""},null,{"$f":"IFERROR(VLOOKUP(A26,Общий!A:D,4,0), \"\")","v":""},""]
[null,{"$f":"IFERROR(VLOOKUP(A27,Общий!A:D,2,0),\"Товар отсутствует на складе\")","v":"Товар отсутствует на складе"},{"$f":"IFERROR(VLOOKUP(A27,Общий!A:D,3,0), \"\")","v":""},null,{"$f":"IFERROR(VLOOKUP(A27,Общий!A:D,4,0), \"\")","v":""},""]
[null,{"$f":"IFERROR(VLOOKUP(A28,Общий!A:D,2,0),\"Товар отсутствует на складе\")","v":"Товар отсутствует на складе"},{"$f":"IFERROR(VLOOKUP(A28,Общий!A:D,3,0), \"\")","v":""},null,{"$f":"IFERROR(VLOOKUP(A28,Общий!A:D,4,0), \"\")","v":""},""]
[null,{"$f":"IFERROR(VLOOKUP(A29,Общий!A:D,2,0),\"Товар отсутствует на складе\")","v":"Товар отсутствует на складе"},{"$f":"IFERROR(VLOOKUP(A29,Общий!A:D,3,0), \"\")","v":""},null,{"$f":"IFERROR(VLOOKUP(A29,Общий!A:D,4,0), \"\")","v":""},""]
[null,{"$f":"IFERROR(VLOOKUP(A30,Общий!A:D,2,0),\"Товар отсутствует на складе\")","v":"Товар отсутствует на складе"},{"$f":"IFERROR(VLOOKUP(A30,Общий!A:D,3,0), \"\")","v":""},null,{"$f":"IFERROR(VLOOKUP(A30,Общий!A:D,4,0), \"\")","v":""},""]
[null,{"$f":"IFERROR(VLOOKUP(A31,Общий!A:D,2,0),\"Товар отсутствует на складе\")","v":"Товар отсутствует на складе"},{"$f":"IFERROR(VLOOKUP(A31,Общий!A:D,3,0), \"\")","v":""},null,{"$f":"IFERROR(VLOOKUP(A31,Общий!A:D,4,0), \"\")","v":""},""]
[null,{"$f":"IFERROR(VLOOKUP(A32,Общий!A:D,2,0),\"Товар отсутствует на складе\")","v":"Товар отсутствует на складе"},{"$f":"IFERROR(VLOOKUP(A32,Общий!A:D,3,0), \"\")","v":""},null,{"$f":"IFERROR(VLOOKUP(A32,Общий!A:D,4,0), \"\")","v":""},""]
[null,{"$f":"IFERROR(VLOOKUP(A33,Общий!A:D,2,0),\"Товар отсутствует на складе\")","v":"Товар отсутствует на складе"},{"$f":"IFERROR(VLOOKUP(A33,Общий!A:D,3,0), \"\")","v":""},null,{"$f":"IFERROR(VLOOKUP(A33,Общий!A:D,4,0), \"\")","v":""},""]
[null,{"$f":"IFERROR(VLOOKUP(A34,Общий!A:D,2,0),\"Товар отсутствует на складе\")","v":"Товар отсутствует на складе"},{"$f":"IFERROR(VLOOKUP(A34,Общий!A:D,3,0), \"\")","v":""},null,{"$f":"IFERROR(VLOOKUP(A34,Общий!A:D,4,0), \"\")","v":""},""]
[null,{"$f":"IFERROR(VLOOKUP(A35,Общий!A:D,2,0),\"Товар отсутствует на складе\")","v":"Товар отсутствует на складе"},{"$f":"IFERROR(VLOOKUP(A35,Общий!A:D,3,0), \"\")","v":""},null,{"$f":"IFERROR(VLOOKUP(A35,Общий!A:D,4,0), \"\")","v":""},""]
[null,{"$f":"IFERROR(VLOOKUP(A36,Общий!A:D,2,0),\"Товар отсутствует на складе\")","v":"Товар отсутствует на складе"},{"$f":"IFERROR(VLOOKUP(A36,Общий!A:D,3,0), \"\")","v":""},null,{"$f":"IFERROR(VLOOKUP(A36,Общий!A:D,4,0), \"\")","v":""},""]
[null,{"$f":"IFERROR(VLOOKUP(A37,Общий!A:D,2,0),\"Товар отсутствует на складе\")","v":"Товар отсутствует на складе"},{"$f":"IFERROR(VLOOKUP(A37,Общий!A:D,3,0), \"\")","v":""},null,{"$f":"IFERROR(VLOOKUP(A37,Общий!A:D,4,0), \"\")","v":""},""]
[null,{"$f":"IFERROR(VLOOKUP(A38,Общий!A:D,2,0),\"Товар отсутствует на складе\")","v":"Товар отсутствует на складе"},{"$f":"IFERROR(VLOOKUP(A38,Общий!A:D,3,0), \"\")","v":""},null,{"$f":"IFERROR(VLOOKUP(A38,Общий!A:D,4,0), \"\")","v":""},""]
[null,{"$f":"IFERROR(VLOOKUP(A39,Общий!A:D,2,0),\"Товар отсутствует на складе\")","v":"Товар отсутствует на складе"},{"$f":"IFERROR(VLOOKUP(A39,Общий!A:D,3,0), \"\")","v":""},null,{"$f":"IFERROR(VLOOKUP(A39,Общий!A:D,4,0), \"\")","v":""},""]
[null,{"$f":"IFERROR(VLOOKUP(A40,Общий!A:D,2,0),\"Товар отсутствует на складе\")","v":"Товар отсутствует на складе"},{"$f":"IFERROR(VLOOKUP(A40,Общий!A:D,3,0), \"\")","v":""},null,{"$f":"IFERROR(VLOOKUP(A40,Общий!A:D,4,0), \"\")","v":""},""]
[null,{"$f":"IFERROR(VLOOKUP(A41,Общий!A:D,2,0),\"Товар отсутствует на складе\")","v":"Товар отсутствует на складе"},{"$f":"IFERROR(VLOOKUP(A41,Общий!A:D,3,0), \"\")","v":""},null,{"$f":"IFERROR(VLOOKUP(A41,Общий!A:D,4,0), \"\")","v":""},""]
[null,{"$f":"IFERROR(VLOOKUP(A42,Общий!A:D,2,0),\"Товар отсутствует на складе\")","v":"Товар отсутствует на складе"},{"$f":"IFERROR(VLOOKUP(A42,Общий!A:D,3,0), \"\")","v":""},null,{"$f":"IFERROR(VLOOKUP(A42,Общий!A:D,4,0), \"\")","v":""},""]
[null,{"$f":"IFERROR(VLOOKUP(A43,Общий!A:D,2,0),\"Товар отсутствует на складе\")","v":"Товар отсутствует на складе"},{"$f":"IFERROR(VLOOKUP(A43,Общий!A:D,3,0), \"\")","v":""},null,{"$f":"IFERROR(VLOOKUP(A43,Общий!A:D,4,0), \"\")","v":""},""]
[null,{"$f":"IFERROR(VLOOKUP(A44,Общий!A:D,2,0),\"Товар отсутствует на складе\")","v":"Товар отсутствует на складе"},{"$f":"IFERROR(VLOOKUP(A44,Общий!A:D,3,0), \"\")","v":""},null,{"$f":"IFERROR(VLOOKUP(A44,Общий!A:D,4,0), \"\")","v":""},""]
[null,{"$f":"IFERROR(VLOOKUP(A45,Общий!A:D,2,0),\"Товар отсутствует на складе\")","v":"Товар отсутствует на складе"},{"$f":"IFERROR(VLOOKUP(A45,Общий!A:D,3,0), \"\")","v":""},null,{"$f":"IFERROR(VLOOKUP(A45,Общий!A:D,4,0), \"\")","v":""},""]
[null,{"$f":"IFERROR(VLOOKUP(A46,Общий!A:D,2,0),\"Товар отсутствует на складе\")","v":"Товар отсутствует на складе"},{"$f":"IFERROR(VLOOKUP(A46,Общий!A:D,3,0), \"\")","v":""},null,{"$f":"IFERROR(VLOOKUP(A46,Общий!A:D,4,0), \"\")","v":""},""]
[null,{"$f":"IFERROR(VLOOKUP(A47,Общий!A:D,2,0),\"Товар отсутствует на складе\")","v":"Товар отсутствует на складе"},{"$f":"IFERROR(VLOOKUP(A47,Общий!A:D,3,0), \"\")","v":""},null,{"$f":"IFERROR(VLOOKUP(A47,Общий!A:D,4,0), \"\")","v":""},""]
[null,{"$f":"IFERROR(VLOOKUP(A48,Общий!A:D,2,0),\"Товар отсутствует на складе\")","v":"Товар отсутствует на складе"},{"$f":"IFERROR(VLOOKUP(A48,Общий!A:D,3,0), \"\")","v":""},null,{"$f":"IFERROR(VLOOKUP(A48,Общий!A:D,4,0), \"\")","v":""},""]
[null,{"$f":"IFERROR(VLOOKUP(A49,Общий!A:D,2,0),\"Товар отсутствует на складе\")","v":"Товар отсутствует на складе"},{"$f":"IFERROR(VLOOKUP(A49,Общий!A:D,3,0), \"\")","v":""},null,{"$f":"IFERROR(VLOOKUP(A49,Общий!A:D,4,0), \"\")","v":""},""]
[null,{"$f":"IFERROR(VLOOKUP(A50,Общий!A:D,2,0),\"Товар отсутствует на складе\")","v":"Товар отсутствует на складе"},{"$f":"IFERROR(VLOOKUP(A50,Общий!A:D,3,0), \"\")","v":""},null,{"$f":"IFERROR(VLOOKUP(A50,Общий!A:D,4,0), \"\")","v":""},""]
[null,{"$f":"IFERROR(VLOOKUP(A51,Общий!A:D,2,0),\"Товар отсутствует на складе\")","v":"Товар отсутствует на складе"},{"$f":"IFERROR(VLOOKUP(A51,Общий!A:D,3,0), \"\")","v":""},null,{"$f":"IFERROR(VLOOKUP(A51,Общий!A:D,4,0), \"\")","v":""},""]
[null,{"$f":"IFERROR(VLOOKUP(A52,Общий!A:D,2,0),\"Товар отсутствует на складе\")","v":"Товар отсутствует на складе"},{"$f":"IFERROR(VLOOKUP(A52,Общий!A:D,3,0), \"\")","v":""},null,{"$f":"IFERROR(VLOOKUP(A52,Общий!A:D,4,0), \"\")","v":""},""]
[null,{"$f":"IFERROR(VLOOKUP(A53,Общий!A:D,2,0),\"Товар отсутствует на складе\")","v":"Товар отсутствует на складе"},{"$f":"IFERROR(VLOOKUP(A53,Общий!A:D,3,0), \"\")","v":""},null,{"$f":"IFERROR(VLOOKUP(A53,Общий!A:D,4,0), \"\")","v":""},""]
[null,{"$f":"IFERROR(VLOOKUP(A54,Общий!A:D,2,0),\"Товар отсутствует на складе\")","v":"Товар отсутствует на складе"},{"$f":"IFERROR(VLOOKUP(A54,Общий!A:D,3,0), \"\")","v":""},null,{"$f":"IFERROR(VLOOKUP(A54,Общий!A:D,4,0), \"\")","v":""},""]
[null,{"$f":"IFERROR(VLOOKUP(A55,Общий!A:D,2,0),\"Товар отсутствует на складе\")","v":"Товар отсутствует на складе"},{"$f":"IFERROR(VLOOKUP(A55,Общий!A:D,3,0), \"\")","v":""},null,{"$f":"IFERROR(VLOOKUP(A55,Общий!A:D,4,0), \"\")","v":""},""]
[null,{"$f":"IFERROR(VLOOKUP(A56,Общий!A:D,2,0),\"Товар отсутствует на складе\")","v":"Товар отсутствует на складе"},{"$f":"IFERROR(VLOOKUP(A56,Общий!A:D,3,0), \"\")","v":""},null,{"$f":"IFERROR(VLOOKUP(A56,Общий!A:D,4,0), \"\")","v":""},""]
[null,{"$f":"IFERROR(VLOOKUP(A57,Общий!A:D,2,0),\"Товар отсутствует на складе\")","v":"Товар отсутствует на складе"},{"$f":"IFERROR(VLOOKUP(A57,Общий!A:D,3,0), \"\")","v":""},null,{"$f":"IFERROR(VLOOKUP(A57,Общий!A:D,4,0), \"\")","v":""},""]
[null,{"$f":"IFERROR(VLOOKUP(A58,Общий!A:D,2,0),\"Товар отсутствует на складе\")","v":"Товар отсутствует на складе"},{"$f":"IFERROR(VLOOKUP(A58,Общий!A:D,3,0), \"\")","v":""},null,{"$f":"IFERROR(VLOOKUP(A58,Общий!A:D,4,0), \"\")","v":""},""]
[null,{"$f":"IFERROR(VLOOKUP(A59,Общий!A:D,2,0),\"Товар отсутствует на складе\")","v":"Товар отсутствует на складе"},{"$f":"IFERROR(VLOOKUP(A59,Общий!A:D,3,0), \"\")","v":""},null,{"$f":"IFERROR(VLOOKUP(A59,Общий!A:D,4,0), \"\")","v":""},""]
[null,{"$f":"IFERROR(VLOOKUP(A60,Общий!A:D,2,0),\"Товар отсутствует на складе\")","v":"Товар отсутствует на складе"},{"$f":"IFERROR(VLOOKUP(A60,Общий!A:D,3,0), \"\")","v":""},null,{"$f":"IFERROR(VLOOKUP(A60,Общий!A:D,4,0), \"\")","v":""},""]
[null,{"$f":"IFERROR(VLOOKUP(A61,Общий!A:D,2,0),\"Товар отсутствует на складе\")","v":"Товар отсутствует на складе"},{"$f":"IFERROR(VLOOKUP(A61,Общий!A:D,3,0), \"\")","v":""},null,{"$f":"IFERROR(VLOOKUP(A61,Общий!A:D,4,0), \"\")","v":""},""]
[null,{"$f":"IFERROR(VLOOKUP(A62,Общий!A:D,2,0),\"Товар отсутствует на складе\")","v":"Товар отсутствует на складе"},{"$f":"IFERROR(VLOOKUP(A62,Общий!A:D,3,0), \"\")","v":""},null,{"$f":"IFERROR(VLOOKUP(A62,Общий!A:D,4,0), \"\")","v":""},""]
[null,{"$f":"IFERROR(VLOOKUP(A63,Общий!A:D,2,0),\"Товар отсутствует на складе\")","v":"Товар отсутствует на складе"},{"$f":"IFERROR(VLOOKUP(A63,Общий!A:D,3,0), \"\")","v":""},null,{"$f":"IFERROR(VLOOKUP(A63,Общий!A:D,4,0), \"\")","v":""},""]
[null,{"$f":"IFERROR(VLOOKUP(A64,Общий!A:D,2,0),\"Товар отсутствует на складе\")","v":"Товар отсутствует на складе"},{"$f":"IFERROR(VLOOKUP(A64,Общий!A:D,3,0), \"\")","v":""},null,{"$f":"IFERROR(VLOOKUP(A64,Общий!A:D,4,0), \"\")","v":""},""]
[null,{"$f":"IFERROR(VLOOKUP(A65,Общий!A:D,2,0),\"Товар отсутствует на складе\")","v":"Товар отсутствует на складе"},{"$f":"IFERROR(VLOOKUP(A65,Общий!A:D,3,0), \"\")","v":""},null,{"$f":"IFERROR(VLOOKUP(A65,Общий!A:D,4,0), \"\")","v":""},""]
[null,{"$f":"IFERROR(VLOOKUP(A66,Общий!A:D,2,0),\"Товар отсутствует на складе\")","v":"Товар отсутствует на складе"},{"$f":"IFERROR(VLOOKUP(A66,Общий!A:D,3,0), \"\")","v":""},null,{"$f":"IFERROR(VLOOKUP(A66,Общий!A:D,4,0), \"\")","v":""},""]
[null,{"$f":"IFERROR(VLOOKUP(A67,Общий!A:D,2,0),\"Товар отсутствует на складе\")","v":"Товар отсутствует на складе"},{"$f":"IFERROR(VLOOKUP(A67,Общий!A:D,3,0), \"\")","v":""},null,{"$f":"IFERROR(VLOOKUP(A67,Общий!A:D,4,0), \"\")","v":""},""]
[null,{"$f":"IFERROR(VLOOKUP(A68,Общий!A:D,2,0),\"Товар отсутствует на складе\")","v":"Товар отсутствует на складе"},{"$f":"IFERROR(VLOOKUP(A68,Общий!A:D,3,0), \"\")","v":""},null,{"$f":"IFERROR(VLOOKUP(A68,Общий!A:D,4,0), \"\")","v":""},""]
[null,{"$f":"IFERROR(VLOOKUP(A69,Общий!A:D,2,0),\"Товар отсутствует на складе\")","v":"Товар отсутствует на складе"},{"$f":"IFERROR(VLOOKUP(A69,Общий!A:D,3,0), \"\")","v":""},null,{"$f":"IFERROR(VLOOKUP(A69,Общий!A:D,4,0), \"\")","v":""},""]
[null,{"$f":"IFERROR(VLOOKUP(A70,Общий!A:D,2,0),\"Товар отсутствует на складе\")","v":"Товар отсутствует на складе"},{"$f":"IFERROR(VLOOKUP(A70,Общий!A:D,3,0), \"\")","v":""},null,{"$f":"IFERROR(VLOOKUP(A70,Общий!A:D,4,0), \"\")","v":""},""]
[null,{"$f":"IFERROR(VLOOKUP(A71,Общий!A:D,2,0),\"Товар отсутствует на складе\")","v":"Товар отсутствует на складе"},{"$f":"IFERROR(VLOOKUP(A71,Общий!A:D,3,0), \"\")","v":""},null,{"$f":"IFERROR(VLOOKUP(A71,Общий!A:D,4,0), \"\")","v":""},""]
[null,{"$f":"IFERROR(VLOOKUP(A72,Общий!A:D,2,0),\"Товар отсутствует на складе\")","v":"Товар отсутствует на складе"},{"$f":"IFERROR(VLOOKUP(A72,Общий!A:D,3,0), \"\")","v":""},null,{"$f":"IFERROR(VLOOKUP(A72,Общий!A:D,4,0), \"\")","v":""},""]
[null,{"$f":"IFERROR(VLOOKUP(A73,Общий!A:D,2,0),\"Товар отсутствует на складе\")","v":"Товар отсутствует на складе"},{"$f":"IFERROR(VLOOKUP(A73,Общий!A:D,3,0), \"\")","v":""},null,{"$f":"IFERROR(VLOOKUP(A73,Общий!A:D,4,0), \"\")","v":""},""]
[null,{"$f":"IFERROR(VLOOKUP(A74,Общий!A:D,2,0),\"Товар отсутствует на складе\")","v":"Товар отсутствует на складе"},{"$f":"IFERROR(VLOOKUP(A74,Общий!A:D,3,0), \"\")","v":""},null,{"$f":"IFERROR(VLOOKUP(A74,Общий!A:D,4,0), \"\")","v":""},""]
[null,{"$f":"IFERROR(VLOOKUP(A75,Общий!A:D,2,0),\"Товар отсутствует на складе\")","v":"Товар отсутствует на складе"},{"$f":"IFERROR(VLOOKUP(A75,Общий!A:D,3,0), \"\")","v":""},null,{"$f":"IFERROR(VLOOKUP(A75,Общий!A:D,4,0), \"\")","v":""},""]
[null,{"$f":"IFERROR(VLOOKUP(A76,Общий!A:D,2,0),\"Товар отсутствует на складе\")","v":"Товар отсутствует на складе"},{"$f":"IFERROR(VLOOKUP(A76,Общий!A:D,3,0), \"\")","v":""},null,{"$f":"IFERROR(VLOOKUP(A76,Общий!A:D,4,0), \"\")","v":""},""]
[null,{"$f":"IFERROR(VLOOKUP(A77,Общий!A:D,2,0),\"Товар отсутствует на складе\")","v":"Товар отсутствует на складе"},{"$f":"IFERROR(VLOOKUP(A77,Общий!A:D,3,0), \"\")","v":""},null,{"$f":"IFERROR(VLOOKUP(A77,Общий!A:D,4,0), \"\")","v":""},""]
[null,{"$f":"IFERROR(VLOOKUP(A78,Общий!A:D,2,0),\"Товар отсутствует на складе\")","v":"Товар отсутствует на складе"},{"$f":"IFERROR(VLOOKUP(A78,Общий!A:D,3,0), \"\")","v":""},null,{"$f":"IFERROR(VLOOKUP(A78,Общий!A:D,4,0), \"\")","v":""},""]
[null,{"$f":"IFERROR(VLOOKUP(A79,Общий!A:D,2,0),\"Товар отсутствует на складе\")","v":"Товар отсутствует на складе"},{"$f":"IFERROR(VLOOKUP(A79,Общий!A:D,3,0), \"\")","v":""},null,{"$f":"IFERROR(VLOOKUP(A79,Общий!A:D,4,0), \"\")","v":""},""]
[null,{"$f":"IFERROR(VLOOKUP(A80,Общий!A:D,2,0),\"Товар отсутствует на складе\")","v":"Товар отсутствует на складе"},{"$f":"IFERROR(VLOOKUP(A80,Общий!A:D,3,0), \"\")","v":""},null,{"$f":"IFERROR(VLOOKUP(A80,Общий!A:D,4,0), \"\")","v":""},""]
[null,{"$f":"IFERROR(VLOOKUP(A81,Общий!A:D,2,0),\"Товар отсутствует на складе\")","v":"Товар отсутствует на складе"},{"$f":"IFERROR(VLOOKUP(A81,Общий!A:D,3,0), \"\")","v":""},null,{"$f":"IFERROR(VLOOKUP(A81,Общий!A:D,4,0), \"\")","v":""},{"$f":"IFERROR(D81*E81,\"\")","v":""}]
[null,{"$f":"IFERROR(VLOOKUP(A82,Общий!A:D,2,0),\"Товар отсутствует на складе\")","v":"Товар отсутствует на складе"},{"$f":"IFERROR(VLOOKUP(A82,Общий!A:D,3,0), \"\")","v":""},null,{"$f":"IFERROR(VLOOKUP(A82,Общий!A:D,4,0), \"\")","v":""},""]
[null,{"$f":"IFERROR(VLOOKUP(A83,Общий!A:D,2,0),\"Товар отсутствует на складе\")","v":"Товар отсутствует на складе"},{"$f":"IFERROR(VLOOKUP(A83,Общий!A:D,3,0), \"\")","v":""},null,{"$f":"IFERROR(VLOOKUP(A83,Общий!A:D,4,0), \"\")","v":""},""]
[null,{"$f":"IFERROR(VLOOKUP(A84,Общий!A:D,2,0),\"Товар отсутствует на складе\")","v":"Товар отсутствует на складе"},{"$f":"IFERROR(VLOOKUP(A84,Общий!A:D,3,0), \"\")","v":""},null,{"$f":"IFERROR(VLOOKUP(A84,Общий!A:D,4,0), \"\")","v":""},""]
[null,{"$f":"IFERROR(VLOOKUP(A85,Общий!A:D,2,0),\"Товар отсутствует на складе\")","v":"Товар отсутствует на складе"},{"$f":"IFERROR(VLOOKUP(A85,Общий!A:D,3,0), \"\")","v":""},null,{"$f":"IFERROR(VLOOKUP(A85,Общий!A:D,4,0), \"\")","v":""},""]
[null,{"$f":"IFERROR(VLOOKUP(A86,Общий!A:D,2,0),\"Товар отсутствует на складе\")","v":"Товар отсутствует на складе"},{"$f":"IFERROR(VLOOKUP(A86,Общий!A:D,3,0), \"\")","v":""},null,{"$f":"IFERROR(VLOOKUP(A86,Общий!A:D,4,0), \"\")","v":""},""]
[null,{"$f":"IFERROR(VLOOKUP(A87,Общий!A:D,2,0),\"Товар отсутствует на складе\")","v":"Товар отсутствует на складе"},{"$f":"IFERROR(VLOOKUP(A87,Общий!A:D,3,0), \"\")","v":""},null,{"$f":"IFERROR(VLOOKUP(A87,Общий!A:D,4,0), \"\")","v":""},""]
[null,{"$f":"IFERROR(VLOOKUP(A88,Общий!A:D,2,0),\"Товар отсутствует на складе\")","v":"Товар отсутствует на складе"},{"$f":"IFERROR(VLOOKUP(A88,Общий!A:D,3,0), \"\")","v":""},null,{"$f":"IFERROR(VLOOKUP(A88,Общий!A:D,4,0), \"\")","v":""},""]
[null,{"$f":"IFERROR(VLOOKUP(A89,Общий!A:D,2,0),\"Товар отсутствует на складе\")","v":"Товар отсутствует на складе"},{"$f":"IFERROR(VLOOKUP(A89,Общий!A:D,3,0), \"\")","v":""},null,{"$f":"IFERROR(VLOOKUP(A89,Общий!A:D,4,0), \"\")","v":""},""]
[null,{"$f":"IFERROR(VLOOKUP(A90,Общий!A:D,2,0),\"Товар отсутствует на складе\")","v":"Товар отсутствует на складе"},{"$f":"IFERROR(VLOOKUP(A90,Общий!A:D,3,0), \"\")","v":""},null,{"$f":"IFERROR(VLOOKUP(A90,Общий!A:D,4,0), \"\")","v":""},""]
[null,{"$f":"IFERROR(VLOOKUP(A91,Общий!A:D,2,0),\"Товар отсутствует на складе\")","v":"Товар отсутствует на складе"},{"$f":"IFERROR(VLOOKUP(A91,Общий!A:D,3,0), \"\")","v":""},null,{"$f":"IFERROR(VLOOKUP(A91,Общий!A:D,4,0), \"\")","v":""},""]
[null,{"$f":"IFERROR(VLOOKUP(A92,Общий!A:D,2,0),\"Товар отсутствует на складе\")","v":"Товар отсутствует на складе"},{"$f":"IFERROR(VLOOKUP(A92,Общий!A:D,3,0), \"\")","v":""},null,{"$f":"IFERROR(VLOOKUP(A92,Общий!A:D,4,0), \"\")","v":""},""]
[null,{"$f":"IFERROR(VLOOKUP(A93,Общий!A:D,2,0),\"Товар отсутствует на складе\")","v":"Товар отсутствует на складе"},{"$f":"IFERROR(VLOOKUP(A93,Общий!A:D,3,0), \"\")","v":""},null,{"$f":"IFERROR(VLOOKUP(A93,Общий!A:D,4,0), \"\")","v":""},""]
[null,{"$f":"IFERROR(VLOOKUP(A94,Общий!A:D,2,0),\"Товар отсутствует на складе\")","v":"Товар отсутствует на складе"},{"$f":"IFERROR(VLOOKUP(A94,Общий!A:D,3,0), \"\")","v":""},null,{"$f":"IFERROR(VLOOKUP(A94,Общий!A:D,4,0), \"\")","v":""},""]
[null,{"$f":"IFERROR(VLOOKUP(A95,Общий!A:D,2,0),\"Товар отсутствует на складе\")","v":"Товар отсутствует на складе"},{"$f":"IFERROR(VLOOKUP(A95,Общий!A:D,3,0), \"\")","v":""},null,{"$f":"IFERROR(VLOOKUP(A95,Общий!A:D,4,0), \"\")","v":""},""]
[null,{"$f":"IFERROR(VLOOKUP(A96,Общий!A:D,2,0),\"Товар отсутствует на складе\")","v":"Товар отсутствует на складе"},{"$f":"IFERROR(VLOOKUP(A96,Общий!A:D,3,0), \"\")","v":""},null,{"$f":"IFERROR(VLOOKUP(A96,Общий!A:D,4,0), \"\")","v":""},""]
[null,{"$f":"IFERROR(VLOOKUP(A97,Общий!A:D,2,0),\"Товар отсутствует на складе\")","v":"Товар отсутствует на складе"},{"$f":"IFERROR(VLOOKUP(A97,Общий!A:D,3,0), \"\")","v":""},null,{"$f":"IFERROR(VLOOKUP(A97,Общий!A:D,4,0), \"\")","v":""},""]
[null,{"$f":"IFERROR(VLOOKUP(A98,Общий!A:D,2,0),\"Товар отсутствует на складе\")","v":"Товар отсутствует на складе"},{"$f":"IFERROR(VLOOKUP(A98,Общий!A:D,3,0), \"\")","v":""},null,{"$f":"IFERROR(VLOOKUP(A98,Общий!A:D,4,0), \"\")","v":""},""]
[null,{"$f":"IFERROR(VLOOKUP(A99,Общий!A:D,2,0),\"Товар отсутствует на складе\")","v":"Товар отсутствует на складе"},{"$f":"IFERROR(VLOOKUP(A99,Общий!A:D,3,0), \"\")","v":""},null,{"$f":"IFERROR(VLOOKUP(A99,Общий!A:D,4,0), \"\")","v":""},""]
[null,{"$f":"IFERROR(VLOOKUP(A100,Общий!A:D,2,0),\"Товар отсутствует на складе\")","v":"Товар отсутствует на складе"},{"$f":"IFERROR(VLOOKUP(A100,Общий!A:D,3,0), \"\")","v":""},null,{"$f":"IFERROR(VLOOKUP(A100,Общий!A:D,4,0), \"\")","v":""},""]
[null,{"$f":"IFERROR(VLOOKUP(A101,Общий!A:D,2,0),\"Товар отсутствует на складе\")","v":"Товар отсутствует на складе"},{"$f":"IFERROR(VLOOKUP(A101,Общий!A:D,3,0), \"\")","v":""},null,{"$f":"IFERROR(VLOOKUP(A101,Общий!A:D,4,0), \"\")","v":""},""]
[null,{"$f":"IFERROR(VLOOKUP(A102,Общий!A:D,2,0),\"Товар отсутствует на складе\")","v":"Товар отсутствует на складе"},{"$f":"IFERROR(VLOOKUP(A102,Общий!A:D,3,0), \"\")","v":""},null,{"$f":"IFERROR(VLOOKUP(A102,Общий!A:D,4,0), \"\")","v":""},""]
[null,{"$f":"IFERROR(VLOOKUP(A103,Общий!A:D,2,0),\"Товар отсутствует на складе\")","v":"Товар отсутствует на складе"},{"$f":"IFERROR(VLOOKUP(A103,Общий!A:D,3,0), \"\")","v":""},null,{"$f":"IFERROR(VLOOKUP(A103,Общий!A:D,4,0), \"\")","v":""},""]
[null,{"$f":"IFERROR(VLOOKUP(A104,Общий!A:D,2,0),\"Товар отсутствует на складе\")","v":"Товар отсутствует на складе"},{"$f":"IFERROR(VLOOKUP(A104,Общий!A:D,3,0), \"\")","v":""},null,{"$f":"IFERROR(VLOOKUP(A104,Общий!A:D,4,0), \"\")","v":""},""]
[null,{"$f":"IFERROR(VLOOKUP(A105,Общий!A:D,2,0),\"Товар отсутствует на складе\")","v":"Товар отсутствует на складе"},{"$f":"IFERROR(VLOOKUP(A105,Общий!A:D,3,0), \"\")","v":""},null,{"$f":"IFERROR(VLOOKUP(A105,Общий!A:D,4,0), \"\")","v":""},""]
[null,{"$f":"IFERROR(VLOOKUP(A106,Общий!A:D,2,0),\"Товар отсутствует на складе\")","v":"Товар отсутствует на складе"},{"$f":"IFERROR(VLOOKUP(A106,Общий!A:D,3,0), \"\")","v":""},null,{"$f":"IFERROR(VLOOKUP(A106,Общий!A:D,4,0), \"\")","v":""},""]
[null,{"$f":"IFERROR(VLOOKUP(A107,Общий!A:D,2,0),\"Товар отсутствует на складе\")","v":"Товар отсутствует на складе"},{"$f":"IFERROR(VLOOKUP(A107,Общий!A:D,3,0), \"\")","v":""},null,{"$f":"IFERROR(VLOOKUP(A107,Общий!A:D,4,0), \"\")","v":""},""]
[null,{"$f":"IFERROR(VLOOKUP(A108,Общий!A:D,2,0),\"Товар отсутствует на складе\")","v":"Товар отсутствует на складе"},{"$f":"IFERROR(VLOOKUP(A108,Общий!A:D,3,0), \"\")","v":""},null,{"$f":"IFERROR(VLOOKUP(A108,Общий!A:D,4,0), \"\")","v":""},""]
[null,{"$f":"IFERROR(VLOOKUP(A109,Общий!A:D,2,0),\"Товар отсутствует на складе\")","v":"Товар отсутствует на складе"},{"$f":"IFERROR(VLOOKUP(A109,Общий!A:D,3,0), \"\")","v":""},null,{"$f":"IFERROR(VLOOKUP(A109,Общий!A:D,4,0), \"\")","v":""},""]
[null,{"$f":"IFERROR(VLOOKUP(A110,Общий!A:D,2,0),\"Товар отсутствует на складе\")","v":"Товар отсутствует на складе"},{"$f":"IFERROR(VLOOKUP(A110,Общий!A:D,3,0), \"\")","v":""},null,{"$f":"IFERROR(VLOOKUP(A110,Общий!A:D,4,0), \"\")","v":""},""]
[null,{"$f":"IFERROR(VLOOKUP(A111,Общий!A:D,2,0),\"Товар отсутствует на складе\")","v":"Товар отсутствует на складе"},{"$f":"IFERROR(VLOOKUP(A111,Общий!A:D,3,0), \"\")","v":""},null,{"$f":"IFERROR(VLOOKUP(A111,Общий!A:D,4,0), \"\")","v":""},""]
[null,{"$f":"IFERROR(VLOOKUP(A112,Общий!A:D,2,0),\"Товар отсутствует на складе\")","v":"Товар отсутствует на складе"},{"$f":"IFERROR(VLOOKUP(A112,Общий!A:D,3,0), \"\")","v":""},null,{"$f":"IFERROR(VLOOKUP(A112,Общий!A:D,4,0), \"\")","v":""},""]
[null,{"$f":"IFERROR(VLOOKUP(A113,Общий!A:D,2,0),\"Товар отсутствует на складе\")","v":"Товар отсутствует на складе"},{"$f":"IFERROR(VLOOKUP(A113,Общий!A:D,3,0), \"\")","v":""},null,{"$f":"IFERROR(VLOOKUP(A113,Общий!A:D,4,0), \"\")","v":""},""]
[null,{"$f":"IFERROR(VLOOKUP(A114,Общий!A:D,2,0),\"Товар отсутствует на складе\")","v":"Товар отсутствует на складе"},{"$f":"IFERROR(VLOOKUP(A114,Общий!A:D,3,0), \"\")","v":""},null,{"$f":"IFERROR(VLOOKUP(A114,Общий!A:D,4,0), \"\")","v":""},""]
[null,{"$f":"IFERROR(VLOOKUP(A115,Общий!A:D,2,0),\"Товар отсутствует на складе\")","v":"Товар отсутствует на складе"},{"$f":"IFERROR(VLOOKUP(A115,Общий!A:D,3,0), \"\")","v":""},null,{"$f":"IFERROR(VLOOKUP(A115,Общий!A:D,4,0), \"\")","v":""},""]
[null,{"$f":"IFERROR(VLOOKUP(A116,Общий!A:D,2,0),\"Товар отсутствует на складе\")","v":"Товар отсутствует на складе"},{"$f":"IFERROR(VLOOKUP(A116,Общий!A:D,3,0), \"\")","v":""},null,{"$f":"IFERROR(VLOOKUP(A116,Общий!A:D,4,0), \"\")","v":""},""]
[null,{"$f":"IFERROR(VLOOKUP(A117,Общий!A:D,2,0),\"Товар отсутствует на складе\")","v":"Товар отсутствует на складе"},{"$f":"IFERROR(VLOOKUP(A117,Общий!A:D,3,0), \"\")","v":""},null,{"$f":"IFERROR(VLOOKUP(A117,Общий!A:D,4,0), \"\")","v":""},""]
[null,{"$f":"IFERROR(VLOOKUP(A118,Общий!A:D,2,0),\"Товар отсутствует на складе\")","v":"Товар отсутствует на складе"},{"$f":"IFERROR(VLOOKUP(A118,Общий!A:D,3,0), \"\")","v":""},null,{"$f":"IFERROR(VLOOKUP(A118,Общий!A:D,4,0), \"\")","v":""},""]
[null,{"$f":"IFERROR(VLOOKUP(A119,Общий!A:D,2,0),\"Товар отсутствует на складе\")","v":"Товар отсутствует на складе"},{"$f":"IFERROR(VLOOKUP(A119,Общий!A:D,3,0), \"\")","v":""},null,{"$f":"IFERROR(VLOOKUP(A119,Общий!A:D,4,0), \"\")","v":""},""]
[null,{"$f":"IFERROR(VLOOKUP(A120,Общий!A:D,2,0),\"Товар отсутствует на складе\")","v":"Товар отсутствует на складе"},{"$f":"IFERROR(VLOOKUP(A120,Общий!A:D,3,0), \"\")","v":""},null,{"$f":"IFERROR(VLOOKUP(A120,Общий!A:D,4,0), \"\")","v":""},""]
[null,{"$f":"IFERROR(VLOOKUP(A121,Общий!A:D,2,0),\"Товар отсутствует на складе\")","v":"Товар отсутствует на складе"},{"$f":"IFERROR(VLOOKUP(A121,Общий!A:D,3,0), \"\")","v":""},null,{"$f":"IFERROR(VLOOKUP(A121,Общий!A:D,4,0), \"\")","v":""},""]
[null,{"$f":"IFERROR(VLOOKUP(A122,Общий!A:D,2,0),\"Товар отсутствует на складе\")","v":"Товар отсутствует на складе"},{"$f":"IFERROR(VLOOKUP(A122,Общий!A:D,3,0), \"\")","v":""},null,{"$f":"IFERROR(VLOOKUP(A122,Общий!A:D,4,0), \"\")","v":""},""]
[null,{"$f":"IFERROR(VLOOKUP(A123,Общий!A:D,2,0),\"Товар отсутствует на складе\")","v":"Товар отсутствует на складе"},{"$f":"IFERROR(VLOOKUP(A123,Общий!A:D,3,0), \"\")","v":""},null,{"$f":"IFERROR(VLOOKUP(A123,Общий!A:D,4,0), \"\")","v":""},""]
[null,{"$f":"IFERROR(VLOOKUP(A124,Общий!A:D,2,0),\"Товар отсутствует на складе\")","v":"Товар отсутствует на складе"},{"$f":"IFERROR(VLOOKUP(A124,Общий!A:D,3,0), \"\")","v":""},null,{"$f":"IFERROR(VLOOKUP(A124,Общий!A:D,4,0), \"\")","v":""},""]
[null,{"$f":"IFERROR(VLOOKUP(A125,Общий!A:D,2,0),\"Товар отсутствует на складе\")","v":"Товар отсутствует на складе"},{"$f":"IFERROR(VLOOKUP(A125,Общий!A:D,3,0), \"\")","v":""},null,{"$f":"IFERROR(VLOOKUP(A125,Общий!A:D,4,0), \"\")","v":""},""]
[null,{"$f":"IFERROR(VLOOKUP(A126,Общий!A:D,2,0),\"Товар отсутствует на складе\")","v":"Товар отсутствует на складе"},{"$f":"IFERROR(VLOOKUP(A126,Общий!A:D,3,0), \"\")","v":""},null,{"$f":"IFERROR(VLOOKUP(A126,Общий!A:D,4,0), \"\")","v":""},""]
[null,{"$f":"IFERROR(VLOOKUP(A127,Общий!A:D,2,0),\"Товар отсутствует на складе\")","v":"Товар отсутствует на складе"},{"$f":"IFERROR(VLOOKUP(A127,Общий!A:D,3,0), \"\")","v":""},null,{"$f":"IFERROR(VLOOKUP(A127,Общий!A:D,4,0), \"\")","v":""},""]
[null,{"$f":"IFERROR(VLOOKUP(A128,Общий!A:D,2,0),\"Товар отсутствует на складе\")","v":"Товар отсутствует на складе"},{"$f":"IFERROR(VLOOKUP(A128,Общий!A:D,3,0), \"\")","v":""},null,{"$f":"IFERROR(VLOOKUP(A128,Общий!A:D,4,0), \"\")","v":""},""]
[null,{"$f":"IFERROR(VLOOKUP(A129,Общий!A:D,2,0),\"Товар отсутствует на складе\")","v":"Товар отсутствует на складе"},{"$f":"IFERROR(VLOOKUP(A129,Общий!A:D,3,0), \"\")","v":""},null,{"$f":"IFERROR(VLOOKUP(A129,Общий!A:D,4,0), \"\")","v":""},""]
[null,{"$f":"IFERROR(VLOOKUP(A130,Общий!A:D,2,0),\"Товар отсутствует на складе\")","v":"Товар отсутствует на складе"},{"$f":"IFERROR(VLOOKUP(A130,Общий!A:D,3,0), \"\")","v":""},null,{"$f":"IFERROR(VLOOKUP(A130,Общий!A:D,4,0), \"\")","v":""},""]
[null,{"$f":"IFERROR(VLOOKUP(A131,Общий!A:D,2,0),\"Товар отсутствует на складе\")","v":"Товар отсутствует на складе"},{"$f":"IFERROR(VLOOKUP(A131,Общий!A:D,3,0), \"\")","v":""},null,{"$f":"IFERROR(VLOOKUP(A131,Общий!A:D,4,0), \"\")","v":""},""]
[null,{"$f":"IFERROR(VLOOKUP(A132,Общий!A:D,2,0),\"Товар отсутствует на складе\")","v":"Товар отсутствует на складе"},{"$f":"IFERROR(VLOOKUP(A132,Общий!A:D,3,0), \"\")","v":""},null,{"$f":"IFERROR(VLOOKUP(A132,Общий!A:D,4,0), \"\")","v":""},""]
[null,{"$f":"IFERROR(VLOOKUP(A133,Общий!A:D,2,0),\"Товар отсутствует на складе\")","v":"Товар отсутствует на складе"},{"$f":"IFERROR(VLOOKUP(A133,Общий!A:D,3,0), \"\")","v":""},null,{"$f":"IFERROR(VLOOKUP(A133,Общий!A:D,4,0), \"\")","v":""},""]
[null,{"$f":"IFERROR(VLOOKUP(A134,Общий!A:D,2,0),\"Товар отсутствует на складе\")","v":"Товар отсутствует на складе"},{"$f":"IFERROR(VLOOKUP(A134,Общий!A:D,3,0), \"\")","v":""},null,{"$f":"IFERROR(VLOOKUP(A134,Общий!A:D,4,0), \"\")","v":""},""]
[null,{"$f":"IFERROR(VLOOKUP(A135,Общий!A:D,2,0),\"Товар отсутствует на складе\")","v":"Товар отсутствует на складе"},{"$f":"IFERROR(VLOOKUP(A135,Общий!A:D,3,0), \"\")","v":""},null,{"$f":"IFERROR(VLOOKUP(A135,Общий!A:D,4,0), \"\")","v":""},""]
[null,{"$f":"IFERROR(VLOOKUP(A136,Общий!A:D,2,0),\"Товар отсутствует на складе\")","v":"Товар отсутствует на складе"},{"$f":"IFERROR(VLOOKUP(A136,Общий!A:D,3,0), \"\")","v":""},null,{"$f":"IFERROR(VLOOKUP(A136,Общий!A:D,4,0), \"\")","v":""},""]
[null,{"$f":"IFERROR(VLOOKUP(A137,Общий!A:D,2,0),\"Товар отсутствует на складе\")","v":"Товар отсутствует на складе"},{"$f":"IFERROR(VLOOKUP(A137,Общий!A:D,3,0), \"\")","v":""},null,{"$f":"IFERROR(VLOOKUP(A137,Общий!A:D,4,0), \"\")","v":""},""]
[null,{"$f":"IFERROR(VLOOKUP(A138,Общий!A:D,2,0),\"Товар отсутствует на складе\")","v":"Товар отсутствует на складе"},{"$f":"IFERROR(VLOOKUP(A138,Общий!A:D,3,0), \"\")","v":""},null,{"$f":"IFERROR(VLOOKUP(A138,Общий!A:D,4,0), \"\")","v":""},""]
[null,{"$f":"IFERROR(VLOOKUP(A139,Общий!A:D,2,0),\"Товар отсутствует на складе\")","v":"Товар отсутствует на складе"},{"$f":"IFERROR(VLOOKUP(A139,Общий!A:D,3,0), \"\")","v":""},null,{"$f":"IFERROR(VLOOKUP(A139,Общий!A:D,4,0), \"\")","v":""},""]
[null,{"$f":"IFERROR(VLOOKUP(A140,Общий!A:D,2,0),\"Товар отсутствует на складе\")","v":"Товар отсутствует на складе"},{"$f":"IFERROR(VLOOKUP(A140,Общий!A:D,3,0), \"\")","v":""},null,{"$f":"IFERROR(VLOOKUP(A140,Общий!A:D,4,0), \"\")","v":""},""]
[null,{"$f":"IFERROR(VLOOKUP(A141,Общий!A:D,2,0),\"Товар отсутствует на складе\")","v":"Товар отсутствует на складе"},{"$f":"IFERROR(VLOOKUP(A141,Общий!A:D,3,0), \"\")","v":""},null,{"$f":"IFERROR(VLOOKUP(A141,Общий!A:D,4,0), \"\")","v":""},""]
[null,{"$f":"IFERROR(VLOOKUP(A142,Общий!A:D,2,0),\"Товар отсутствует на складе\")","v":"Товар отсутствует на складе"},{"$f":"IFERROR(VLOOKUP(A142,Общий!A:D,3,0), \"\")","v":""},null,{"$f":"IFERROR(VLOOKUP(A142,Общий!A:D,4,0), \"\")","v":""},""]
[null,{"$f":"IFERROR(VLOOKUP(A143,Общий!A:D,2,0),\"Товар отсутствует на складе\")","v":"Товар отсутствует на складе"},{"$f":"IFERROR(VLOOKUP(A143,Общий!A:D,3,0), \"\")","v":""},null,{"$f":"IFERROR(VLOOKUP(A143,Общий!A:D,4,0), \"\")","v":""},""]
[null,{"$f":"IFERROR(VLOOKUP(A144,Общий!A:D,2,0),\"Товар отсутствует на складе\")","v":"Товар отсутствует на складе"},{"$f":"IFERROR(VLOOKUP(A144,Общий!A:D,3,0), \"\")","v":""},null,{"$f":"IFERROR(VLOOKUP(A144,Общий!A:D,4,0), \"\")","v":""},""]
[null,{"$f":"IFERROR(VLOOKUP(A145,Общий!A:D,2,0),\"Товар отсутствует на складе\")","v":"Товар отсутствует на складе"},{"$f":"IFERROR(VLOOKUP(A145,Общий!A:D,3,0), \"\")","v":""},null,{"$f":"IFERROR(VLOOKUP(A145,Общий!A:D,4,0), \"\")","v":""},{"$f":"IFERROR(D145*E145,\"\")","v":""}]
[null,{"$f":"IFERROR(VLOOKUP(A146,Общий!A:D,2,0),\"Товар отсутствует на складе\")","v":"Товар отсутствует на складе"},{"$f":"IFERROR(VLOOKUP(A146,Общий!A:D,3,0), \"\")","v":""},null,{"$f":"IFERROR(VLOOKUP(A146,Общий!A:D,4,0), \"\")","v":""},""]
[null,{"$f":"IFERROR(VLOOKUP(A147,Общий!A:D,2,0),\"Товар отсутствует на складе\")","v":"Товар отсутствует на складе"},{"$f":"IFERROR(VLOOKUP(A147,Общий!A:D,3,0), \"\")","v":""},null,{"$f":"IFERROR(VLOOKUP(A147,Общий!A:D,4,0), \"\")","v":""},""]
[null,{"$f":"IFERROR(VLOOKUP(A148,Общий!A:D,2,0),\"Товар отсутствует на складе\")","v":"Товар отсутствует на складе"},{"$f":"IFERROR(VLOOKUP(A148,Общий!A:D,3,0), \"\")","v":""},null,{"$f":"IFERROR(VLOOKUP(A148,Общий!A:D,4,0), \"\")","v":""},""]
[null,{"$f":"IFERROR(VLOOKUP(A149,Общий!A:D,2,0),\"Товар отсутствует на складе\")","v":"Товар отсутствует на складе"},{"$f":"IFERROR(VLOOKUP(A149,Общий!A:D,3,0), \"\")","v":""},null,{"$f":"IFERROR(VLOOKUP(A149,Общий!A:D,4,0), \"\")","v":""},""]
[null,{"$f":"IFERROR(VLOOKUP(A150,Общий!A:D,2,0),\"Товар отсутствует на складе\")","v":"Товар отсутствует на складе"},{"$f":"IFERROR(VLOOKUP(A150,Общий!A:D,3,0), \"\")","v":""},null,{"$f":"IFERROR(VLOOKUP(A150,Общий!A:D,4,0), \"\")","v":""},""]
[null,{"$f":"IFERROR(VLOOKUP(A151,Общий!A:D,2,0),\"Товар отсутствует на складе\")","v":"Товар отсутствует на складе"},{"$f":"IFERROR(VLOOKUP(A151,Общий!A:D,3,0), \"\")","v":""},null,{"$f":"IFERROR(VLOOKUP(A151,Общий!A:D,4,0), \"\")","v":""},""]
[null,{"$f":"IFERROR(VLOOKUP(A152,Общий!A:D,2,0),\"Товар отсутствует на складе\")","v":"Товар отсутствует на складе"},{"$f":"IFERROR(VLOOKUP(A152,Общий!A:D,3,0), \"\")","v":""},null,{"$f":"IFERROR(VLOOKUP(A152,Общий!A:D,4,0), \"\")","v":""},""]
[null,{"$f":"IFERROR(VLOOKUP(A153,Общий!A:D,2,0),\"Товар отсутствует на складе\")","v":"Товар отсутствует на складе"},{"$f":"IFERROR(VLOOKUP(A153,Общий!A:D,3,0), \"\")","v":""},null,{"$f":"IFERROR(VLOOKUP(A153,Общий!A:D,4,0), \"\")","v":""},""]
[null,{"$f":"IFERROR(VLOOKUP(A154,Общий!A:D,2,0),\"Товар отсутствует на складе\")","v":"Товар отсутствует на складе"},{"$f":"IFERROR(VLOOKUP(A154,Общий!A:D,3,0), \"\")","v":""},null,{"$f":"IFERROR(VLOOKUP(A154,Общий!A:D,4,0), \"\")","v":""},""]
[null,{"$f":"IFERROR(VLOOKUP(A155,Общий!A:D,2,0),\"Товар отсутствует на складе\")","v":"Товар отсутствует на складе"},{"$f":"IFERROR(VLOOKUP(A155,Общий!A:D,3,0), \"\")","v":""},null,{"$f":"IFERROR(VLOOKUP(A155,Общий!A:D,4,0), \"\")","v":""},""]
[null,{"$f":"IFERROR(VLOOKUP(A156,Общий!A:D,2,0),\"Товар отсутствует на складе\")","v":"Товар отсутствует на складе"},{"$f":"IFERROR(VLOOKUP(A156,Общий!A:D,3,0), \"\")","v":""},null,{"$f":"IFERROR(VLOOKUP(A156,Общий!A:D,4,0), \"\")","v":""},""]
[null,{"$f":"IFERROR(VLOOKUP(A157,Общий!A:D,2,0),\"Товар отсутствует на складе\")","v":"Товар отсутствует на складе"},{"$f":"IFERROR(VLOOKUP(A157,Общий!A:D,3,0), \"\")","v":""},null,{"$f":"IFERROR(VLOOKUP(A157,Общий!A:D,4,0), \"\")","v":""},""]
[null,{"$f":"IFERROR(VLOOKUP(A158,Общий!A:D,2,0),\"Товар отсутствует на складе\")","v":"Товар отсутствует на складе"},{"$f":"IFERROR(VLOOKUP(A158,Общий!A:D,3,0), \"\")","v":""},null,{"$f":"IFERROR(VLOOKUP(A158,Общий!A:D,4,0), \"\")","v":""},""]
[null,{"$f":"IFERROR(VLOOKUP(A159,Общий!A:D,2,0),\"Товар отсутствует на складе\")","v":"Товар отсутствует на складе"},{"$f":"IFERROR(VLOOKUP(A159,Общий!A:D,3,0), \"\")","v":""},null,{"$f":"IFERROR(VLOOKUP(A159,Общий!A:D,4,0), \"\")","v":""},""]
[null,{"$f":"IFERROR(VLOOKUP(A160,Общий!A:D,2,0),\"Товар отсутствует на складе\")","v":"Товар отсутствует на складе"},{"$f":"IFERROR(VLOOKUP(A160,Общий!A:D,3,0), \"\")","v":""},null,{"$f":"IFERROR(VLOOKUP(A160,Общий!A:D,4,0), \"\")","v":""},""]
[null,{"$f":"IFERROR(VLOOKUP(A161,Общий!A:D,2,0),\"Товар отсутствует на складе\")","v":"Товар отсутствует на складе"},{"$f":"IFERROR(VLOOKUP(A161,Общий!A:D,3,0), \"\")","v":""},null,{"$f":"IFERROR(VLOOKUP(A161,Общий!A:D,4,0), \"\")","v":""},""]
[null,{"$f":"IFERROR(VLOOKUP(A162,Общий!A:D,2,0),\"Товар отсутствует на складе\")","v":"Товар отсутствует на складе"},{"$f":"IFERROR(VLOOKUP(A162,Общий!A:D,3,0), \"\")","v":""},null,{"$f":"IFERROR(VLOOKUP(A162,Общий!A:D,4,0), \"\")","v":""},""]
[null,{"$f":"IFERROR(VLOOKUP(A163,Общий!A:D,2,0),\"Товар отсутствует на складе\")","v":"Товар отсутствует на складе"},{"$f":"IFERROR(VLOOKUP(A163,Общий!A:D,3,0), \"\")","v":""},null,{"$f":"IFERROR(VLOOKUP(A163,Общий!A:D,4,0), \"\")","v":""},""]
[null,{"$f":"IFERROR(VLOOKUP(A164,Общий!A:D,2,0),\"Товар отсутствует на складе\")","v":"Товар отсутствует на складе"},{"$f":"IFERROR(VLOOKUP(A164,Общий!A:D,3,0), \"\")","v":""},null,{"$f":"IFERROR(VLOOKUP(A164,Общий!A:D,4,0), \"\")","v":""},""]
[null,{"$f":"IFERROR(VLOOKUP(A165,Общий!A:D,2,0),\"Товар отсутствует на складе\")","v":"Товар отсутствует на складе"},{"$f":"IFERROR(VLOOKUP(A165,Общий!A:D,3,0), \"\")","v":""},null,{"$f":"IFERROR(VLOOKUP(A165,Общий!A:D,4,0), \"\")","v":""},""]
[null,{"$f":"IFERROR(VLOOKUP(A166,Общий!A:D,2,0),\"Товар отсутствует на складе\")","v":"Товар отсутствует на складе"},{"$f":"IFERROR(VLOOKUP(A166,Общий!A:D,3,0), \"\")","v":""},null,{"$f":"IFERROR(VLOOKUP(A166,Общий!A:D,4,0), \"\")","v":""},""]
[null,{"$f":"IFERROR(VLOOKUP(A167,Общий!A:D,2,0),\"Товар отсутствует на складе\")","v":"Товар отсутствует на складе"},{"$f":"IFERROR(VLOOKUP(A167,Общий!A:D,3,0), \"\")","v":""},null,{"$f":"IFERROR(VLOOKUP(A167,Общий!A:D,4,0), \"\")","v":""},""]
[null,{"$f":"IFERROR(VLOOKUP(A168,Общий!A:D,2,0),\"Товар отсутствует на складе\")","v":"Товар отсутствует на складе"},{"$f":"IFERROR(VLOOKUP(A168,Общий!A:D,3,0), \"\")","v":""},null,{"$f":"IFERROR(VLOOKUP(A168,Общий!A:D,4,0), \"\")","v":""},""]
[null,{"$f":"IFERROR(VLOOKUP(A169,Общий!A:D,2,0),\"Товар отсутствует на складе\")","v":"Товар отсутствует на складе"},{"$f":"IFERROR(VLOOKUP(A169,Общий!A:D,3,0), \"\")","v":""},null,{"$f":"IFERROR(VLOOKUP(A169,Общий!A:D,4,0), \"\")","v":""},""]
[null,{"$f":"IFERROR(VLOOKUP(A170,Общий!A:D,2,0),\"Товар отсутствует на складе\")","v":"Товар отсутствует на складе"},{"$f":"IFERROR(VLOOKUP(A170,Общий!A:D,3,0), \"\")","v":""},null,{"$f":"IFERROR(VLOOKUP(A170,Общий!A:D,4,0), \"\")","v":""},""]
[null,{"$f":"IFERROR(VLOOKUP(A171,Общий!A:D,2,0),\"Товар отсутствует на складе\")","v":"Товар отсутствует на складе"},{"$f":"IFERROR(VLOOKUP(A171,Общий!A:D,3,0), \"\")","v":""},null,{"$f":"IFERROR(VLOOKUP(A171,Общий!A:D,4,0), \"\")","v":""},""]
[null,{"$f":"IFERROR(VLOOKUP(A172,Общий!A:D,2,0),\"Товар отсутствует на складе\")","v":"Товар отсутствует на складе"},{"$f":"IFERROR(VLOOKUP(A172,Общий!A:D,3,0), \"\")","v":""},null,{"$f":"IFERROR(VLOOKUP(A172,Общий!A:D,4,0), \"\")","v":""},""]
[null,{"$f":"IFERROR(VLOOKUP(A173,Общий!A:D,2,0),\"Товар отсутствует на складе\")","v":"Товар отсутствует на складе"},{"$f":"IFERROR(VLOOKUP(A173,Общий!A:D,3,0), \"\")","v":""},null,{"$f":"IFERROR(VLOOKUP(A173,Общий!A:D,4,0), \"\")","v":""},""]
[null,{"$f":"IFERROR(VLOOKUP(A174,Общий!A:D,2,0),\"Товар отсутствует на складе\")","v":"Товар отсутствует на складе"},{"$f":"IFERROR(VLOOKUP(A174,Общий!A:D,3,0), \"\")","v":""},null,{"$f":"IFERROR(VLOOKUP(A174,Общий!A:D,4,0), \"\")","v":""},""]
[null,{"$f":"IFERROR(VLOOKUP(A175,Общий!A:D,2,0),\"Товар отсутствует на складе\")","v":"Товар отсутствует на складе"},{"$f":"IFERROR(VLOOKUP(A175,Общий!A:D,3,0), \"\")","v":""},null,{"$f":"IFERROR(VLOOKUP(A175,Общий!A:D,4,0), \"\")","v":""},""]
[null,{"$f":"IFERROR(VLOOKUP(A176,Общий!A:D,2,0),\"Товар отсутствует на складе\")","v":"Товар отсутствует на складе"},{"$f":"IFERROR(VLOOKUP(A176,Общий!A:D,3,0), \"\")","v":""},null,{"$f":"IFERROR(VLOOKUP(A176,Общий!A:D,4,0), \"\")","v":""},""]
[null,{"$f":"IFERROR(VLOOKUP(A177,Общий!A:D,2,0),\"Товар отсутствует на складе\")","v":"Товар отсутствует на складе"},{"$f":"IFERROR(VLOOKUP(A177,Общий!A:D,3,0), \"\")","v":""},null,{"$f":"IFERROR(VLOOKUP(A177,Общий!A:D,4,0), \"\")","v":""},""]
[null,{"$f":"IFERROR(VLOOKUP(A178,Общий!A:D,2,0),\"Товар отсутствует на складе\")","v":"Товар отсутствует на складе"},{"$f":"IFERROR(VLOOKUP(A178,Общий!A:D,3,0), \"\")","v":""},null,{"$f":"IFERROR(VLOOKUP(A178,Общий!A:D,4,0), \"\")","v":""},""]
[null,{"$f":"IFERROR(VLOOKUP(A179,Общий!A:D,2,0),\"Товар отсутствует на складе\")","v":"Товар отсутствует на складе"},{"$f":"IFERROR(VLOOKUP(A179,Общий!A:D,3,0), \"\")","v":""},null,{"$f":"IFERROR(VLOOKUP(A179,Общий!A:D,4,0), \"\")","v":""},""]
[null,{"$f":"IFERROR(VLOOKUP(A180,Общий!A:D,2,0),\"Товар отсутствует на складе\")","v":"Товар отсутствует на складе"},{"$f":"IFERROR(VLOOKUP(A180,Общий!A:D,3,0), \"\")","v":""},null,{"$f":"IFERROR(VLOOKUP(A180,Общий!A:D,4,0), \"\")","v":""},""]
[null,{"$f":"IFERROR(VLOOKUP(A181,Общий!A:D,2,0),\"Товар отсутствует на складе\")","v":"Товар отсутствует на складе"},{"$f":"IFERROR(VLOOKUP(A181,Общий!A:D,3,0), \"\")","v":""},null,{"$f":"IFERROR(VLOOKUP(A181,Общий!A:D,4,0), \"\")","v":""},""]
[null,{"$f":"IFERROR(VLOOKUP(A182,Общий!A:D,2,0),\"Товар отсутствует на складе\")","v":"Товар отсутствует на складе"},{"$f":"IFERROR(VLOOKUP(A182,Общий!A:D,3,0), \"\")","v":""},null,{"$f":"IFERROR(VLOOKUP(A182,Общий!A:D,4,0), \"\")","v":""},""]
[null,{"$f":"IFERROR(VLOOKUP(A183,Общий!A:D,2,0),\"Товар отсутствует на складе\")","v":"Товар отсутствует на складе"},{"$f":"IFERROR(VLOOKUP(A183,Общий!A:D,3,0), \"\")","v":""},null,{"$f":"IFERROR(VLOOKUP(A183,Общий!A:D,4,0), \"\")","v":""},""]
[null,{"$f":"IFERROR(VLOOKUP(A184,Общий!A:D,2,0),\"Товар отсутствует на складе\")","v":"Товар отсутствует на складе"},{"$f":"IFERROR(VLOOKUP(A184,Общий!A:D,3,0), \"\")","v":""},null,{"$f":"IFERROR(VLOOKUP(A184,Общий!A:D,4,0), \"\")","v":""},""]
[null,{"$f":"IFERROR(VLOOKUP(A185,Общий!A:D,2,0),\"Товар отсутствует на складе\")","v":"Товар отсутствует на складе"},{"$f":"IFERROR(VLOOKUP(A185,Общий!A:D,3,0), \"\")","v":""},null,{"$f":"IFERROR(VLOOKUP(A185,Общий!A:D,4,0), \"\")","v":""},""]
[null,{"$f":"IFERROR(VLOOKUP(A186,Общий!A:D,2,0),\"Товар отсутствует на складе\")","v":"Товар отсутствует на складе"},{"$f":"IFERROR(VLOOKUP(A186,Общий!A:D,3,0), \"\")","v":""},null,{"$f":"IFERROR(VLOOKUP(A186,Общий!A:D,4,0), \"\")","v":""},""]
[null,{"$f":"IFERROR(VLOOKUP(A187,Общий!A:D,2,0),\"Товар отсутствует на складе\")","v":"Товар отсутствует на складе"},{"$f":"IFERROR(VLOOKUP(A187,Общий!A:D,3,0), \"\")","v":""},null,{"$f":"IFERROR(VLOOKUP(A187,Общий!A:D,4,0), \"\")","v":""},""]
[null,{"$f":"IFERROR(VLOOKUP(A188,Общий!A:D,2,0),\"Товар отсутствует на складе\")","v":"Товар отсутствует на складе"},{"$f":"IFERROR(VLOOKUP(A188,Общий!A:D,3,0), \"\")","v":""},null,{"$f":"IFERROR(VLOOKUP(A188,Общий!A:D,4,0), \"\")","v":""},""]
[null,{"$f":"IFERROR(VLOOKUP(A189,Общий!A:D,2,0),\"Товар отсутствует на складе\")","v":"Товар отсутствует на складе"},{"$f":"IFERROR(VLOOKUP(A189,Общий!A:D,3,0), \"\")","v":""},null,{"$f":"IFERROR(VLOOKUP(A189,Общий!A:D,4,0), \"\")","v":""},""]
[null,{"$f":"IFERROR(VLOOKUP(A190,Общий!A:D,2,0),\"Товар отсутствует на складе\")","v":"Товар отсутствует на складе"},{"$f":"IFERROR(VLOOKUP(A190,Общий!A:D,3,0), \"\")","v":""},null,{"$f":"IFERROR(VLOOKUP(A190,Общий!A:D,4,0), \"\")","v":""},""]
[null,{"$f":"IFERROR(VLOOKUP(A191,Общий!A:D,2,0),\"Товар отсутствует на складе\")","v":"Товар отсутствует на складе"},{"$f":"IFERROR(VLOOKUP(A191,Общий!A:D,3,0), \"\")","v":""},null,{"$f":"IFERROR(VLOOKUP(A191,Общий!A:D,4,0), \"\")","v":""},""]
[null,{"$f":"IFERROR(VLOOKUP(A192,Общий!A:D,2,0),\"Товар отсутствует на складе\")","v":"Товар отсутствует на складе"},{"$f":"IFERROR(VLOOKUP(A192,Общий!A:D,3,0), \"\")","v":""},null,{"$f":"IFERROR(VLOOKUP(A192,Общий!A:D,4,0), \"\")","v":""},""]
[null,{"$f":"IFERROR(VLOOKUP(A193,Общий!A:D,2,0),\"Товар отсутствует на складе\")","v":"Товар отсутствует на складе"},{"$f":"IFERROR(VLOOKUP(A193,Общий!A:D,3,0), \"\")","v":""},null,{"$f":"IFERROR(VLOOKUP(A193,Общий!A:D,4,0), \"\")","v":""},""]
[null,{"$f":"IFERROR(VLOOKUP(A194,Общий!A:D,2,0),\"Товар отсутствует на складе\")","v":"Товар отсутствует на складе"},{"$f":"IFERROR(VLOOKUP(A194,Общий!A:D,3,0), \"\")","v":""},null,{"$f":"IFERROR(VLOOKUP(A194,Общий!A:D,4,0), \"\")","v":""},""]
[null,{"$f":"IFERROR(VLOOKUP(A195,Общий!A:D,2,0),\"Товар отсутствует на складе\")","v":"Товар отсутствует на складе"},{"$f":"IFERROR(VLOOKUP(A195,Общий!A:D,3,0), \"\")","v":""},null,{"$f":"IFERROR(VLOOKUP(A195,Общий!A:D,4,0), \"\")","v":""},""]
[null,{"$f":"IFERROR(VLOOKUP(A196,Общий!A:D,2,0),\"Товар отсутствует на складе\")","v":"Товар отсутствует на складе"},{"$f":"IFERROR(VLOOKUP(A196,Общий!A:D,3,0), \"\")","v":""},null,{"$f":"IFERROR(VLOOKUP(A196,Общий!A:D,4,0), \"\")","v":""},""]
[null,{"$f":"IFERROR(VLOOKUP(A197,Общий!A:D,2,0),\"Товар отсутствует на складе\")","v":"Товар отсутствует на складе"},{"$f":"IFERROR(VLOOKUP(A197,Общий!A:D,3,0), \"\")","v":""},null,{"$f":"IFERROR(VLOOKUP(A197,Общий!A:D,4,0), \"\")","v":""},""]
[null,{"$f":"IFERROR(VLOOKUP(A198,Общий!A:D,2,0),\"Товар отсутствует на складе\")","v":"Товар отсутствует на складе"},{"$f":"IFERROR(VLOOKUP(A198,Общий!A:D,3,0), \"\")","v":""},null,{"$f":"IFERROR(VLOOKUP(A198,Общий!A:D,4,0), \"\")","v":""},""]
[null,{"$f":"IFERROR(VLOOKUP(A199,Общий!A:D,2,0),\"Товар отсутствует на складе\")","v":"Товар отсутствует на складе"},{"$f":"IFERROR(VLOOKUP(A199,Общий!A:D,3,0), \"\")","v":""},null,{"$f":"IFERROR(VLOOKUP(A199,Общий!A:D,4,0), \"\")","v":""},""]
[null,{"$f":"IFERROR(VLOOKUP(A200,Общий!A:D,2,0),\"Товар отсутствует на складе\")","v":"Товар отсутствует на складе"},{"$f":"IFERROR(VLOOKUP(A200,Общий!A:D,3,0), \"\")","v":""},null,{"$f":"IFERROR(VLOOKUP(A200,Общий!A:D,4,0), \"\")","v":""},""]
[null,{"$f":"IFERROR(VLOOKUP(A201,Общий!A:D,2,0),\"Товар отсутствует на складе\")","v":"Товар отсутствует на складе"},{"$f":"IFERROR(VLOOKUP(A201,Общий!A:D,3,0), \"\")","v":""},null,{"$f":"IFERROR(VLOOKUP(A201,Общий!A:D,4,0), \"\")","v":""},""]
[null,{"$f":"IFERROR(VLOOKUP(A202,Общий!A:D,2,0),\"Товар отсутствует на складе\")","v":"Товар отсутствует на складе"},{"$f":"IFERROR(VLOOKUP(A202,Общий!A:D,3,0), \"\")","v":""},null,{"$f":"IFERROR(VLOOKUP(A202,Общий!A:D,4,0), \"\")","v":""},""]
[null,{"$f":"IFERROR(VLOOKUP(A203,Общий!A:D,2,0),\"Товар отсутствует на складе\")","v":"Товар отсутствует на складе"},{"$f":"IFERROR(VLOOKUP(A203,Общий!A:D,3,0), \"\")","v":""},null,{"$f":"IFERROR(VLOOKUP(A203,Общий!A:D,4,0), \"\")","v":""},""]
[null,{"$f":"IFERROR(VLOOKUP(A204,Общий!A:D,2,0),\"Товар отсутствует на складе\")","v":"Товар отсутствует на складе"},{"$f":"IFERROR(VLOOKUP(A204,Общий!A:D,3,0), \"\")","v":""},null,{"$f":"IFERROR(VLOOKUP(A204,Общий!A:D,4,0), \"\")","v":""},""]
[null,{"$f":"IFERROR(VLOOKUP(A205,Общий!A:D,2,0),\"Товар отсутствует на складе\")","v":"Товар отсутствует на складе"},{"$f":"IFERROR(VLOOKUP(A205,Общий!A:D,3,0), \"\")","v":""},null,{"$f":"IFERROR(VLOOKUP(A205,Общий!A:D,4,0), \"\")","v":""},""]
[null,{"$f":"IFERROR(VLOOKUP(A206,Общий!A:D,2,0),\"Товар отсутствует на складе\")","v":"Товар отсутствует на складе"},{"$f":"IFERROR(VLOOKUP(A206,Общий!A:D,3,0), \"\")","v":""},null,{"$f":"IFERROR(VLOOKUP(A206,Общий!A:D,4,0), \"\")","v":""},""]
[null,{"$f":"IFERROR(VLOOKUP(A207,Общий!A:D,2,0),\"Товар отсутствует на складе\")","v":"Товар отсутствует на складе"},{"$f":"IFERROR(VLOOKUP(A207,Общий!A:D,3,0), \"\")","v":""},null,{"$f":"IFERROR(VLOOKUP(A207,Общий!A:D,4,0), \"\")","v":""},""]
[null,{"$f":"IFERROR(VLOOKUP(A208,Общий!A:D,2,0),\"Товар отсутствует на складе\")","v":"Товар отсутствует на складе"},{"$f":"IFERROR(VLOOKUP(A208,Общий!A:D,3,0), \"\")","v":""},null,{"$f":"IFERROR(VLOOKUP(A208,Общий!A:D,4,0), \"\")","v":""},""]
[null,{"$f":"IFERROR(VLOOKUP(A209,Общий!A:D,2,0),\"Товар отсутствует на складе\")","v":"Товар отсутствует на складе"},{"$f":"IFERROR(VLOOKUP(A209,Общий!A:D,3,0), \"\")","v":""},null,{"$f":"IFERROR(VLOOKUP(A209,Общий!A:D,4,0), \"\")","v":""},{"$f":"IFERROR(D209*E209,\"\")","v":""}]
[null,{"$f":"IFERROR(VLOOKUP(A210,Общий!A:D,2,0),\"Товар отсутствует на складе\")","v":"Товар отсутствует на складе"},{"$f":"IFERROR(VLOOKUP(A210,Общий!A:D,3,0), \"\")","v":""},null,{"$f":"IFERROR(VLOOKUP(A210,Общий!A:D,4,0), \"\")","v":""},""]
[null,{"$f":"IFERROR(VLOOKUP(A211,Общий!A:D,2,0),\"Товар отсутствует на складе\")","v":"Товар отсутствует на складе"},{"$f":"IFERROR(VLOOKUP(A211,Общий!A:D,3,0), \"\")","v":""},null,{"$f":"IFERROR(VLOOKUP(A211,Общий!A:D,4,0), \"\")","v":""},""]
[null,{"$f":"IFERROR(VLOOKUP(A212,Общий!A:D,2,0),\"Товар отсутствует на складе\")","v":"Товар отсутствует на складе"},{"$f":"IFERROR(VLOOKUP(A212,Общий!A:D,3,0), \"\")","v":""},null,{"$f":"IFERROR(VLOOKUP(A212,Общий!A:D,4,0), \"\")","v":""},""]
[null,{"$f":"IFERROR(VLOOKUP(A213,Общий!A:D,2,0),\"Товар отсутствует на складе\")","v":"Товар отсутствует на складе"},{"$f":"IFERROR(VLOOKUP(A213,Общий!A:D,3,0), \"\")","v":""},null,{"$f":"IFERROR(VLOOKUP(A213,Общий!A:D,4,0), \"\")","v":""},""]
[null,{"$f":"IFERROR(VLOOKUP(A214,Общий!A:D,2,0),\"Товар отсутствует на складе\")","v":"Товар отсутствует на складе"},{"$f":"IFERROR(VLOOKUP(A214,Общий!A:D,3,0), \"\")","v":""},null,{"$f":"IFERROR(VLOOKUP(A214,Общий!A:D,4,0), \"\")","v":""},""]
[null,{"$f":"IFERROR(VLOOKUP(A215,Общий!A:D,2,0),\"Товар отсутствует на складе\")","v":"Товар отсутствует на складе"},{"$f":"IFERROR(VLOOKUP(A215,Общий!A:D,3,0), \"\")","v":""},null,{"$f":"IFERROR(VLOOKUP(A215,Общий!A:D,4,0), \"\")","v":""},""]
[null,{"$f":"IFERROR(VLOOKUP(A216,Общий!A:D,2,0),\"Товар отсутствует на складе\")","v":"Товар отсутствует на складе"},{"$f":"IFERROR(VLOOKUP(A216,Общий!A:D,3,0), \"\")","v":""},null,{"$f":"IFERROR(VLOOKUP(A216,Общий!A:D,4,0), \"\")","v":""},""]
[null,{"$f":"IFERROR(VLOOKUP(A217,Общий!A:D,2,0),\"Товар отсутствует на складе\")","v":"Товар отсутствует на складе"},{"$f":"IFERROR(VLOOKUP(A217,Общий!A:D,3,0), \"\")","v":""},null,{"$f":"IFERROR(VLOOKUP(A217,Общий!A:D,4,0), \"\")","v":""},""]
[null,{"$f":"IFERROR(VLOOKUP(A218,Общий!A:D,2,0),\"Товар отсутствует на складе\")","v":"Товар отсутствует на складе"},{"$f":"IFERROR(VLOOKUP(A218,Общий!A:D,3,0), \"\")","v":""},null,{"$f":"IFERROR(VLOOKUP(A218,Общий!A:D,4,0), \"\")","v":""},""]
[null,{"$f":"IFERROR(VLOOKUP(A219,Общий!A:D,2,0),\"Товар отсутствует на складе\")","v":"Товар отсутствует на складе"},{"$f":"IFERROR(VLOOKUP(A219,Общий!A:D,3,0), \"\")","v":""},null,{"$f":"IFERROR(VLOOKUP(A219,Общий!A:D,4,0), \"\")","v":""},""]
[null,{"$f":"IFERROR(VLOOKUP(A220,Общий!A:D,2,0),\"Товар отсутствует на складе\")","v":"Товар отсутствует на складе"},{"$f":"IFERROR(VLOOKUP(A220,Общий!A:D,3,0), \"\")","v":""},null,{"$f":"IFERROR(VLOOKUP(A220,Общий!A:D,4,0), \"\")","v":""},""]
[null,{"$f":"IFERROR(VLOOKUP(A221,Общий!A:D,2,0),\"Товар отсутствует на складе\")","v":"Товар отсутствует на складе"},{"$f":"IFERROR(VLOOKUP(A221,Общий!A:D,3,0), \"\")","v":""},null,{"$f":"IFERROR(VLOOKUP(A221,Общий!A:D,4,0), \"\")","v":""},""]
[null,{"$f":"IFERROR(VLOOKUP(A222,Общий!A:D,2,0),\"Товар отсутствует на складе\")","v":"Товар отсутствует на складе"},{"$f":"IFERROR(VLOOKUP(A222,Общий!A:D,3,0), \"\")","v":""},null,{"$f":"IFERROR(VLOOKUP(A222,Общий!A:D,4,0), \"\")","v":""},""]
[null,{"$f":"IFERROR(VLOOKUP(A223,Общий!A:D,2,0),\"Товар отсутствует на складе\")","v":"Товар отсутствует на складе"},{"$f":"IFERROR(VLOOKUP(A223,Общий!A:D,3,0), \"\")","v":""},null,{"$f":"IFERROR(VLOOKUP(A223,Общий!A:D,4,0), \"\")","v":""},""]
[null,{"$f":"IFERROR(VLOOKUP(A224,Общий!A:D,2,0),\"Товар отсутствует на складе\")","v":"Товар отсутствует на складе"},{"$f":"IFERROR(VLOOKUP(A224,Общий!A:D,3,0), \"\")","v":""},null,{"$f":"IFERROR(VLOOKUP(A224,Общий!A:D,4,0), \"\")","v":""},""]
[null,{"$f":"IFERROR(VLOOKUP(A225,Общий!A:D,2,0),\"Товар отсутствует на складе\")","v":"Товар отсутствует на складе"},{"$f":"IFERROR(VLOOKUP(A225,Общий!A:D,3,0), \"\")","v":""},null,{"$f":"IFERROR(VLOOKUP(A225,Общий!A:D,4,0), \"\")","v":""},""]
[null,{"$f":"IFERROR(VLOOKUP(A226,Общий!A:D,2,0),\"Товар отсутствует на складе\")","v":"Товар отсутствует на складе"},{"$f":"IFERROR(VLOOKUP(A226,Общий!A:D,3,0), \"\")","v":""},null,{"$f":"IFERROR(VLOOKUP(A226,Общий!A:D,4,0), \"\")","v":""},""]
[null,{"$f":"IFERROR(VLOOKUP(A227,Общий!A:D,2,0),\"Товар отсутствует на складе\")","v":"Товар отсутствует на складе"},{"$f":"IFERROR(VLOOKUP(A227,Общий!A:D,3,0), \"\")","v":""},null,{"$f":"IFERROR(VLOOKUP(A227,Общий!A:D,4,0), \"\")","v":""},""]
[null,{"$f":"IFERROR(VLOOKUP(A228,Общий!A:D,2,0),\"Товар отсутствует на складе\")","v":"Товар отсутствует на складе"},{"$f":"IFERROR(VLOOKUP(A228,Общий!A:D,3,0), \"\")","v":""},null,{"$f":"IFERROR(VLOOKUP(A228,Общий!A:D,4,0), \"\")","v":""},""]
[null,{"$f":"IFERROR(VLOOKUP(A229,Общий!A:D,2,0),\"Товар отсутствует на складе\")","v":"Товар отсутствует на складе"},{"$f":"IFERROR(VLOOKUP(A229,Общий!A:D,3,0), \"\")","v":""},null,{"$f":"IFERROR(VLOOKUP(A229,Общий!A:D,4,0), \"\")","v":""},""]
[null,{"$f":"IFERROR(VLOOKUP(A230,Общий!A:D,2,0),\"Товар отсутствует на складе\")","v":"Товар отсутствует на складе"},{"$f":"IFERROR(VLOOKUP(A230,Общий!A:D,3,0), \"\")","v":""},null,{"$f":"IFERROR(VLOOKUP(A230,Общий!A:D,4,0), \"\")","v":""},""]
[null,{"$f":"IFERROR(VLOOKUP(A231,Общий!A:D,2,0),\"Товар отсутствует на складе\")","v":"Товар отсутствует на складе"},{"$f":"IFERROR(VLOOKUP(A231,Общий!A:D,3,0), \"\")","v":""},null,{"$f":"IFERROR(VLOOKUP(A231,Общий!A:D,4,0), \"\")","v":""},""]
[null,{"$f":"IFERROR(VLOOKUP(A232,Общий!A:D,2,0),\"Товар отсутствует на складе\")","v":"Товар отсутствует на складе"},{"$f":"IFERROR(VLOOKUP(A232,Общий!A:D,3,0), \"\")","v":""},null,{"$f":"IFERROR(VLOOKUP(A232,Общий!A:D,4,0), \"\")","v":""},""]
[null,{"$f":"IFERROR(VLOOKUP(A233,Общий!A:D,2,0),\"Товар отсутствует на складе\")","v":"Товар отсутствует на складе"},{"$f":"IFERROR(VLOOKUP(A233,Общий!A:D,3,0), \"\")","v":""},null,{"$f":"IFERROR(VLOOKUP(A233,Общий!A:D,4,0), \"\")","v":""},""]
[null,{"$f":"IFERROR(VLOOKUP(A234,Общий!A:D,2,0),\"Товар отсутствует на складе\")","v":"Товар отсутствует на складе"},{"$f":"IFERROR(VLOOKUP(A234,Общий!A:D,3,0), \"\")","v":""},null,{"$f":"IFERROR(VLOOKUP(A234,Общий!A:D,4,0), \"\")","v":""},""]
[null,{"$f":"IFERROR(VLOOKUP(A235,Общий!A:D,2,0),\"Товар отсутствует на складе\")","v":"Товар отсутствует на складе"},{"$f":"IFERROR(VLOOKUP(A235,Общий!A:D,3,0), \"\")","v":""},null,{"$f":"IFERROR(VLOOKUP(A235,Общий!A:D,4,0), \"\")","v":""},""]
[null,{"$f":"IFERROR(VLOOKUP(A236,Общий!A:D,2,0),\"Товар отсутствует на складе\")","v":"Товар отсутствует на складе"},{"$f":"IFERROR(VLOOKUP(A236,Общий!A:D,3,0), \"\")","v":""},null,{"$f":"IFERROR(VLOOKUP(A236,Общий!A:D,4,0), \"\")","v":""},""]
[null,{"$f":"IFERROR(VLOOKUP(A237,Общий!A:D,2,0),\"Товар отсутствует на складе\")","v":"Товар отсутствует на складе"},{"$f":"IFERROR(VLOOKUP(A237,Общий!A:D,3,0), \"\")","v":""},null,{"$f":"IFERROR(VLOOKUP(A237,Общий!A:D,4,0), \"\")","v":""},""]
[null,{"$f":"IFERROR(VLOOKUP(A238,Общий!A:D,2,0),\"Товар отсутствует на складе\")","v":"Товар отсутствует на складе"},{"$f":"IFERROR(VLOOKUP(A238,Общий!A:D,3,0), \"\")","v":""},null,{"$f":"IFERROR(VLOOKUP(A238,Общий!A:D,4,0), \"\")","v":""},""]
[null,{"$f":"IFERROR(VLOOKUP(A239,Общий!A:D,2,0),\"Товар отсутствует на складе\")","v":"Товар отсутствует на складе"},{"$f":"IFERROR(VLOOKUP(A239,Общий!A:D,3,0), \"\")","v":""},null,{"$f":"IFERROR(VLOOKUP(A239,Общий!A:D,4,0), \"\")","v":""},""]
[null,{"$f":"IFERROR(VLOOKUP(A240,Общий!A:D,2,0),\"Товар отсутствует на складе\")","v":"Товар отсутствует на складе"},{"$f":"IFERROR(VLOOKUP(A240,Общий!A:D,3,0), \"\")","v":""},null,{"$f":"IFERROR(VLOOKUP(A240,Общий!A:D,4,0), \"\")","v":""},""]
[null,{"$f":"IFERROR(VLOOKUP(A241,Общий!A:D,2,0),\"Товар отсутствует на складе\")","v":"Товар отсутствует на складе"},{"$f":"IFERROR(VLOOKUP(A241,Общий!A:D,3,0), \"\")","v":""},null,{"$f":"IFERROR(VLOOKUP(A241,Общий!A:D,4,0), \"\")","v":""},""]
[null,{"$f":"IFERROR(VLOOKUP(A242,Общий!A:D,2,0),\"Товар отсутствует на складе\")","v":"Товар отсутствует на складе"},{"$f":"IFERROR(VLOOKUP(A242,Общий!A:D,3,0), \"\")","v":""},null,{"$f":"IFERROR(VLOOKUP(A242,Общий!A:D,4,0), \"\")","v":""},""]
[null,{"$f":"IFERROR(VLOOKUP(A243,Общий!A:D,2,0),\"Товар отсутствует на складе\")","v":"Товар отсутствует на складе"},{"$f":"IFERROR(VLOOKUP(A243,Общий!A:D,3,0), \"\")","v":""},null,{"$f":"IFERROR(VLOOKUP(A243,Общий!A:D,4,0), \"\")","v":""},""]
[null,{"$f":"IFERROR(VLOOKUP(A244,Общий!A:D,2,0),\"Товар отсутствует на складе\")","v":"Товар отсутствует на складе"},{"$f":"IFERROR(VLOOKUP(A244,Общий!A:D,3,0), \"\")","v":""},null,{"$f":"IFERROR(VLOOKUP(A244,Общий!A:D,4,0), \"\")","v":""},""]
[null,{"$f":"IFERROR(VLOOKUP(A245,Общий!A:D,2,0),\"Товар отсутствует на складе\")","v":"Товар отсутствует на складе"},{"$f":"IFERROR(VLOOKUP(A245,Общий!A:D,3,0), \"\")","v":""},null,{"$f":"IFERROR(VLOOKUP(A245,Общий!A:D,4,0), \"\")","v":""},""]
[null,{"$f":"IFERROR(VLOOKUP(A246,Общий!A:D,2,0),\"Товар отсутствует на складе\")","v":"Товар отсутствует на складе"},{"$f":"IFERROR(VLOOKUP(A246,Общий!A:D,3,0), \"\")","v":""},null,{"$f":"IFERROR(VLOOKUP(A246,Общий!A:D,4,0), \"\")","v":""},""]
[null,{"$f":"IFERROR(VLOOKUP(A247,Общий!A:D,2,0),\"Товар отсутствует на складе\")","v":"Товар отсутствует на складе"},{"$f":"IFERROR(VLOOKUP(A247,Общий!A:D,3,0), \"\")","v":""},null,{"$f":"IFERROR(VLOOKUP(A247,Общий!A:D,4,0), \"\")","v":""},""]
[null,{"$f":"IFERROR(VLOOKUP(A248,Общий!A:D,2,0),\"Товар отсутствует на складе\")","v":"Товар отсутствует на складе"},{"$f":"IFERROR(VLOOKUP(A248,Общий!A:D,3,0), \"\")","v":""},null,{"$f":"IFERROR(VLOOKUP(A248,Общий!A:D,4,0), \"\")","v":""},""]
[null,{"$f":"IFERROR(VLOOKUP(A249,Общий!A:D,2,0),\"Товар отсутствует на складе\")","v":"Товар отсутствует на складе"},{"$f":"IFERROR(VLOOKUP(A249,Общий!A:D,3,0), \"\")","v":""},null,{"$f":"IFERROR(VLOOKUP(A249,Общий!A:D,4,0), \"\")","v":""},""]
[null,{"$f":"IFERROR(VLOOKUP(A250,Общий!A:D,2,0),\"Товар отсутствует на складе\")","v":"Товар отсутствует на складе"},{"$f":"IFERROR(VLOOKUP(A250,Общий!A:D,3,0), \"\")","v":""},null,{"$f":"IFERROR(VLOOKUP(A250,Общий!A:D,4,0), \"\")","v":""},""]
[null,{"$f":"IFERROR(VLOOKUP(A251,Общий!A:D,2,0),\"Товар отсутствует на складе\")","v":"Товар отсутствует на складе"},{"$f":"IFERROR(VLOOKUP(A251,Общий!A:D,3,0), \"\")","v":""},null,{"$f":"IFERROR(VLOOKUP(A251,Общий!A:D,4,0), \"\")","v":""},""]
[null,{"$f":"IFERROR(VLOOKUP(A252,Общий!A:D,2,0),\"Товар отсутствует на складе\")","v":"Товар отсутствует на складе"},{"$f":"IFERROR(VLOOKUP(A252,Общий!A:D,3,0), \"\")","v":""},null,{"$f":"IFERROR(VLOOKUP(A252,Общий!A:D,4,0), \"\")","v":""},""]
[null,{"$f":"IFERROR(VLOOKUP(A253,Общий!A:D,2,0),\"Товар отсутствует на складе\")","v":"Товар отсутствует на складе"},{"$f":"IFERROR(VLOOKUP(A253,Общий!A:D,3,0), \"\")","v":""},null,{"$f":"IFERROR(VLOOKUP(A253,Общий!A:D,4,0), \"\")","v":""},""]
[null,{"$f":"IFERROR(VLOOKUP(A254,Общий!A:D,2,0),\"Товар отсутствует на складе\")","v":"Товар отсутствует на складе"},{"$f":"IFERROR(VLOOKUP(A254,Общий!A:D,3,0), \"\")","v":""},null,{"$f":"IFERROR(VLOOKUP(A254,Общий!A:D,4,0), \"\")","v":""},""]
[null,{"$f":"IFERROR(VLOOKUP(A255,Общий!A:D,2,0),\"Товар отсутствует на складе\")","v":"Товар отсутствует на складе"},{"$f":"IFERROR(VLOOKUP(A255,Общий!A:D,3,0), \"\")","v":""},null,{"$f":"IFERROR(VLOOKUP(A255,Общий!A:D,4,0), \"\")","v":""},""]
[null,{"$f":"IFERROR(VLOOKUP(A256,Общий!A:D,2,0),\"Товар отсутствует на складе\")","v":"Товар отсутствует на складе"},{"$f":"IFERROR(VLOOKUP(A256,Общий!A:D,3,0), \"\")","v":""},null,{"$f":"IFERROR(VLOOKUP(A256,Общий!A:D,4,0), \"\")","v":""},""]
[null,{"$f":"IFERROR(VLOOKUP(A257,Общий!A:D,2,0),\"Товар отсутствует на складе\")","v":"Товар отсутствует на складе"},{"$f":"IFERROR(VLOOKUP(A257,Общий!A:D,3,0), \"\")","v":""},null,{"$f":"IFERROR(VLOOKUP(A257,Общий!A:D,4,0), \"\")","v":""},""]
[null,{"$f":"IFERROR(VLOOKUP(A258,Общий!A:D,2,0),\"Товар отсутствует на складе\")","v":"Товар отсутствует на складе"},{"$f":"IFERROR(VLOOKUP(A258,Общий!A:D,3,0), \"\")","v":""},null,{"$f":"IFERROR(VLOOKUP(A258,Общий!A:D,4,0), \"\")","v":""},""]
[null,{"$f":"IFERROR(VLOOKUP(A259,Общий!A:D,2,0),\"Товар отсутствует на складе\")","v":"Товар отсутствует на складе"},{"$f":"IFERROR(VLOOKUP(A259,Общий!A:D,3,0), \"\")","v":""},null,{"$f":"IFERROR(VLOOKUP(A259,Общий!A:D,4,0), \"\")","v":""},""]
[null,{"$f":"IFERROR(VLOOKUP(A260,Общий!A:D,2,0),\"Товар отсутствует на складе\")","v":"Товар отсутствует на складе"},{"$f":"IFERROR(VLOOKUP(A260,Общий!A:D,3,0), \"\")","v":""},null,{"$f":"IFERROR(VLOOKUP(A260,Общий!A:D,4,0), \"\")","v":""},""]
[null,{"$f":"IFERROR(VLOOKUP(A261,Общий!A:D,2,0),\"Товар отсутствует на складе\")","v":"Товар отсутствует на складе"},{"$f":"IFERROR(VLOOKUP(A261,Общий!A:D,3,0), \"\")","v":""},null,{"$f":"IFERROR(VLOOKUP(A261,Общий!A:D,4,0), \"\")","v":""},""]
[null,{"$f":"IFERROR(VLOOKUP(A262,Общий!A:D,2,0),\"Товар отсутствует на складе\")","v":"Товар отсутствует на складе"},{"$f":"IFERROR(VLOOKUP(A262,Общий!A:D,3,0), \"\")","v":""},null,{"$f":"IFERROR(VLOOKUP(A262,Общий!A:D,4,0), \"\")","v":""},""]
[null,{"$f":"IFERROR(VLOOKUP(A263,Общий!A:D,2,0),\"Товар отсутствует на складе\")","v":"Товар отсутствует на складе"},{"$f":"IFERROR(VLOOKUP(A263,Общий!A:D,3,0), \"\")","v":""},null,{"$f":"IFERROR(VLOOKUP(A263,Общий!A:D,4,0), \"\")","v":""},""]
[null,{"$f":"IFERROR(VLOOKUP(A264,Общий!A:D,2,0),\"Товар отсутствует на складе\")","v":"Товар отсутствует на складе"},{"$f":"IFERROR(VLOOKUP(A264,Общий!A:D,3,0), \"\")","v":""},null,{"$f":"IFERROR(VLOOKUP(A264,Общий!A:D,4,0), \"\")","v":""},""]
[null,{"$f":"IFERROR(VLOOKUP(A265,Общий!A:D,2,0),\"Товар отсутствует на складе\")","v":"Товар отсутствует на складе"},{"$f":"IFERROR(VLOOKUP(A265,Общий!A:D,3,0), \"\")","v":""},null,{"$f":"IFERROR(VLOOKUP(A265,Общий!A:D,4,0), \"\")","v":""},""]
[null,{"$f":"IFERROR(VLOOKUP(A266,Общий!A:D,2,0),\"Товар отсутствует на складе\")","v":"Товар отсутствует на складе"},{"$f":"IFERROR(VLOOKUP(A266,Общий!A:D,3,0), \"\")","v":""},null,{"$f":"IFERROR(VLOOKUP(A266,Общий!A:D,4,0), \"\")","v":""},""]
[null,{"$f":"IFERROR(VLOOKUP(A267,Общий!A:D,2,0),\"Товар отсутствует на складе\")","v":"Товар отсутствует на складе"},{"$f":"IFERROR(VLOOKUP(A267,Общий!A:D,3,0), \"\")","v":""},null,{"$f":"IFERROR(VLOOKUP(A267,Общий!A:D,4,0), \"\")","v":""},""]
[null,{"$f":"IFERROR(VLOOKUP(A268,Общий!A:D,2,0),\"Товар отсутствует на складе\")","v":"Товар отсутствует на складе"},{"$f":"IFERROR(VLOOKUP(A268,Общий!A:D,3,0), \"\")","v":""},null,{"$f":"IFERROR(VLOOKUP(A268,Общий!A:D,4,0), \"\")","v":""},""]
[null,{"$f":"IFERROR(VLOOKUP(A269,Общий!A:D,2,0),\"Товар отсутствует на складе\")","v":"Товар отсутствует на складе"},{"$f":"IFERROR(VLOOKUP(A269,Общий!A:D,3,0), \"\")","v":""},null,{"$f":"IFERROR(VLOOKUP(A269,Общий!A:D,4,0), \"\")","v":""},""]
[null,{"$f":"IFERROR(VLOOKUP(A270,Общий!A:D,2,0),\"Товар отсутствует на складе\")","v":"Товар отсутствует на складе"},{"$f":"IFERROR(VLOOKUP(A270,Общий!A:D,3,0), \"\")","v":""},null,{"$f":"IFERROR(VLOOKUP(A270,Общий!A:D,4,0), \"\")","v":""},""]
[null,{"$f":"IFERROR(VLOOKUP(A271,Общий!A:D,2,0),\"Товар отсутствует на складе\")","v":"Товар отсутствует на складе"},{"$f":"IFERROR(VLOOKUP(A271,Общий!A:D,3,0), \"\")","v":""},null,{"$f":"IFERROR(VLOOKUP(A271,Общий!A:D,4,0), \"\")","v":""},""]
[null,{"$f":"IFERROR(VLOOKUP(A272,Общий!A:D,2,0),\"Товар отсутствует на складе\")","v":"Товар отсутствует на складе"},{"$f":"IFERROR(VLOOKUP(A272,Общий!A:D,3,0), \"\")","v":""},null,{"$f":"IFERROR(VLOOKUP(A272,Общий!A:D,4,0), \"\")","v":""},""]
[null,{"$f":"IFERROR(VLOOKUP(A273,Общий!A:D,2,0),\"Товар отсутствует на складе\")","v":"Товар отсутствует на складе"},{"$f":"IFERROR(VLOOKUP(A273,Общий!A:D,3,0), \"\")","v":""},null,{"$f":"IFERROR(VLOOKUP(A273,Общий!A:D,4,0), \"\")","v":""},{"$f":"IFERROR(D273*E273,\"\")","v":""}]
[null,{"$f":"IFERROR(VLOOKUP(A274,Общий!A:D,2,0),\"Товар отсутствует на складе\")","v":"Товар отсутствует на складе"},{"$f":"IFERROR(VLOOKUP(A274,Общий!A:D,3,0), \"\")","v":""},null,{"$f":"IFERROR(VLOOKUP(A274,Общий!A:D,4,0), \"\")","v":""},""]
[null,{"$f":"IFERROR(VLOOKUP(A275,Общий!A:D,2,0),\"Товар отсутствует на складе\")","v":"Товар отсутствует на складе"},{"$f":"IFERROR(VLOOKUP(A275,Общий!A:D,3,0), \"\")","v":""},null,{"$f":"IFERROR(VLOOKUP(A275,Общий!A:D,4,0), \"\")","v":""},""]
[null,{"$f":"IFERROR(VLOOKUP(A276,Общий!A:D,2,0),\"Товар отсутствует на складе\")","v":"Товар отсутствует на складе"},{"$f":"IFERROR(VLOOKUP(A276,Общий!A:D,3,0), \"\")","v":""},null,{"$f":"IFERROR(VLOOKUP(A276,Общий!A:D,4,0), \"\")","v":""},""]
[null,{"$f":"IFERROR(VLOOKUP(A277,Общий!A:D,2,0),\"Товар отсутствует на складе\")","v":"Товар отсутствует на складе"},{"$f":"IFERROR(VLOOKUP(A277,Общий!A:D,3,0), \"\")","v":""},null,{"$f":"IFERROR(VLOOKUP(A277,Общий!A:D,4,0), \"\")","v":""},""]
[null,{"$f":"IFERROR(VLOOKUP(A278,Общий!A:D,2,0),\"Товар отсутствует на складе\")","v":"Товар отсутствует на складе"},{"$f":"IFERROR(VLOOKUP(A278,Общий!A:D,3,0), \"\")","v":""},null,{"$f":"IFERROR(VLOOKUP(A278,Общий!A:D,4,0), \"\")","v":""},""]
[null,{"$f":"IFERROR(VLOOKUP(A279,Общий!A:D,2,0),\"Товар отсутствует на складе\")","v":"Товар отсутствует на складе"},{"$f":"IFERROR(VLOOKUP(A279,Общий!A:D,3,0), \"\")","v":""},null,{"$f":"IFERROR(VLOOKUP(A279,Общий!A:D,4,0), \"\")","v":""},""]
[null,{"$f":"IFERROR(VLOOKUP(A280,Общий!A:D,2,0),\"Товар отсутствует на складе\")","v":"Товар отсутствует на складе"},{"$f":"IFERROR(VLOOKUP(A280,Общий!A:D,3,0), \"\")","v":""},null,{"$f":"IFERROR(VLOOKUP(A280,Общий!A:D,4,0), \"\")","v":""},""]
[null,{"$f":"IFERROR(VLOOKUP(A281,Общий!A:D,2,0),\"Товар отсутствует на складе\")","v":"Товар отсутствует на складе"},{"$f":"IFERROR(VLOOKUP(A281,Общий!A:D,3,0), \"\")","v":""},null,{"$f":"IFERROR(VLOOKUP(A281,Общий!A:D,4,0), \"\")","v":""},""]
[null,{"$f":"IFERROR(VLOOKUP(A282,Общий!A:D,2,0),\"Товар отсутствует на складе\")","v":"Товар отсутствует на складе"},{"$f":"IFERROR(VLOOKUP(A282,Общий!A:D,3,0), \"\")","v":""},null,{"$f":"IFERROR(VLOOKUP(A282,Общий!A:D,4,0), \"\")","v":""},""]
[null,{"$f":"IFERROR(VLOOKUP(A283,Общий!A:D,2,0),\"Товар отсутствует на складе\")","v":"Товар отсутствует на складе"},{"$f":"IFERROR(VLOOKUP(A283,Общий!A:D,3,0), \"\")","v":""},null,{"$f":"IFERROR(VLOOKUP(A283,Общий!A:D,4,0), \"\")","v":""},""]
[null,{"$f":"IFERROR(VLOOKUP(A284,Общий!A:D,2,0),\"Товар отсутствует на складе\")","v":"Товар отсутствует на складе"},{"$f":"IFERROR(VLOOKUP(A284,Общий!A:D,3,0), \"\")","v":""},null,{"$f":"IFERROR(VLOOKUP(A284,Общий!A:D,4,0), \"\")","v":""},""]
[null,{"$f":"IFERROR(VLOOKUP(A285,Общий!A:D,2,0),\"Товар отсутствует на складе\")","v":"Товар отсутствует на складе"},{"$f":"IFERROR(VLOOKUP(A285,Общий!A:D,3,0), \"\")","v":""},null,{"$f":"IFERROR(VLOOKUP(A285,Общий!A:D,4,0), \"\")","v":""},""]
[null,{"$f":"IFERROR(VLOOKUP(A286,Общий!A:D,2,0),\"Товар отсутствует на складе\")","v":"Товар отсутствует на складе"},{"$f":"IFERROR(VLOOKUP(A286,Общий!A:D,3,0), \"\")","v":""},null,{"$f":"IFERROR(VLOOKUP(A286,Общий!A:D,4,0), \"\")","v":""},""]
[null,{"$f":"IFERROR(VLOOKUP(A287,Общий!A:D,2,0),\"Товар отсутствует на складе\")","v":"Товар отсутствует на складе"},{"$f":"IFERROR(VLOOKUP(A287,Общий!A:D,3,0), \"\")","v":""},null,{"$f":"IFERROR(VLOOKUP(A287,Общий!A:D,4,0), \"\")","v":""},""]
[null,{"$f":"IFERROR(VLOOKUP(A288,Общий!A:D,2,0),\"Товар отсутствует на складе\")","v":"Товар отсутствует на складе"},{"$f":"IFERROR(VLOOKUP(A288,Общий!A:D,3,0), \"\")","v":""},null,{"$f":"IFERROR(VLOOKUP(A288,Общий!A:D,4,0), \"\")","v":""},""]
[null,{"$f":"IFERROR(VLOOKUP(A289,Общий!A:D,2,0),\"Товар отсутствует на складе\")","v":"Товар отсутствует на складе"},{"$f":"IFERROR(VLOOKUP(A289,Общий!A:D,3,0), \"\")","v":""},null,{"$f":"IFERROR(VLOOKUP(A289,Общий!A:D,4,0), \"\")","v":""},""]
[null,{"$f":"IFERROR(VLOOKUP(A290,Общий!A:D,2,0),\"Товар отсутствует на складе\")","v":"Товар отсутствует на складе"},{"$f":"IFERROR(VLOOKUP(A290,Общий!A:D,3,0), \"\")","v":""},null,{"$f":"IFERROR(VLOOKUP(A290,Общий!A:D,4,0), \"\")","v":""},""]
[null,{"$f":"IFERROR(VLOOKUP(A291,Общий!A:D,2,0),\"Товар отсутствует на складе\")","v":"Товар отсутствует на складе"},{"$f":"IFERROR(VLOOKUP(A291,Общий!A:D,3,0), \"\")","v":""},null,{"$f":"IFERROR(VLOOKUP(A291,Общий!A:D,4,0), \"\")","v":""},""]
[null,{"$f":"IFERROR(VLOOKUP(A292,Общий!A:D,2,0),\"Товар отсутствует на складе\")","v":"Товар отсутствует на складе"},{"$f":"IFERROR(VLOOKUP(A292,Общий!A:D,3,0), \"\")","v":""},null,{"$f":"IFERROR(VLOOKUP(A292,Общий!A:D,4,0), \"\")","v":""},""]
[null,{"$f":"IFERROR(VLOOKUP(A293,Общий!A:D,2,0),\"Товар отсутствует на складе\")","v":"Товар отсутствует на складе"},{"$f":"IFERROR(VLOOKUP(A293,Общий!A:D,3,0), \"\")","v":""},null,{"$f":"IFERROR(VLOOKUP(A293,Общий!A:D,4,0), \"\")","v":""},""]
[null,{"$f":"IFERROR(VLOOKUP(A294,Общий!A:D,2,0),\"Товар отсутствует на складе\")","v":"Товар отсутствует на складе"},{"$f":"IFERROR(VLOOKUP(A294,Общий!A:D,3,0), \"\")","v":""},null,{"$f":"IFERROR(VLOOKUP(A294,Общий!A:D,4,0), \"\")","v":""},""]
[null,{"$f":"IFERROR(VLOOKUP(A295,Общий!A:D,2,0),\"Товар отсутствует на складе\")","v":"Товар отсутствует на складе"},{"$f":"IFERROR(VLOOKUP(A295,Общий!A:D,3,0), \"\")","v":""},null,{"$f":"IFERROR(VLOOKUP(A295,Общий!A:D,4,0), \"\")","v":""},""]
[null,{"$f":"IFERROR(VLOOKUP(A296,Общий!A:D,2,0),\"Товар отсутствует на складе\")","v":"Товар отсутствует на складе"},{"$f":"IFERROR(VLOOKUP(A296,Общий!A:D,3,0), \"\")","v":""},null,{"$f":"IFERROR(VLOOKUP(A296,Общий!A:D,4,0), \"\")","v":""},""]
[null,{"$f":"IFERROR(VLOOKUP(A297,Общий!A:D,2,0),\"Товар отсутствует на складе\")","v":"Товар отсутствует на складе"},{"$f":"IFERROR(VLOOKUP(A297,Общий!A:D,3,0), \"\")","v":""},null,{"$f":"IFERROR(VLOOKUP(A297,Общий!A:D,4,0), \"\")","v":""},""]
[null,{"$f":"IFERROR(VLOOKUP(A298,Общий!A:D,2,0),\"Товар отсутствует на складе\")","v":"Товар отсутствует на складе"},{"$f":"IFERROR(VLOOKUP(A298,Общий!A:D,3,0), \"\")","v":""},null,{"$f":"IFERROR(VLOOKUP(A298,Общий!A:D,4,0), \"\")","v":""},""]
[null,{"$f":"IFERROR(VLOOKUP(A299,Общий!A:D,2,0),\"Товар отсутствует на складе\")","v":"Товар отсутствует на складе"},{"$f":"IFERROR(VLOOKUP(A299,Общий!A:D,3,0), \"\")","v":""},null,{"$f":"IFERROR(VLOOKUP(A299,Общий!A:D,4,0), \"\")","v":""},""]
[null,{"$f":"IFERROR(VLOOKUP(A300,Общий!A:D,2,0),\"Товар отсутствует на складе\")","v":"Товар отсутствует на складе"},{"$f":"IFERROR(VLOOKUP(A300,Общий!A:D,3,0), \"\")","v":""},null,{"$f":"IFERROR(VLOOKUP(A300,Общий!A:D,4,0), \"\")","v":""},""]
[null,{"$f":"IFERROR(VLOOKUP(A301,Общий!A:D,2,0),\"Товар отсутствует на складе\")","v":"Товар отсутствует на складе"},{"$f":"IFERROR(VLOOKUP(A301,Общий!A:D,3,0), \"\")","v":""},null,{"$f":"IFERROR(VLOOKUP(A301,Общий!A:D,4,0), \"\")","v":""},""]
[null,{"$f":"IFERROR(VLOOKUP(A302,Общий!A:D,2,0),\"Товар отсутствует на складе\")","v":"Товар отсутствует на складе"},{"$f":"IFERROR(VLOOKUP(A302,Общий!A:D,3,0), \"\")","v":""},null,{"$f":"IFERROR(VLOOKUP(A302,Общий!A:D,4,0), \"\")","v":""},""]
[null,{"$f":"IFERROR(VLOOKUP(A303,Общий!A:D,2,0),\"Товар отсутствует на складе\")","v":"Товар отсутствует на складе"},{"$f":"IFERROR(VLOOKUP(A303,Общий!A:D,3,0), \"\")","v":""},null,{"$f":"IFERROR(VLOOKUP(A303,Общий!A:D,4,0), \"\")","v":""},""]
[null,{"$f":"IFERROR(VLOOKUP(A304,Общий!A:D,2,0),\"Товар отсутствует на складе\")","v":"Товар отсутствует на складе"},{"$f":"IFERROR(VLOOKUP(A304,Общий!A:D,3,0), \"\")","v":""},null,{"$f":"IFERROR(VLOOKUP(A304,Общий!A:D,4,0), \"\")","v":""},""]
[null,{"$f":"IFERROR(VLOOKUP(A305,Общий!A:D,2,0),\"Товар отсутствует на складе\")","v":"Товар отсутствует на складе"},{"$f":"IFERROR(VLOOKUP(A305,Общий!A:D,3,0), \"\")","v":""},null,{"$f":"IFERROR(VLOOKUP(A305,Общий!A:D,4,0), \"\")","v":""},""]
[null,{"$f":"IFERROR(VLOOKUP(A306,Общий!A:D,2,0),\"Товар отсутствует на складе\")","v":"Товар отсутствует на складе"},{"$f":"IFERROR(VLOOKUP(A306,Общий!A:D,3,0), \"\")","v":""},null,{"$f":"IFERROR(VLOOKUP(A306,Общий!A:D,4,0), \"\")","v":""},""]
[null,{"$f":"IFERROR(VLOOKUP(A307,Общий!A:D,2,0),\"Товар отсутствует на складе\")","v":"Товар отсутствует на складе"},{"$f":"IFERROR(VLOOKUP(A307,Общий!A:D,3,0), \"\")","v":""},null,{"$f":"IFERROR(VLOOKUP(A307,Общий!A:D,4,0), \"\")","v":""},""]
[null,{"$f":"IFERROR(VLOOKUP(A308,Общий!A:D,2,0),\"Товар отсутствует на складе\")","v":"Товар отсутствует на складе"},{"$f":"IFERROR(VLOOKUP(A308,Общий!A:D,3,0), \"\")","v":""},null,{"$f":"IFERROR(VLOOKUP(A308,Общий!A:D,4,0), \"\")","v":""},""]
[null,{"$f":"IFERROR(VLOOKUP(A309,Общий!A:D,2,0),\"Товар отсутствует на складе\")","v":"Товар отсутствует на складе"},{"$f":"IFERROR(VLOOKUP(A309,Общий!A:D,3,0), \"\")","v":""},null,{"$f":"IFERROR(VLOOKUP(A309,Общий!A:D,4,0), \"\")","v":""},""]
[null,{"$f":"IFERROR(VLOOKUP(A310,Общий!A:D,2,0),\"Товар отсутствует на складе\")","v":"Товар отсутствует на складе"},{"$f":"IFERROR(VLOOKUP(A310,Общий!A:D,3,0), \"\")","v":""},null,{"$f":"IFERROR(VLOOKUP(A310,Общий!A:D,4,0), \"\")","v":""},""]
[null,{"$f":"IFERROR(VLOOKUP(A311,Общий!A:D,2,0),\"Товар отсутствует на складе\")","v":"Товар отсутствует на складе"},{"$f":"IFERROR(VLOOKUP(A311,Общий!A:D,3,0), \"\")","v":""},null,{"$f":"IFERROR(VLOOKUP(A311,Общий!A:D,4,0), \"\")","v":""},""]
[null,{"$f":"IFERROR(VLOOKUP(A312,Общий!A:D,2,0),\"Товар отсутствует на складе\")","v":"Товар отсутствует на складе"},{"$f":"IFERROR(VLOOKUP(A312,Общий!A:D,3,0), \"\")","v":""},null,{"$f":"IFERROR(VLOOKUP(A312,Общий!A:D,4,0), \"\")","v":""},""]
[null,{"$f":"IFERROR(VLOOKUP(A313,Общий!A:D,2,0),\"Товар отсутствует на складе\")","v":"Товар отсутствует на складе"},{"$f":"IFERROR(VLOOKUP(A313,Общий!A:D,3,0), \"\")","v":""},null,{"$f":"IFERROR(VLOOKUP(A313,Общий!A:D,4,0), \"\")","v":""},""]
[null,{"$f":"IFERROR(VLOOKUP(A314,Общий!A:D,2,0),\"Товар отсутствует на складе\")","v":"Товар отсутствует на складе"},{"$f":"IFERROR(VLOOKUP(A314,Общий!A:D,3,0), \"\")","v":""},null,{"$f":"IFERROR(VLOOKUP(A314,Общий!A:D,4,0), \"\")","v":""},""]
[null,{"$f":"IFERROR(VLOOKUP(A315,Общий!A:D,2,0),\"Товар отсутствует на складе\")","v":"Товар отсутствует на складе"},{"$f":"IFERROR(VLOOKUP(A315,Общий!A:D,3,0), \"\")","v":""},null,{"$f":"IFERROR(VLOOKUP(A315,Общий!A:D,4,0), \"\")","v":""},""]
[null,{"$f":"IFERROR(VLOOKUP(A316,Общий!A:D,2,0),\"Товар отсутствует на складе\")","v":"Товар отсутствует на складе"},{"$f":"IFERROR(VLOOKUP(A316,Общий!A:D,3,0), \"\")","v":""},null,{"$f":"IFERROR(VLOOKUP(A316,Общий!A:D,4,0), \"\")","v":""},""]
[null,{"$f":"IFERROR(VLOOKUP(A317,Общий!A:D,2,0),\"Товар отсутствует на складе\")","v":"Товар отсутствует на складе"},{"$f":"IFERROR(VLOOKUP(A317,Общий!A:D,3,0), \"\")","v":""},null,{"$f":"IFERROR(VLOOKUP(A317,Общий!A:D,4,0), \"\")","v":""},""]
[null,{"$f":"IFERROR(VLOOKUP(A318,Общий!A:D,2,0),\"Товар отсутствует на складе\")","v":"Товар отсутствует на складе"},{"$f":"IFERROR(VLOOKUP(A318,Общий!A:D,3,0), \"\")","v":""},null,{"$f":"IFERROR(VLOOKUP(A318,Общий!A:D,4,0), \"\")","v":""},""]
[null,{"$f":"IFERROR(VLOOKUP(A319,Общий!A:D,2,0),\"Товар отсутствует на складе\")","v":"Товар отсутствует на складе"},{"$f":"IFERROR(VLOOKUP(A319,Общий!A:D,3,0), \"\")","v":""},null,{"$f":"IFERROR(VLOOKUP(A319,Общий!A:D,4,0), \"\")","v":""},""]
[null,{"$f":"IFERROR(VLOOKUP(A320,Общий!A:D,2,0),\"Товар отсутствует на складе\")","v":"Товар отсутствует на складе"},{"$f":"IFERROR(VLOOKUP(A320,Общий!A:D,3,0), \"\")","v":""},null,{"$f":"IFERROR(VLOOKUP(A320,Общий!A:D,4,0), \"\")","v":""},""]
[null,{"$f":"IFERROR(VLOOKUP(A321,Общий!A:D,2,0),\"Товар отсутствует на складе\")","v":"Товар отсутствует на складе"},{"$f":"IFERROR(VLOOKUP(A321,Общий!A:D,3,0), \"\")","v":""},null,{"$f":"IFERROR(VLOOKUP(A321,Общий!A:D,4,0), \"\")","v":""},""]
[null,{"$f":"IFERROR(VLOOKUP(A322,Общий!A:D,2,0),\"Товар отсутствует на складе\")","v":"Товар отсутствует на складе"},{"$f":"IFERROR(VLOOKUP(A322,Общий!A:D,3,0), \"\")","v":""},null,{"$f":"IFERROR(VLOOKUP(A322,Общий!A:D,4,0), \"\")","v":""},""]
[null,{"$f":"IFERROR(VLOOKUP(A323,Общий!A:D,2,0),\"Товар отсутствует на складе\")","v":"Товар отсутствует на складе"},{"$f":"IFERROR(VLOOKUP(A323,Общий!A:D,3,0), \"\")","v":""},null,{"$f":"IFERROR(VLOOKUP(A323,Общий!A:D,4,0), \"\")","v":""},""]
[null,{"$f":"IFERROR(VLOOKUP(A324,Общий!A:D,2,0),\"Товар отсутствует на складе\")","v":"Товар отсутствует на складе"},{"$f":"IFERROR(VLOOKUP(A324,Общий!A:D,3,0), \"\")","v":""},null,{"$f":"IFERROR(VLOOKUP(A324,Общий!A:D,4,0), \"\")","v":""},""]
[null,{"$f":"IFERROR(VLOOKUP(A325,Общий!A:D,2,0),\"Товар отсутствует на складе\")","v":"Товар отсутствует на складе"},{"$f":"IFERROR(VLOOKUP(A325,Общий!A:D,3,0), \"\")","v":""},null,{"$f":"IFERROR(VLOOKUP(A325,Общий!A:D,4,0), \"\")","v":""},""]
[null,{"$f":"IFERROR(VLOOKUP(A326,Общий!A:D,2,0),\"Товар отсутствует на складе\")","v":"Товар отсутствует на складе"},{"$f":"IFERROR(VLOOKUP(A326,Общий!A:D,3,0), \"\")","v":""},null,{"$f":"IFERROR(VLOOKUP(A326,Общий!A:D,4,0), \"\")","v":""},""]
[null,{"$f":"IFERROR(VLOOKUP(A327,Общий!A:D,2,0),\"Товар отсутствует на складе\")","v":"Товар отсутствует на складе"},{"$f":"IFERROR(VLOOKUP(A327,Общий!A:D,3,0), \"\")","v":""},null,{"$f":"IFERROR(VLOOKUP(A327,Общий!A:D,4,0), \"\")","v":""},""]
[null,{"$f":"IFERROR(VLOOKUP(A328,Общий!A:D,2,0),\"Товар отсутствует на складе\")","v":"Товар отсутствует на складе"},{"$f":"IFERROR(VLOOKUP(A328,Общий!A:D,3,0), \"\")","v":""},null,{"$f":"IFERROR(VLOOKUP(A328,Общий!A:D,4,0), \"\")","v":""},""]
[null,{"$f":"IFERROR(VLOOKUP(A329,Общий!A:D,2,0),\"Товар отсутствует на складе\")","v":"Товар отсутствует на складе"},{"$f":"IFERROR(VLOOKUP(A329,Общий!A:D,3,0), \"\")","v":""},null,{"$f":"IFERROR(VLOOKUP(A329,Общий!A:D,4,0), \"\")","v":""},""]
[null,{"$f":"IFERROR(VLOOKUP(A330,Общий!A:D,2,0),\"Товар отсутствует на складе\")","v":"Товар отсутствует на складе"},{"$f":"IFERROR(VLOOKUP(A330,Общий!A:D,3,0), \"\")","v":""},null,{"$f":"IFERROR(VLOOKUP(A330,Общий!A:D,4,0), \"\")","v":""},""]
[null,{"$f":"IFERROR(VLOOKUP(A331,Общий!A:D,2,0),\"Товар отсутствует на складе\")","v":"Товар отсутствует на складе"},{"$f":"IFERROR(VLOOKUP(A331,Общий!A:D,3,0), \"\")","v":""},null,{"$f":"IFERROR(VLOOKUP(A331,Общий!A:D,4,0), \"\")","v":""},""]
[null,{"$f":"IFERROR(VLOOKUP(A332,Общий!A:D,2,0),\"Товар отсутствует на складе\")","v":"Товар отсутствует на складе"},{"$f":"IFERROR(VLOOKUP(A332,Общий!A:D,3,0), \"\")","v":""},null,{"$f":"IFERROR(VLOOKUP(A332,Общий!A:D,4,0), \"\")","v":""},""]
[null,{"$f":"IFERROR(VLOOKUP(A333,Общий!A:D,2,0),\"Товар отсутствует на складе\")","v":"Товар отсутствует на складе"},{"$f":"IFERROR(VLOOKUP(A333,Общий!A:D,3,0), \"\")","v":""},null,{"$f":"IFERROR(VLOOKUP(A333,Общий!A:D,4,0), \"\")","v":""},""]
[null,{"$f":"IFERROR(VLOOKUP(A334,Общий!A:D,2,0),\"Товар отсутствует на складе\")","v":"Товар отсутствует на складе"},{"$f":"IFERROR(VLOOKUP(A334,Общий!A:D,3,0), \"\")","v":""},null,{"$f":"IFERROR(VLOOKUP(A334,Общий!A:D,4,0), \"\")","v":""},""]
[null,{"$f":"IFERROR(VLOOKUP(A335,Общий!A:D,2,0),\"Товар отсутствует на складе\")","v":"Товар отсутствует на складе"},{"$f":"IFERROR(VLOOKUP(A335,Общий!A:D,3,0), \"\")","v":""},null,{"$f":"IFERROR(VLOOKUP(A335,Общий!A:D,4,0), \"\")","v":""},""]
[null,{"$f":"IFERROR(VLOOKUP(A336,Общий!A:D,2,0),\"Товар отсутствует на складе\")","v":"Товар отсутствует на складе"},{"$f":"IFERROR(VLOOKUP(A336,Общий!A:D,3,0), \"\")","v":""},null,{"$f":"IFERROR(VLOOKUP(A336,Общий!A:D,4,0), \"\")","v":""},""]
[null,{"$f":"IFERROR(VLOOKUP(A337,Общий!A:D,2,0),\"Товар отсутствует на складе\")","v":"Товар отсутствует на складе"},{"$f":"IFERROR(VLOOKUP(A337,Общий!A:D,3,0), \"\")","v":""},null,{"$f":"IFERROR(VLOOKUP(A337,Общий!A:D,4,0), \"\")","v":""},{"$f":"IFERROR(D337*E337,\"\")","v":""}]
[null,{"$f":"IFERROR(VLOOKUP(A338,Общий!A:D,2,0),\"Товар отсутствует на складе\")","v":"Товар отсутствует на складе"},{"$f":"IFERROR(VLOOKUP(A338,Общий!A:D,3,0), \"\")","v":""},null,{"$f":"IFERROR(VLOOKUP(A338,Общий!A:D,4,0), \"\")","v":""},""]
[null,{"$f":"IFERROR(VLOOKUP(A339,Общий!A:D,2,0),\"Товар отсутствует на складе\")","v":"Товар отсутствует на складе"},{"$f":"IFERROR(VLOOKUP(A339,Общий!A:D,3,0), \"\")","v":""},null,{"$f":"IFERROR(VLOOKUP(A339,Общий!A:D,4,0), \"\")","v":""},""]
[null,{"$f":"IFERROR(VLOOKUP(A340,Общий!A:D,2,0),\"Товар отсутствует на складе\")","v":"Товар отсутствует на складе"},{"$f":"IFERROR(VLOOKUP(A340,Общий!A:D,3,0), \"\")","v":""},null,{"$f":"IFERROR(VLOOKUP(A340,Общий!A:D,4,0), \"\")","v":""},""]
[null,{"$f":"IFERROR(VLOOKUP(A341,Общий!A:D,2,0),\"Товар отсутствует на складе\")","v":"Товар отсутствует на складе"},{"$f":"IFERROR(VLOOKUP(A341,Общий!A:D,3,0), \"\")","v":""},null,{"$f":"IFERROR(VLOOKUP(A341,Общий!A:D,4,0), \"\")","v":""},""]
[null,{"$f":"IFERROR(VLOOKUP(A342,Общий!A:D,2,0),\"Товар отсутствует на складе\")","v":"Товар отсутствует на складе"},{"$f":"IFERROR(VLOOKUP(A342,Общий!A:D,3,0), \"\")","v":""},null,{"$f":"IFERROR(VLOOKUP(A342,Общий!A:D,4,0), \"\")","v":""},""]
[null,{"$f":"IFERROR(VLOOKUP(A343,Общий!A:D,2,0),\"Товар отсутствует на складе\")","v":"Товар отсутствует на складе"},{"$f":"IFERROR(VLOOKUP(A343,Общий!A:D,3,0), \"\")","v":""},null,{"$f":"IFERROR(VLOOKUP(A343,Общий!A:D,4,0), \"\")","v":""},""]
[null,{"$f":"IFERROR(VLOOKUP(A344,Общий!A:D,2,0),\"Товар отсутствует на складе\")","v":"Товар отсутствует на складе"},{"$f":"IFERROR(VLOOKUP(A344,Общий!A:D,3,0), \"\")","v":""},null,{"$f":"IFERROR(VLOOKUP(A344,Общий!A:D,4,0), \"\")","v":""},""]
[null,{"$f":"IFERROR(VLOOKUP(A345,Общий!A:D,2,0),\"Товар отсутствует на складе\")","v":"Товар отсутствует на складе"},{"$f":"IFERROR(VLOOKUP(A345,Общий!A:D,3,0), \"\")","v":""},null,{"$f":"IFERROR(VLOOKUP(A345,Общий!A:D,4,0), \"\")","v":""},""]
[null,{"$f":"IFERROR(VLOOKUP(A346,Общий!A:D,2,0),\"Товар отсутствует на складе\")","v":"Товар отсутствует на складе"},{"$f":"IFERROR(VLOOKUP(A346,Общий!A:D,3,0), \"\")","v":""},null,{"$f":"IFERROR(VLOOKUP(A346,Общий!A:D,4,0), \"\")","v":""},""]
[null,{"$f":"IFERROR(VLOOKUP(A347,Общий!A:D,2,0),\"Товар отсутствует на складе\")","v":"Товар отсутствует на складе"},{"$f":"IFERROR(VLOOKUP(A347,Общий!A:D,3,0), \"\")","v":""},null,{"$f":"IFERROR(VLOOKUP(A347,Общий!A:D,4,0), \"\")","v":""},""]
[null,{"$f":"IFERROR(VLOOKUP(A348,Общий!A:D,2,0),\"Товар отсутствует на складе\")","v":"Товар отсутствует на складе"},{"$f":"IFERROR(VLOOKUP(A348,Общий!A:D,3,0), \"\")","v":""},null,{"$f":"IFERROR(VLOOKUP(A348,Общий!A:D,4,0), \"\")","v":""},""]
[null,{"$f":"IFERROR(VLOOKUP(A349,Общий!A:D,2,0),\"Товар отсутствует на складе\")","v":"Товар отсутствует на складе"},{"$f":"IFERROR(VLOOKUP(A349,Общий!A:D,3,0), \"\")","v":""},null,{"$f":"IFERROR(VLOOKUP(A349,Общий!A:D,4,0), \"\")","v":""},""]
[null,{"$f":"IFERROR(VLOOKUP(A350,Общий!A:D,2,0),\"Товар отсутствует на складе\")","v":"Товар отсутствует на складе"},{"$f":"IFERROR(VLOOKUP(A350,Общий!A:D,3,0), \"\")","v":""},null,{"$f":"IFERROR(VLOOKUP(A350,Общий!A:D,4,0), \"\")","v":""},""]
[null,{"$f":"IFERROR(VLOOKUP(A351,Общий!A:D,2,0),\"Товар отсутствует на складе\")","v":"Товар отсутствует на складе"},{"$f":"IFERROR(VLOOKUP(A351,Общий!A:D,3,0), \"\")","v":""},null,{"$f":"IFERROR(VLOOKUP(A351,Общий!A:D,4,0), \"\")","v":""},""]
[null,{"$f":"IFERROR(VLOOKUP(A352,Общий!A:D,2,0),\"Товар отсутствует на складе\")","v":"Товар отсутствует на складе"},{"$f":"IFERROR(VLOOKUP(A352,Общий!A:D,3,0), \"\")","v":""},null,{"$f":"IFERROR(VLOOKUP(A352,Общий!A:D,4,0), \"\")","v":""},""]
[null,{"$f":"IFERROR(VLOOKUP(A353,Общий!A:D,2,0),\"Товар отсутствует на складе\")","v":"Товар отсутствует на складе"},{"$f":"IFERROR(VLOOKUP(A353,Общий!A:D,3,0), \"\")","v":""},null,{"$f":"IFERROR(VLOOKUP(A353,Общий!A:D,4,0), \"\")","v":""},""]
[null,{"$f":"IFERROR(VLOOKUP(A354,Общий!A:D,2,0),\"Товар отсутствует на складе\")","v":"Товар отсутствует на складе"},{"$f":"IFERROR(VLOOKUP(A354,Общий!A:D,3,0), \"\")","v":""},null,{"$f":"IFERROR(VLOOKUP(A354,Общий!A:D,4,0), \"\")","v":""},""]
[null,{"$f":"IFERROR(VLOOKUP(A355,Общий!A:D,2,0),\"Товар отсутствует на складе\")","v":"Товар отсутствует на складе"},{"$f":"IFERROR(VLOOKUP(A355,Общий!A:D,3,0), \"\")","v":""},null,{"$f":"IFERROR(VLOOKUP(A355,Общий!A:D,4,0), \"\")","v":""},""]
[null,{"$f":"IFERROR(VLOOKUP(A356,Общий!A:D,2,0),\"Товар отсутствует на складе\")","v":"Товар отсутствует на складе"},{"$f":"IFERROR(VLOOKUP(A356,Общий!A:D,3,0), \"\")","v":""},null,{"$f":"IFERROR(VLOOKUP(A356,Общий!A:D,4,0), \"\")","v":""},""]
[null,{"$f":"IFERROR(VLOOKUP(A357,Общий!A:D,2,0),\"Товар отсутствует на складе\")","v":"Товар отсутствует на складе"},{"$f":"IFERROR(VLOOKUP(A357,Общий!A:D,3,0), \"\")","v":""},null,{"$f":"IFERROR(VLOOKUP(A357,Общий!A:D,4,0), \"\")","v":""},""]

{"sheet":"Заказ","index":2,"n_rows":36,"n_cols":8,"rows_kept":36,"cut":false,"hidden":false,"merged":[[0,5,0,6],[2,5,2,6]]}
[null,null,null,null,null,"Сумма заказа",null,{"$f":"SUM(H6:H106)","v":0}]
[]
[null,null,null,null,null,"Вы сэкономили",null,{"$f":"SUM(E6:E106)-H1","v":79507.39}]
[]
["Арт.","Наименование","Остаток","Тариф, руб.","Сумма, руб.","Кол-во","Спеццена, руб.","Сумма покупки, руб."]
[{"$f":"IFERROR(IFERROR(INDEX(DX!A:A,MATCH(ROW(A1),DX!$I:$I,)),INDEX(LR!A:A,MATCH(ROW(A1),LR!$I:$I,))),\"\")","v":"8995"},{"$f":"IFERROR(IFERROR(INDEX(DX!B:B,MATCH(ROW(B1),DX!$I:$I,)),INDEX(LR!B:B,MATCH(ROW(B1),LR!$I:$I,))),\"\")","v":"DX ВДТ 4п 30мA AC63"},{"$f":"IFERROR(IFERROR(INDEX(DX!C:C,MATCH(ROW(C1),DX!$I:$I,)),INDEX(LR!C:C,MATCH(ROW(C1),LR!$I:$I,))),\"\")","v":3},{"$f":"IFERROR(IFERROR(INDEX(DX!D:D,MATCH(ROW(D1),DX!$I:$I,)),INDEX(LR!D:D,MATCH(ROW(D1),LR!$I:$I,))),\"\")","v":4219.42},{"$f":"IFERROR(IFERROR(INDEX(DX!E:E,MATCH(ROW(E1),DX!$I:$I,)),INDEX(LR!E:E,MATCH(ROW(E1),LR!$I:$I,))),\"\")","v":16877.68},{"$f":"IFERROR(IFERROR(INDEX(DX!F:F,MATCH(ROW(F1),DX!$I:$I,)),INDEX(LR!F:F,MATCH(ROW(F1),LR!$I:$I,))),\"\")","v":4},{"$f":"IFERROR(IFERROR(INDEX(DX!G:G,MATCH(ROW(G1),DX!$I:$I,)),INDEX(LR!G:G,MATCH(ROW(G1),LR!$I:$I,))),\"\")","v":0},{"$f":"IFERROR(IFERROR(INDEX(DX!H:H,MATCH(ROW(H1),DX!$I:$I,)),INDEX(LR!H:H,MATCH(ROW(H1),LR!$I:$I,))),\"\")","v":0}]
[{"$f":"IFERROR(IFERROR(INDEX(DX!A:A,MATCH(ROW(A2),DX!$I:$I,)),INDEX(LR!A:A,MATCH(ROW(A2),LR!$I:$I,))),\"\")","v":"7966"},{"$f":"IFERROR(IFERROR(INDEX(DX!B:B,MATCH(ROW(B2),DX!$I:$I,)),INDEX(LR!B:B,MATCH(ROW(B2),LR!$I:$I,))),\"\")","v":"DX АВДТ 4п 30мА С25 6000A 10кА"},{"$f":"IFERROR(IFERROR(INDEX(DX!C:C,MATCH(ROW(C2),DX!$I:$I,)),INDEX(LR!C:C,MATCH(ROW(C2),LR!$I:$I,))),\"\")","v":1},{"$f":"IFERROR(IFERROR(INDEX(DX!D:D,MATCH(ROW(D2),DX!$I:$I,)),INDEX(LR!D:D,MATCH(ROW(D2),LR!$I:$I,))),\"\")","v":3750.71},{"$f":"IFERROR(IFERROR(INDEX(DX!E:E,MATCH(ROW(E2),DX!$I:$I,)),INDEX(LR!E:E,MATCH(ROW(E2),LR!$I:$I,))),\"\")","v":18753.55},{"$f":"IFERROR(IFERROR(INDEX(DX!F:F,MATCH(ROW(F2),DX!$I:$I,)),INDEX(LR!F:F,MATCH(ROW(F2),LR!$I:$I,))),\"\")","v":5},{"$f":"IFERROR(IFERROR(INDEX(DX!G:G,MATCH(ROW(G2),DX!$I:$I,)),INDEX(LR!G:G,MATCH(ROW(G2),LR!$I:$I,))),\"\")","v":0},{"$f":"IFERROR(IFERROR(INDEX(DX!H:H,MATCH(ROW(H2),DX!$I:$I,)),INDEX(LR!H:H,MATCH(ROW(H2),LR!$I:$I,))),\"\")","v":0}]
[{"$f":"IFERROR(IFERROR(INDEX(DX!A:A,MATCH(ROW(A3),DX!$I:$I,)),INDEX(LR!A:A,MATCH(ROW(A3),LR!$I:$I,))),\"\")","v":"3431"},{"$f":"IFERROR(IFERROR(INDEX(DX!B:B,MATCH(ROW(B3),DX!$I:$I,)),INDEX(LR!B:B,MATCH(ROW(B3),LR!$I:$I,))),\"\")","v":"DX ВА 2п C10 6000A 6кА"},{"$f":"IFERROR(IFERROR(INDEX(DX!C:C,MATCH(ROW(C3),DX!$I:$I,)),INDEX(LR!C:C,MATCH(ROW(C3),LR!$I:$I,))),\"\")","v":2},{"$f":"IFERROR(IFERROR(INDEX(DX!D:D,MATCH(ROW(D3),DX!$I:$I,)),INDEX(LR!D:D,MATCH(ROW(D3),LR!$I:$I,))),\"\")","v":423.76},{"$f":"IFERROR(IFERROR(INDEX(DX!E:E,MATCH(ROW(E3),DX!$I:$I,)),INDEX(LR!E:E,MATCH(ROW(E3),LR!$I:$I,))),\"\")","v":2966.3199999999997},{"$f":"IFERROR(IFERROR(INDEX(DX!F:F,MATCH(ROW(F3),DX!$I:$I,)),INDEX(LR!F:F,MATCH(ROW(F3),LR!$I:$I,))),\"\")","v":7},{"$f":"IFERROR(IFERROR(INDEX(DX!G:G,MATCH(ROW(G3),DX!$I:$I,)),INDEX(LR!G:G,MATCH(ROW(G3),LR!$I:$I,))),\"\")","v":0},{"$f":"IFERROR(IFERROR(INDEX(DX!H:H,MATCH(ROW(H3),DX!$I:$I,)),INDEX(LR!H:H,MATCH(ROW(H3),LR!$I:$I,))),\"\")","v":0}]
[{"$f":"IFERROR(IFERROR(INDEX(DX!A:A,MATCH(ROW(A4),DX!$I:$I,)),INDEX(LR!A:A,MATCH(ROW(A4),LR!$I:$I,))),\"\")","v":"604832"},{"$f":"IFERROR(IFERROR(INDEX(DX!B:B,MATCH(ROW(B4),DX!$I:$I,)),INDEX(LR!B:B,MATCH(ROW(B4),LR!$I:$I,))),\"\")","v":"LR ВА 3п C06 6000A 6кА"},{"$f":"IFERROR(IFERROR(INDEX(DX!C:C,MATCH(ROW(C4),DX!$I:$I,)),INDEX(LR!C:C,MATCH(ROW(C4),LR!$I:$I,))),\"\")","v":1},{"$f":"IFERROR(IFERROR(INDEX(DX!D:D,MATCH(ROW(D4),DX!$I:$I,)),INDEX(LR!D:D,MATCH(ROW(D4),LR!$I:$I,))),\"\")","v":444.91},{"$f":"IFERROR(IFERROR(INDEX(DX!E:E,MATCH(ROW(E4),DX!$I:$I,)),INDEX(LR!E:E,MATCH(ROW(E4),LR!$I:$I,))),\"\")","v":34702.980000000003},{"$f":"IFERROR(IFERROR(INDEX(DX!F:F,MATCH(ROW(F4),DX!$I:$I,)),INDEX(LR!F:F,MATCH(ROW(F4),LR!$I:$I,))),\"\")","v":78},{"$f":"IFERROR(IFERROR(INDEX(DX!G:G,MATCH(ROW(G4),DX!$I:$I,)),INDEX(LR!G:G,MATCH(ROW(G4),LR!$I:$I,))),\"\")","v":0},{"$f":"IFERROR(IFERROR(INDEX(DX!H:H,MATCH(ROW(H4),DX!$I:$I,)),INDEX(LR!H:H,MATCH(ROW(H4),LR!$I:$I,))),\"\")","v":0}]
[{"$f":"IFERROR(IFERROR(INDEX(DX!A:A,MATCH(ROW(A5),DX!$I:$I,)),INDEX(LR!A:A,MATCH(ROW(A5),LR!$I:$I,))),\"\")","v":"604823"},{"$f":"IFERROR(IFERROR(INDEX(DX!B:B,MATCH(ROW(B5),DX!$I:$I,)),INDEX(LR!B:B,MATCH(ROW(B5),LR!$I:$I,))),\"\")","v":"LR ВА 2п C32 6000A 6кА"},{"$f":"IFERROR(IFERROR(INDEX(DX!C:C,MATCH(ROW(C5),DX!$I:$I,)),INDEX(LR!C:C,MATCH(ROW(C5),LR!$I:$I,))),\"\")","v":5},{"$f":"IFERROR(IFERROR(INDEX(DX!D:D,MATCH(ROW(D5),DX!$I:$I,)),INDEX(LR!D:D,MATCH(ROW(D5),LR!$I:$I,))),\"\")","v":282.13},{"$f":"IFERROR(IFERROR(INDEX(DX!E:E,MATCH(ROW(E5),DX!$I:$I,)),INDEX(LR!E:E,MATCH(ROW(E5),LR!$I:$I,))),\"\")","v":6206.86},{"$f":"IFERROR(IFERROR(INDEX(DX!F:F,MATCH(ROW(F5),DX!$I:$I,)),INDEX(LR!F:F,MATCH(ROW(F5),LR!$I:$I,))),\"\")","v":22},{"$f":"IFERROR(IFERROR(INDEX(DX!G:G,MATCH(ROW(G5),DX!$I:$I,)),INDEX(LR!G:G,MATCH(ROW(G5),LR!$I:$I,))),\"\")","v":0},{"$f":"IFERROR(IFERROR(INDEX(DX!H:H,MATCH(ROW(H5),DX!$I:$I,)),INDEX(LR!H:H,MATCH(ROW(H5),LR!$I:$I,))),\"\")","v":0}]
[{"$f":"IFERROR(IFERROR(INDEX(DX!A:A,MATCH(ROW(A6),DX!$I:$I,)),INDEX(LR!A:A,MATCH(ROW(A6),LR!$I:$I,))),\"\")","v":""},{"$f":"IFERROR(IFERROR(INDEX(DX!B:B,MATCH(ROW(B6),DX!$I:$I,)),INDEX(LR!B:B,MATCH(ROW(B6),LR!$I:$I,))),\"\")","v":""},{"$f":"IFERROR(IFERROR(INDEX(DX!C:C,MATCH(ROW(C6),DX!$I:$I,)),INDEX(LR!C:C,MATCH(ROW(C6),LR!$I:$I,))),\"\")","v":""},{"$f":"IFERROR(IFERROR(INDEX(DX!D:D,MATCH(ROW(D6),DX!$I:$I,)),INDEX(LR!D:D,MATCH(ROW(D6),LR!$I:$I,))),\"\")","v":""},{"$f":"IFERROR(IFERROR(INDEX(DX!E:E,MATCH(ROW(E6),DX!$I:$I,)),INDEX(LR!E:E,MATCH(ROW(E6),LR!$I:$I,))),\"\")","v":""},{"$f":"IFERROR(IFERROR(INDEX(DX!F:F,MATCH(ROW(F6),DX!$I:$I,)),INDEX(LR!F:F,MATCH(ROW(F6),LR!$I:$I,))),\"\")","v":""},{"$f":"IFERROR(IFERROR(INDEX(DX!G:G,MATCH(ROW(G6),DX!$I:$I,)),INDEX(LR!G:G,MATCH(ROW(G6),LR!$I:$I,))),\"\")","v":""},{"$f":"IFERROR(IFERROR(INDEX(DX!H:H,MATCH(ROW(H6),DX!$I:$I,)),INDEX(LR!H:H,MATCH(ROW(H6),LR!$I:$I,))),\"\")","v":""}]
[{"$f":"IFERROR(IFERROR(INDEX(DX!A:A,MATCH(ROW(A7),DX!$I:$I,)),INDEX(LR!A:A,MATCH(ROW(A7),LR!$I:$I,))),\"\")","v":""},{"$f":"IFERROR(IFERROR(INDEX(DX!B:B,MATCH(ROW(B7),DX!$I:$I,)),INDEX(LR!B:B,MATCH(ROW(B7),LR!$I:$I,))),\"\")","v":""},{"$f":"IFERROR(IFERROR(INDEX(DX!C:C,MATCH(ROW(C7),DX!$I:$I,)),INDEX(LR!C:C,MATCH(ROW(C7),LR!$I:$I,))),\"\")","v":""},{"$f":"IFERROR(IFERROR(INDEX(DX!D:D,MATCH(ROW(D7),DX!$I:$I,)),INDEX(LR!D:D,MATCH(ROW(D7),LR!$I:$I,))),\"\")","v":""},{"$f":"IFERROR(IFERROR(INDEX(DX!E:E,MATCH(ROW(E7),DX!$I:$I,)),INDEX(LR!E:E,MATCH(ROW(E7),LR!$I:$I,))),\"\")","v":""},{"$f":"IFERROR(IFERROR(INDEX(DX!F:F,MATCH(ROW(F7),DX!$I:$I,)),INDEX(LR!F:F,MATCH(ROW(F7),LR!$I:$I,))),\"\")","v":""},{"$f":"IFERROR(IFERROR(INDEX(DX!G:G,MATCH(ROW(G7),DX!$I:$I,)),INDEX(LR!G:G,MATCH(ROW(G7),LR!$I:$I,))),\"\")","v":""},{"$f":"IFERROR(IFERROR(INDEX(DX!H:H,MATCH(ROW(H7),DX!$I:$I,)),INDEX(LR!H:H,MATCH(ROW(H7),LR!$I:$I,))),\"\")","v":""}]
[{"$f":"IFERROR(IFERROR(INDEX(DX!A:A,MATCH(ROW(A8),DX!$I:$I,)),INDEX(LR!A:A,MATCH(ROW(A8),LR!$I:$I,))),\"\")","v":""},{"$f":"IFERROR(IFERROR(INDEX(DX!B:B,MATCH(ROW(B8),DX!$I:$I,)),INDEX(LR!B:B,MATCH(ROW(B8),LR!$I:$I,))),\"\")","v":""},{"$f":"IFERROR(IFERROR(INDEX(DX!C:C,MATCH(ROW(C8),DX!$I:$I,)),INDEX(LR!C:C,MATCH(ROW(C8),LR!$I:$I,))),\"\")","v":""},{"$f":"IFERROR(IFERROR(INDEX(DX!D:D,MATCH(ROW(D8),DX!$I:$I,)),INDEX(LR!D:D,MATCH(ROW(D8),LR!$I:$I,))),\"\")","v":""},{"$f":"IFERROR(IFERROR(INDEX(DX!E:E,MATCH(ROW(E8),DX!$I:$I,)),INDEX(LR!E:E,MATCH(ROW(E8),LR!$I:$I,))),\"\")","v":""},{"$f":"IFERROR(IFERROR(INDEX(DX!F:F,MATCH(ROW(F8),DX!$I:$I,)),INDEX(LR!F:F,MATCH(ROW(F8),LR!$I:$I,))),\"\")","v":""},{"$f":"IFERROR(IFERROR(INDEX(DX!G:G,MATCH(ROW(G8),DX!$I:$I,)),INDEX(LR!G:G,MATCH(ROW(G8),LR!$I:$I,))),\"\")","v":""},{"$f":"IFERROR(IFERROR(INDEX(DX!H:H,MATCH(ROW(H8),DX!$I:$I,)),INDEX(LR!H:H,MATCH(ROW(H8),LR!$I:$I,))),\"\")","v":""}]
[{"$f":"IFERROR(IFERROR(INDEX(DX!A:A,MATCH(ROW(A9),DX!$I:$I,)),INDEX(LR!A:A,MATCH(ROW(A9),LR!$I:$I,))),\"\")","v":""},{"$f":"IFERROR(IFERROR(INDEX(DX!B:B,MATCH(ROW(B9),DX!$I:$I,)),INDEX(LR!B:B,MATCH(ROW(B9),LR!$I:$I,))),\"\")","v":""},{"$f":"IFERROR(IFERROR(INDEX(DX!C:C,MATCH(ROW(C9),DX!$I:$I,)),INDEX(LR!C:C,MATCH(ROW(C9),LR!$I:$I,))),\"\")","v":""},{"$f":"IFERROR(IFERROR(INDEX(DX!D:D,MATCH(ROW(D9),DX!$I:$I,)),INDEX(LR!D:D,MATCH(ROW(D9),LR!$I:$I,))),\"\")","v":""},{"$f":"IFERROR(IFERROR(INDEX(DX!E:E,MATCH(ROW(E9),DX!$I:$I,)),INDEX(LR!E:E,MATCH(ROW(E9),LR!$I:$I,))),\"\")","v":""},{"$f":"IFERROR(IFERROR(INDEX(DX!F:F,MATCH(ROW(F9),DX!$I:$I,)),INDEX(LR!F:F,MATCH(ROW(F9),LR!$I:$I,))),\"\")","v":""},{"$f":"IFERROR(IFERROR(INDEX(DX!G:G,MATCH(ROW(G9),DX!$I:$I,)),INDEX(LR!G:G,MATCH(ROW(G9),LR!$I:$I,))),\"\")","v":""},{"$f":"IFERROR(IFERROR(INDEX(DX!H:H,MATCH(ROW(H9),DX!$I:$I,)),INDEX(LR!H:H,MATCH(ROW(H9),LR!$I:$I,))),\"\")","v":""}]
[{"$f":"IFERROR(IFERROR(INDEX(DX!A:A,MATCH(ROW(A10),DX!$I:$I,)),INDEX(LR!A:A,MATCH(ROW(A10),LR!$I:$I,))),\"\")","v":""},{"$f":"IFERROR(IFERROR(INDEX(DX!B:B,MATCH(ROW(B10),DX!$I:$I,)),INDEX(LR!B:B,MATCH(ROW(B10),LR!$I:$I,))),\"\")","v":""},{"$f":"IFERROR(IFERROR(INDEX(DX!C:C,MATCH(ROW(C10),DX!$I:$I,)),INDEX(LR!C:C,MATCH(ROW(C10),LR!$I:$I,))),\"\")","v":""},{"$f":"IFERROR(IFERROR(INDEX(DX!D:D,MATCH(ROW(D10),DX!$I:$I,)),INDEX(LR!D:D,MATCH(ROW(D10),LR!$I:$I,))),\"\")","v":""},{"$f":"IFERROR(IFERROR(INDEX(DX!E:E,MATCH(ROW(E10),DX!$I:$I,)),INDEX(LR!E:E,MATCH(ROW(E10),LR!$I:$I,))),\"\")","v":""},{"$f":"IFERROR(IFERROR(INDEX(DX!F:F,MATCH(ROW(F10),DX!$I:$I,)),INDEX(LR!F:F,MATCH(ROW(F10),LR!$I:$I,))),\"\")","v":""},{"$f":"IFERROR(IFERROR(INDEX(DX!G:G,MATCH(ROW(G10),DX!$I:$I,)),INDEX(LR!G:G,MATCH(ROW(G10),LR!$I:$I,))),\"\")","v":""},{"$f":"IFERROR(IFERROR(INDEX(DX!H:H,MATCH(ROW(H10),DX!$I:$I,)),INDEX(LR!H:H,MATCH(ROW(H10),LR!$I:$I,))),\"\")","v":""}]
[{"$f":"IFERROR(IFERROR(INDEX(DX!A:A,MATCH(ROW(A11),DX!$I:$I,)),INDEX(LR!A:A,MATCH(ROW(A11),LR!$I:$I,))),\"\")","v":""},{"$f":"IFERROR(IFERROR(INDEX(DX!B:B,MATCH(ROW(B11),DX!$I:$I,)),INDEX(LR!B:B,MATCH(ROW(B11),LR!$I:$I,))),\"\")","v":""},{"$f":"IFERROR(IFERROR(INDEX(DX!C:C,MATCH(ROW(C11),DX!$I:$I,)),INDEX(LR!C:C,MATCH(ROW(C11),LR!$I:$I,))),\"\")","v":""},{"$f":"IFERROR(IFERROR(INDEX(DX!D:D,MATCH(ROW(D11),DX!$I:$I,)),INDEX(LR!D:D,MATCH(ROW(D11),LR!$I:$I,))),\"\")","v":""},{"$f":"IFERROR(IFERROR(INDEX(DX!E:E,MATCH(ROW(E11),DX!$I:$I,)),INDEX(LR!E:E,MATCH(ROW(E11),LR!$I:$I,))),\"\")","v":""},{"$f":"IFERROR(IFERROR(INDEX(DX!F:F,MATCH(ROW(F11),DX!$I:$I,)),INDEX(LR!F:F,MATCH(ROW(F11),LR!$I:$I,))),\"\")","v":""},{"$f":"IFERROR(IFERROR(INDEX(DX!G:G,MATCH(ROW(G11),DX!$I:$I,)),INDEX(LR!G:G,MATCH(ROW(G11),LR!$I:$I,))),\"\")","v":""},{"$f":"IFERROR(IFERROR(INDEX(DX!H:H,MATCH(ROW(H11),DX!$I:$I,)),INDEX(LR!H:H,MATCH(ROW(H11),LR!$I:$I,))),\"\")","v":""}]
[{"$f":"IFERROR(IFERROR(INDEX(DX!A:A,MATCH(ROW(A12),DX!$I:$I,)),INDEX(LR!A:A,MATCH(ROW(A12),LR!$I:$I,))),\"\")","v":""},{"$f":"IFERROR(IFERROR(INDEX(DX!B:B,MATCH(ROW(B12),DX!$I:$I,)),INDEX(LR!B:B,MATCH(ROW(B12),LR!$I:$I,))),\"\")","v":""},{"$f":"IFERROR(IFERROR(INDEX(DX!C:C,MATCH(ROW(C12),DX!$I:$I,)),INDEX(LR!C:C,MATCH(ROW(C12),LR!$I:$I,))),\"\")","v":""},{"$f":"IFERROR(IFERROR(INDEX(DX!D:D,MATCH(ROW(D12),DX!$I:$I,)),INDEX(LR!D:D,MATCH(ROW(D12),LR!$I:$I,))),\"\")","v":""},{"$f":"IFERROR(IFERROR(INDEX(DX!E:E,MATCH(ROW(E12),DX!$I:$I,)),INDEX(LR!E:E,MATCH(ROW(E12),LR!$I:$I,))),\"\")","v":""},{"$f":"IFERROR(IFERROR(INDEX(DX!F:F,MATCH(ROW(F12),DX!$I:$I,)),INDEX(LR!F:F,MATCH(ROW(F12),LR!$I:$I,))),\"\")","v":""},{"$f":"IFERROR(IFERROR(INDEX(DX!G:G,MATCH(ROW(G12),DX!$I:$I,)),INDEX(LR!G:G,MATCH(ROW(G12),LR!$I:$I,))),\"\")","v":""},{"$f":"IFERROR(IFERROR(INDEX(DX!H:H,MATCH(ROW(H12),DX!$I:$I,)),INDEX(LR!H:H,MATCH(ROW(H12),LR!$I:$I,))),\"\")","v":""}]
[{"$f":"IFERROR(IFERROR(INDEX(DX!A:A,MATCH(ROW(A13),DX!$I:$I,)),INDEX(LR!A:A,MATCH(ROW(A13),LR!$I:$I,))),\"\")","v":""},{"$f":"IFERROR(IFERROR(INDEX(DX!B:B,MATCH(ROW(B13),DX!$I:$I,)),INDEX(LR!B:B,MATCH(ROW(B13),LR!$I:$I,))),\"\")","v":""},{"$f":"IFERROR(IFERROR(INDEX(DX!C:C,MATCH(ROW(C13),DX!$I:$I,)),INDEX(LR!C:C,MATCH(ROW(C13),LR!$I:$I,))),\"\")","v":""},{"$f":"IFERROR(IFERROR(INDEX(DX!D:D,MATCH(ROW(D13),DX!$I:$I,)),INDEX(LR!D:D,MATCH(ROW(D13),LR!$I:$I,))),\"\")","v":""},{"$f":"IFERROR(IFERROR(INDEX(DX!E:E,MATCH(ROW(E13),DX!$I:$I,)),INDEX(LR!E:E,MATCH(ROW(E13),LR!$I:$I,))),\"\")","v":""},{"$f":"IFERROR(IFERROR(INDEX(DX!F:F,MATCH(ROW(F13),DX!$I:$I,)),INDEX(LR!F:F,MATCH(ROW(F13),LR!$I:$I,))),\"\")","v":""},{"$f":"IFERROR(IFERROR(INDEX(DX!G:G,MATCH(ROW(G13),DX!$I:$I,)),INDEX(LR!G:G,MATCH(ROW(G13),LR!$I:$I,))),\"\")","v":""},{"$f":"IFERROR(IFERROR(INDEX(DX!H:H,MATCH(ROW(H13),DX!$I:$I,)),INDEX(LR!H:H,MATCH(ROW(H13),LR!$I:$I,))),\"\")","v":""}]
[{"$f":"IFERROR(IFERROR(INDEX(DX!A:A,MATCH(ROW(A14),DX!$I:$I,)),INDEX(LR!A:A,MATCH(ROW(A14),LR!$I:$I,))),\"\")","v":""},{"$f":"IFERROR(IFERROR(INDEX(DX!B:B,MATCH(ROW(B14),DX!$I:$I,)),INDEX(LR!B:B,MATCH(ROW(B14),LR!$I:$I,))),\"\")","v":""},{"$f":"IFERROR(IFERROR(INDEX(DX!C:C,MATCH(ROW(C14),DX!$I:$I,)),INDEX(LR!C:C,MATCH(ROW(C14),LR!$I:$I,))),\"\")","v":""},{"$f":"IFERROR(IFERROR(INDEX(DX!D:D,MATCH(ROW(D14),DX!$I:$I,)),INDEX(LR!D:D,MATCH(ROW(D14),LR!$I:$I,))),\"\")","v":""},{"$f":"IFERROR(IFERROR(INDEX(DX!E:E,MATCH(ROW(E14),DX!$I:$I,)),INDEX(LR!E:E,MATCH(ROW(E14),LR!$I:$I,))),\"\")","v":""},{"$f":"IFERROR(IFERROR(INDEX(DX!F:F,MATCH(ROW(F14),DX!$I:$I,)),INDEX(LR!F:F,MATCH(ROW(F14),LR!$I:$I,))),\"\")","v":""},{"$f":"IFERROR(IFERROR(INDEX(DX!G:G,MATCH(ROW(G14),DX!$I:$I,)),INDEX(LR!G:G,MATCH(ROW(G14),LR!$I:$I,))),\"\")","v":""},{"$f":"IFERROR(IFERROR(INDEX(DX!H:H,MATCH(ROW(H14),DX!$I:$I,)),INDEX(LR!H:H,MATCH(ROW(H14),LR!$I:$I,))),\"\")","v":""}]
[{"$f":"IFERROR(IFERROR(INDEX(DX!A:A,MATCH(ROW(A15),DX!$I:$I,)),INDEX(LR!A:A,MATCH(ROW(A15),LR!$I:$I,))),\"\")","v":""},{"$f":"IFERROR(IFERROR(INDEX(DX!B:B,MATCH(ROW(B15),DX!$I:$I,)),INDEX(LR!B:B,MATCH(ROW(B15),LR!$I:$I,))),\"\")","v":""},{"$f":"IFERROR(IFERROR(INDEX(DX!C:C,MATCH(ROW(C15),DX!$I:$I,)),INDEX(LR!C:C,MATCH(ROW(C15),LR!$I:$I,))),\"\")","v":""},{"$f":"IFERROR(IFERROR(INDEX(DX!D:D,MATCH(ROW(D15),DX!$I:$I,)),INDEX(LR!D:D,MATCH(ROW(D15),LR!$I:$I,))),\"\")","v":""},{"$f":"IFERROR(IFERROR(INDEX(DX!E:E,MATCH(ROW(E15),DX!$I:$I,)),INDEX(LR!E:E,MATCH(ROW(E15),LR!$I:$I,))),\"\")","v":""},{"$f":"IFERROR(IFERROR(INDEX(DX!F:F,MATCH(ROW(F15),DX!$I:$I,)),INDEX(LR!F:F,MATCH(ROW(F15),LR!$I:$I,))),\"\")","v":""},{"$f":"IFERROR(IFERROR(INDEX(DX!G:G,MATCH(ROW(G15),DX!$I:$I,)),INDEX(LR!G:G,MATCH(ROW(G15),LR!$I:$I,))),\"\")","v":""},{"$f":"IFERROR(IFERROR(INDEX(DX!H:H,MATCH(ROW(H15),DX!$I:$I,)),INDEX(LR!H:H,MATCH(ROW(H15),LR!$I:$I,))),\"\")","v":""}]
[{"$f":"IFERROR(IFERROR(INDEX(DX!A:A,MATCH(ROW(A16),DX!$I:$I,)),INDEX(LR!A:A,MATCH(ROW(A16),LR!$I:$I,))),\"\")","v":""},{"$f":"IFERROR(IFERROR(INDEX(DX!B:B,MATCH(ROW(B16),DX!$I:$I,)),INDEX(LR!B:B,MATCH(ROW(B16),LR!$I:$I,))),\"\")","v":""},{"$f":"IFERROR(IFERROR(INDEX(DX!C:C,MATCH(ROW(C16),DX!$I:$I,)),INDEX(LR!C:C,MATCH(ROW(C16),LR!$I:$I,))),\"\")","v":""},{"$f":"IFERROR(IFERROR(INDEX(DX!D:D,MATCH(ROW(D16),DX!$I:$I,)),INDEX(LR!D:D,MATCH(ROW(D16),LR!$I:$I,))),\"\")","v":""},{"$f":"IFERROR(IFERROR(INDEX(DX!E:E,MATCH(ROW(E16),DX!$I:$I,)),INDEX(LR!E:E,MATCH(ROW(E16),LR!$I:$I,))),\"\")","v":""},{"$f":"IFERROR(IFERROR(INDEX(DX!F:F,MATCH(ROW(F16),DX!$I:$I,)),INDEX(LR!F:F,MATCH(ROW(F16),LR!$I:$I,))),\"\")","v":""},{"$f":"IFERROR(IFERROR(INDEX(DX!G:G,MATCH(ROW(G16),DX!$I:$I,)),INDEX(LR!G:G,MATCH(ROW(G16),LR!$I:$I,))),\"\")","v":""},{"$f":"IFERROR(IFERROR(INDEX(DX!H:H,MATCH(ROW(H16),DX!$I:$I,)),INDEX(LR!H:H,MATCH(ROW(H16),LR!$I:$I,))),\"\")","v":""}]
[{"$f":"IFERROR(IFERROR(INDEX(DX!A:A,MATCH(ROW(A17),DX!$I:$I,)),INDEX(LR!A:A,MATCH(ROW(A17),LR!$I:$I,))),\"\")","v":""},{"$f":"IFERROR(IFERROR(INDEX(DX!B:B,MATCH(ROW(B17),DX!$I:$I,)),INDEX(LR!B:B,MATCH(ROW(B17),LR!$I:$I,))),\"\")","v":""},{"$f":"IFERROR(IFERROR(INDEX(DX!C:C,MATCH(ROW(C17),DX!$I:$I,)),INDEX(LR!C:C,MATCH(ROW(C17),LR!$I:$I,))),\"\")","v":""},{"$f":"IFERROR(IFERROR(INDEX(DX!D:D,MATCH(ROW(D17),DX!$I:$I,)),INDEX(LR!D:D,MATCH(ROW(D17),LR!$I:$I,))),\"\")","v":""},{"$f":"IFERROR(IFERROR(INDEX(DX!E:E,MATCH(ROW(E17),DX!$I:$I,)),INDEX(LR!E:E,MATCH(ROW(E17),LR!$I:$I,))),\"\")","v":""},{"$f":"IFERROR(IFERROR(INDEX(DX!F:F,MATCH(ROW(F17),DX!$I:$I,)),INDEX(LR!F:F,MATCH(ROW(F17),LR!$I:$I,))),\"\")","v":""},{"$f":"IFERROR(IFERROR(INDEX(DX!G:G,MATCH(ROW(G17),DX!$I:$I,)),INDEX(LR!G:G,MATCH(ROW(G17),LR!$I:$I,))),\"\")","v":""},{"$f":"IFERROR(IFERROR(INDEX(DX!H:H,MATCH(ROW(H17),DX!$I:$I,)),INDEX(LR!H:H,MATCH(ROW(H17),LR!$I:$I,))),\"\")","v":""}]
[{"$f":"IFERROR(IFERROR(INDEX(DX!A:A,MATCH(ROW(A18),DX!$I:$I,)),INDEX(LR!A:A,MATCH(ROW(A18),LR!$I:$I,))),\"\")","v":""},{"$f":"IFERROR(IFERROR(INDEX(DX!B:B,MATCH(ROW(B18),DX!$I:$I,)),INDEX(LR!B:B,MATCH(ROW(B18),LR!$I:$I,))),\"\")","v":""},{"$f":"IFERROR(IFERROR(INDEX(DX!C:C,MATCH(ROW(C18),DX!$I:$I,)),INDEX(LR!C:C,MATCH(ROW(C18),LR!$I:$I,))),\"\")","v":""},{"$f":"IFERROR(IFERROR(INDEX(DX!D:D,MATCH(ROW(D18),DX!$I:$I,)),INDEX(LR!D:D,MATCH(ROW(D18),LR!$I:$I,))),\"\")","v":""},{"$f":"IFERROR(IFERROR(INDEX(DX!E:E,MATCH(ROW(E18),DX!$I:$I,)),INDEX(LR!E:E,MATCH(ROW(E18),LR!$I:$I,))),\"\")","v":""},{"$f":"IFERROR(IFERROR(INDEX(DX!F:F,MATCH(ROW(F18),DX!$I:$I,)),INDEX(LR!F:F,MATCH(ROW(F18),LR!$I:$I,))),\"\")","v":""},{"$f":"IFERROR(IFERROR(INDEX(DX!G:G,MATCH(ROW(G18),DX!$I:$I,)),INDEX(LR!G:G,MATCH(ROW(G18),LR!$I:$I,))),\"\")","v":""},{"$f":"IFERROR(IFERROR(INDEX(DX!H:H,MATCH(ROW(H18),DX!$I:$I,)),INDEX(LR!H:H,MATCH(ROW(H18),LR!$I:$I,))),\"\")","v":""}]
[{"$f":"IFERROR(IFERROR(INDEX(DX!A:A,MATCH(ROW(A19),DX!$I:$I,)),INDEX(LR!A:A,MATCH(ROW(A19),LR!$I:$I,))),\"\")","v":""},{"$f":"IFERROR(IFERROR(INDEX(DX!B:B,MATCH(ROW(B19),DX!$I:$I,)),INDEX(LR!B:B,MATCH(ROW(B19),LR!$I:$I,))),\"\")","v":""},{"$f":"IFERROR(IFERROR(INDEX(DX!C:C,MATCH(ROW(C19),DX!$I:$I,)),INDEX(LR!C:C,MATCH(ROW(C19),LR!$I:$I,))),\"\")","v":""},{"$f":"IFERROR(IFERROR(INDEX(DX!D:D,MATCH(ROW(D19),DX!$I:$I,)),INDEX(LR!D:D,MATCH(ROW(D19),LR!$I:$I,))),\"\")","v":""},{"$f":"IFERROR(IFERROR(INDEX(DX!E:E,MATCH(ROW(E19),DX!$I:$I,)),INDEX(LR!E:E,MATCH(ROW(E19),LR!$I:$I,))),\"\")","v":""},{"$f":"IFERROR(IFERROR(INDEX(DX!F:F,MATCH(ROW(F19),DX!$I:$I,)),INDEX(LR!F:F,MATCH(ROW(F19),LR!$I:$I,))),\"\")","v":""},{"$f":"IFERROR(IFERROR(INDEX(DX!G:G,MATCH(ROW(G19),DX!$I:$I,)),INDEX(LR!G:G,MATCH(ROW(G19),LR!$I:$I,))),\"\")","v":""},{"$f":"IFERROR(IFERROR(INDEX(DX!H:H,MATCH(ROW(H19),DX!$I:$I,)),INDEX(LR!H:H,MATCH(ROW(H19),LR!$I:$I,))),\"\")","v":""}]
[{"$f":"IFERROR(IFERROR(INDEX(DX!A:A,MATCH(ROW(A20),DX!$I:$I,)),INDEX(LR!A:A,MATCH(ROW(A20),LR!$I:$I,))),\"\")","v":""},{"$f":"IFERROR(IFERROR(INDEX(DX!B:B,MATCH(ROW(B20),DX!$I:$I,)),INDEX(LR!B:B,MATCH(ROW(B20),LR!$I:$I,))),\"\")","v":""},{"$f":"IFERROR(IFERROR(INDEX(DX!C:C,MATCH(ROW(C20),DX!$I:$I,)),INDEX(LR!C:C,MATCH(ROW(C20),LR!$I:$I,))),\"\")","v":""},{"$f":"IFERROR(IFERROR(INDEX(DX!D:D,MATCH(ROW(D20),DX!$I:$I,)),INDEX(LR!D:D,MATCH(ROW(D20),LR!$I:$I,))),\"\")","v":""},{"$f":"IFERROR(IFERROR(INDEX(DX!E:E,MATCH(ROW(E20),DX!$I:$I,)),INDEX(LR!E:E,MATCH(ROW(E20),LR!$I:$I,))),\"\")","v":""},{"$f":"IFERROR(IFERROR(INDEX(DX!F:F,MATCH(ROW(F20),DX!$I:$I,)),INDEX(LR!F:F,MATCH(ROW(F20),LR!$I:$I,))),\"\")","v":""},{"$f":"IFERROR(IFERROR(INDEX(DX!G:G,MATCH(ROW(G20),DX!$I:$I,)),INDEX(LR!G:G,MATCH(ROW(G20),LR!$I:$I,))),\"\")","v":""},{"$f":"IFERROR(IFERROR(INDEX(DX!H:H,MATCH(ROW(H20),DX!$I:$I,)),INDEX(LR!H:H,MATCH(ROW(H20),LR!$I:$I,))),\"\")","v":""}]
[{"$f":"IFERROR(IFERROR(INDEX(DX!A:A,MATCH(ROW(A21),DX!$I:$I,)),INDEX(LR!A:A,MATCH(ROW(A21),LR!$I:$I,))),\"\")","v":""},{"$f":"IFERROR(IFERROR(INDEX(DX!B:B,MATCH(ROW(B21),DX!$I:$I,)),INDEX(LR!B:B,MATCH(ROW(B21),LR!$I:$I,))),\"\")","v":""},{"$f":"IFERROR(IFERROR(INDEX(DX!C:C,MATCH(ROW(C21),DX!$I:$I,)),INDEX(LR!C:C,MATCH(ROW(C21),LR!$I:$I,))),\"\")","v":""},{"$f":"IFERROR(IFERROR(INDEX(DX!D:D,MATCH(ROW(D21),DX!$I:$I,)),INDEX(LR!D:D,MATCH(ROW(D21),LR!$I:$I,))),\"\")","v":""},{"$f":"IFERROR(IFERROR(INDEX(DX!E:E,MATCH(ROW(E21),DX!$I:$I,)),INDEX(LR!E:E,MATCH(ROW(E21),LR!$I:$I,))),\"\")","v":""},{"$f":"IFERROR(IFERROR(INDEX(DX!F:F,MATCH(ROW(F21),DX!$I:$I,)),INDEX(LR!F:F,MATCH(ROW(F21),LR!$I:$I,))),\"\")","v":""},{"$f":"IFERROR(IFERROR(INDEX(DX!G:G,MATCH(ROW(G21),DX!$I:$I,)),INDEX(LR!G:G,MATCH(ROW(G21),LR!$I:$I,))),\"\")","v":""},{"$f":"IFERROR(IFERROR(INDEX(DX!H:H,MATCH(ROW(H21),DX!$I:$I,)),INDEX(LR!H:H,MATCH(ROW(H21),LR!$I:$I,))),\"\")","v":""}]
[{"$f":"IFERROR(IFERROR(INDEX(DX!A:A,MATCH(ROW(A22),DX!$I:$I,)),INDEX(LR!A:A,MATCH(ROW(A22),LR!$I:$I,))),\"\")","v":""},{"$f":"IFERROR(IFERROR(INDEX(DX!B:B,MATCH(ROW(B22),DX!$I:$I,)),INDEX(LR!B:B,MATCH(ROW(B22),LR!$I:$I,))),\"\")","v":""},{"$f":"IFERROR(IFERROR(INDEX(DX!C:C,MATCH(ROW(C22),DX!$I:$I,)),INDEX(LR!C:C,MATCH(ROW(C22),LR!$I:$I,))),\"\")","v":""},{"$f":"IFERROR(IFERROR(INDEX(DX!D:D,MATCH(ROW(D22),DX!$I:$I,)),INDEX(LR!D:D,MATCH(ROW(D22),LR!$I:$I,))),\"\")","v":""},{"$f":"IFERROR(IFERROR(INDEX(DX!E:E,MATCH(ROW(E22),DX!$I:$I,)),INDEX(LR!E:E,MATCH(ROW(E22),LR!$I:$I,))),\"\")","v":""},{"$f":"IFERROR(IFERROR(INDEX(DX!F:F,MATCH(ROW(F22),DX!$I:$I,)),INDEX(LR!F:F,MATCH(ROW(F22),LR!$I:$I,))),\"\")","v":""},{"$f":"IFERROR(IFERROR(INDEX(DX!G:G,MATCH(ROW(G22),DX!$I:$I,)),INDEX(LR!G:G,MATCH(ROW(G22),LR!$I:$I,))),\"\")","v":""},{"$f":"IFERROR(IFERROR(INDEX(DX!H:H,MATCH(ROW(H22),DX!$I:$I,)),INDEX(LR!H:H,MATCH(ROW(H22),LR!$I:$I,))),\"\")","v":""}]
[{"$f":"IFERROR(IFERROR(INDEX(DX!A:A,MATCH(ROW(A23),DX!$I:$I,)),INDEX(LR!A:A,MATCH(ROW(A23),LR!$I:$I,))),\"\")","v":""},{"$f":"IFERROR(IFERROR(INDEX(DX!B:B,MATCH(ROW(B23),DX!$I:$I,)),INDEX(LR!B:B,MATCH(ROW(B23),LR!$I:$I,))),\"\")","v":""},{"$f":"IFERROR(IFERROR(INDEX(DX!C:C,MATCH(ROW(C23),DX!$I:$I,)),INDEX(LR!C:C,MATCH(ROW(C23),LR!$I:$I,))),\"\")","v":""},{"$f":"IFERROR(IFERROR(INDEX(DX!D:D,MATCH(ROW(D23),DX!$I:$I,)),INDEX(LR!D:D,MATCH(ROW(D23),LR!$I:$I,))),\"\")","v":""},{"$f":"IFERROR(IFERROR(INDEX(DX!E:E,MATCH(ROW(E23),DX!$I:$I,)),INDEX(LR!E:E,MATCH(ROW(E23),LR!$I:$I,))),\"\")","v":""},{"$f":"IFERROR(IFERROR(INDEX(DX!F:F,MATCH(ROW(F23),DX!$I:$I,)),INDEX(LR!F:F,MATCH(ROW(F23),LR!$I:$I,))),\"\")","v":""},{"$f":"IFERROR(IFERROR(INDEX(DX!G:G,MATCH(ROW(G23),DX!$I:$I,)),INDEX(LR!G:G,MATCH(ROW(G23),LR!$I:$I,))),\"\")","v":""},{"$f":"IFERROR(IFERROR(INDEX(DX!H:H,MATCH(ROW(H23),DX!$I:$I,)),INDEX(LR!H:H,MATCH(ROW(H23),LR!$I:$I,))),\"\")","v":""}]
[{"$f":"IFERROR(IFERROR(INDEX(DX!A:A,MATCH(ROW(A24),DX!$I:$I,)),INDEX(LR!A:A,MATCH(ROW(A24),LR!$I:$I,))),\"\")","v":""},{"$f":"IFERROR(IFERROR(INDEX(DX!B:B,MATCH(ROW(B24),DX!$I:$I,)),INDEX(LR!B:B,MATCH(ROW(B24),LR!$I:$I,))),\"\")","v":""},{"$f":"IFERROR(IFERROR(INDEX(DX!C:C,MATCH(ROW(C24),DX!$I:$I,)),INDEX(LR!C:C,MATCH(ROW(C24),LR!$I:$I,))),\"\")","v":""},{"$f":"IFERROR(IFERROR(INDEX(DX!D:D,MATCH(ROW(D24),DX!$I:$I,)),INDEX(LR!D:D,MATCH(ROW(D24),LR!$I:$I,))),\"\")","v":""},{"$f":"IFERROR(IFERROR(INDEX(DX!E:E,MATCH(ROW(E24),DX!$I:$I,)),INDEX(LR!E:E,MATCH(ROW(E24),LR!$I:$I,))),\"\")","v":""},{"$f":"IFERROR(IFERROR(INDEX(DX!F:F,MATCH(ROW(F24),DX!$I:$I,)),INDEX(LR!F:F,MATCH(ROW(F24),LR!$I:$I,))),\"\")","v":""},{"$f":"IFERROR(IFERROR(INDEX(DX!G:G,MATCH(ROW(G24),DX!$I:$I,)),INDEX(LR!G:G,MATCH(ROW(G24),LR!$I:$I,))),\"\")","v":""},{"$f":"IFERROR(IFERROR(INDEX(DX!H:H,MATCH(ROW(H24),DX!$I:$I,)),INDEX(LR!H:H,MATCH(ROW(H24),LR!$I:$I,))),\"\")","v":""}]
[{"$f":"IFERROR(IFERROR(INDEX(DX!A:A,MATCH(ROW(A25),DX!$I:$I,)),INDEX(LR!A:A,MATCH(ROW(A25),LR!$I:$I,))),\"\")","v":""},{"$f":"IFERROR(IFERROR(INDEX(DX!B:B,MATCH(ROW(B25),DX!$I:$I,)),INDEX(LR!B:B,MATCH(ROW(B25),LR!$I:$I,))),\"\")","v":""},{"$f":"IFERROR(IFERROR(INDEX(DX!C:C,MATCH(ROW(C25),DX!$I:$I,)),INDEX(LR!C:C,MATCH(ROW(C25),LR!$I:$I,))),\"\")","v":""},{"$f":"IFERROR(IFERROR(INDEX(DX!D:D,MATCH(ROW(D25),DX!$I:$I,)),INDEX(LR!D:D,MATCH(ROW(D25),LR!$I:$I,))),\"\")","v":""},{"$f":"IFERROR(IFERROR(INDEX(DX!E:E,MATCH(ROW(E25),DX!$I:$I,)),INDEX(LR!E:E,MATCH(ROW(E25),LR!$I:$I,))),\"\")","v":""},{"$f":"IFERROR(IFERROR(INDEX(DX!F:F,MATCH(ROW(F25),DX!$I:$I,)),INDEX(LR!F:F,MATCH(ROW(F25),LR!$I:$I,))),\"\")","v":""},{"$f":"IFERROR(IFERROR(INDEX(DX!G:G,MATCH(ROW(G25),DX!$I:$I,)),INDEX(LR!G:G,MATCH(ROW(G25),LR!$I:$I,))),\"\")","v":""},{"$f":"IFERROR(IFERROR(INDEX(DX!H:H,MATCH(ROW(H25),DX!$I:$I,)),INDEX(LR!H:H,MATCH(ROW(H25),LR!$I:$I,))),\"\")","v":""}]
[{"$f":"IFERROR(IFERROR(INDEX(DX!A:A,MATCH(ROW(A26),DX!$I:$I,)),INDEX(LR!A:A,MATCH(ROW(A26),LR!$I:$I,))),\"\")","v":""},{"$f":"IFERROR(IFERROR(INDEX(DX!B:B,MATCH(ROW(B26),DX!$I:$I,)),INDEX(LR!B:B,MATCH(ROW(B26),LR!$I:$I,))),\"\")","v":""},{"$f":"IFERROR(IFERROR(INDEX(DX!C:C,MATCH(ROW(C26),DX!$I:$I,)),INDEX(LR!C:C,MATCH(ROW(C26),LR!$I:$I,))),\"\")","v":""},{"$f":"IFERROR(IFERROR(INDEX(DX!D:D,MATCH(ROW(D26),DX!$I:$I,)),INDEX(LR!D:D,MATCH(ROW(D26),LR!$I:$I,))),\"\")","v":""},{"$f":"IFERROR(IFERROR(INDEX(DX!E:E,MATCH(ROW(E26),DX!$I:$I,)),INDEX(LR!E:E,MATCH(ROW(E26),LR!$I:$I,))),\"\")","v":""},{"$f":"IFERROR(IFERROR(INDEX(DX!F:F,MATCH(ROW(F26),DX!$I:$I,)),INDEX(LR!F:F,MATCH(ROW(F26),LR!$I:$I,))),\"\")","v":""},{"$f":"IFERROR(IFERROR(INDEX(DX!G:G,MATCH(ROW(G26),DX!$I:$I,)),INDEX(LR!G:G,MATCH(ROW(G26),LR!$I:$I,))),\"\")","v":""},{"$f":"IFERROR(IFERROR(INDEX(DX!H:H,MATCH(ROW(H26),DX!$I:$I,)),INDEX(LR!H:H,MATCH(ROW(H26),LR!$I:$I,))),\"\")","v":""}]
[{"$f":"IFERROR(IFERROR(INDEX(DX!A:A,MATCH(ROW(A27),DX!$I:$I,)),INDEX(LR!A:A,MATCH(ROW(A27),LR!$I:$I,))),\"\")","v":""},{"$f":"IFERROR(IFERROR(INDEX(DX!B:B,MATCH(ROW(B27),DX!$I:$I,)),INDEX(LR!B:B,MATCH(ROW(B27),LR!$I:$I,))),\"\")","v":""},{"$f":"IFERROR(IFERROR(INDEX(DX!C:C,MATCH(ROW(C27),DX!$I:$I,)),INDEX(LR!C:C,MATCH(ROW(C27),LR!$I:$I,))),\"\")","v":""},{"$f":"IFERROR(IFERROR(INDEX(DX!D:D,MATCH(ROW(D27),DX!$I:$I,)),INDEX(LR!D:D,MATCH(ROW(D27),LR!$I:$I,))),\"\")","v":""},{"$f":"IFERROR(IFERROR(INDEX(DX!E:E,MATCH(ROW(E27),DX!$I:$I,)),INDEX(LR!E:E,MATCH(ROW(E27),LR!$I:$I,))),\"\")","v":""},{"$f":"IFERROR(IFERROR(INDEX(DX!F:F,MATCH(ROW(F27),DX!$I:$I,)),INDEX(LR!F:F,MATCH(ROW(F27),LR!$I:$I,))),\"\")","v":""},{"$f":"IFERROR(IFERROR(INDEX(DX!G:G,MATCH(ROW(G27),DX!$I:$I,)),INDEX(LR!G:G,MATCH(ROW(G27),LR!$I:$I,))),\"\")","v":""},{"$f":"IFERROR(IFERROR(INDEX(DX!H:H,MATCH(ROW(H27),DX!$I:$I,)),INDEX(LR!H:H,MATCH(ROW(H27),LR!$I:$I,))),\"\")","v":""}]
[{"$f":"IFERROR(IFERROR(INDEX(DX!A:A,MATCH(ROW(A28),DX!$I:$I,)),INDEX(LR!A:A,MATCH(ROW(A28),LR!$I:$I,))),\"\")","v":""},{"$f":"IFERROR(IFERROR(INDEX(DX!B:B,MATCH(ROW(B28),DX!$I:$I,)),INDEX(LR!B:B,MATCH(ROW(B28),LR!$I:$I,))),\"\")","v":""},{"$f":"IFERROR(IFERROR(INDEX(DX!C:C,MATCH(ROW(C28),DX!$I:$I,)),INDEX(LR!C:C,MATCH(ROW(C28),LR!$I:$I,))),\"\")","v":""},{"$f":"IFERROR(IFERROR(INDEX(DX!D:D,MATCH(ROW(D28),DX!$I:$I,)),INDEX(LR!D:D,MATCH(ROW(D28),LR!$I:$I,))),\"\")","v":""},{"$f":"IFERROR(IFERROR(INDEX(DX!E:E,MATCH(ROW(E28),DX!$I:$I,)),INDEX(LR!E:E,MATCH(ROW(E28),LR!$I:$I,))),\"\")","v":""},{"$f":"IFERROR(IFERROR(INDEX(DX!F:F,MATCH(ROW(F28),DX!$I:$I,)),INDEX(LR!F:F,MATCH(ROW(F28),LR!$I:$I,))),\"\")","v":""},{"$f":"IFERROR(IFERROR(INDEX(DX!G:G,MATCH(ROW(G28),DX!$I:$I,)),INDEX(LR!G:G,MATCH(ROW(G28),LR!$I:$I,))),\"\")","v":""},{"$f":"IFERROR(IFERROR(INDEX(DX!H:H,MATCH(ROW(H28),DX!$I:$I,)),INDEX(LR!H:H,MATCH(ROW(H28),LR!$I:$I,))),\"\")","v":""}]
[{"$f":"IFERROR(IFERROR(INDEX(DX!A:A,MATCH(ROW(A29),DX!$I:$I,)),INDEX(LR!A:A,MATCH(ROW(A29),LR!$I:$I,))),\"\")","v":""},{"$f":"IFERROR(IFERROR(INDEX(DX!B:B,MATCH(ROW(B29),DX!$I:$I,)),INDEX(LR!B:B,MATCH(ROW(B29),LR!$I:$I,))),\"\")","v":""},{"$f":"IFERROR(IFERROR(INDEX(DX!C:C,MATCH(ROW(C29),DX!$I:$I,)),INDEX(LR!C:C,MATCH(ROW(C29),LR!$I:$I,))),\"\")","v":""},{"$f":"IFERROR(IFERROR(INDEX(DX!D:D,MATCH(ROW(D29),DX!$I:$I,)),INDEX(LR!D:D,MATCH(ROW(D29),LR!$I:$I,))),\"\")","v":""},{"$f":"IFERROR(IFERROR(INDEX(DX!E:E,MATCH(ROW(E29),DX!$I:$I,)),INDEX(LR!E:E,MATCH(ROW(E29),LR!$I:$I,))),\"\")","v":""},{"$f":"IFERROR(IFERROR(INDEX(DX!F:F,MATCH(ROW(F29),DX!$I:$I,)),INDEX(LR!F:F,MATCH(ROW(F29),LR!$I:$I,))),\"\")","v":""},{"$f":"IFERROR(IFERROR(INDEX(DX!G:G,MATCH(ROW(G29),DX!$I:$I,)),INDEX(LR!G:G,MATCH(ROW(G29),LR!$I:$I,))),\"\")","v":""},{"$f":"IFERROR(IFERROR(INDEX(DX!H:H,MATCH(ROW(H29),DX!$I:$I,)),INDEX(LR!H:H,MATCH(ROW(H29),LR!$I:$I,))),\"\")","v":""}]
[{"$f":"IFERROR(IFERROR(INDEX(DX!A:A,MATCH(ROW(A30),DX!$I:$I,)),INDEX(LR!A:A,MATCH(ROW(A30),LR!$I:$I,))),\"\")","v":""},{"$f":"IFERROR(IFERROR(INDEX(DX!B:B,MATCH(ROW(B30),DX!$I:$I,)),INDEX(LR!B:B,MATCH(ROW(B30),LR!$I:$I,))),\"\")","v":""},{"$f":"IFERROR(IFERROR(INDEX(DX!C:C,MATCH(ROW(C30),DX!$I:$I,)),INDEX(LR!C:C,MATCH(ROW(C30),LR!$I:$I,))),\"\")","v":""},{"$f":"IFERROR(IFERROR(INDEX(DX!D:D,MATCH(ROW(D30),DX!$I:$I,)),INDEX(LR!D:D,MATCH(ROW(D30),LR!$I:$I,))),\"\")","v":""},{"$f":"IFERROR(IFERROR(INDEX(DX!E:E,MATCH(ROW(E30),DX!$I:$I,)),INDEX(LR!E:E,MATCH(ROW(E30),LR!$I:$I,))),\"\")","v":""},{"$f":"IFERROR(IFERROR(INDEX(DX!F:F,MATCH(ROW(F30),DX!$I:$I,)),INDEX(LR!F:F,MATCH(ROW(F30),LR!$I:$I,))),\"\")","v":""},{"$f":"IFERROR(IFERROR(INDEX(DX!G:G,MATCH(ROW(G30),DX!$I:$I,)),INDEX(LR!G:G,MATCH(ROW(G30),LR!$I:$I,))),\"\")","v":""},{"$f":"IFERROR(IFERROR(INDEX(DX!H:H,MATCH(ROW(H30),DX!$I:$I,)),INDEX(LR!H:H,MATCH(ROW(H30),LR!$I:$I,))),\"\")","v":""}]
[{"$f":"IFERROR(IFERROR(INDEX(DX!A:A,MATCH(ROW(A31),DX!$I:$I,)),INDEX(LR!A:A,MATCH(ROW(A31),LR!$I:$I,))),\"\")","v":""},{"$f":"IFERROR(IFERROR(INDEX(DX!B:B,MATCH(ROW(B31),DX!$I:$I,)),INDEX(LR!B:B,MATCH(ROW(B31),LR!$I:$I,))),\"\")","v":""},{"$f":"IFERROR(IFERROR(INDEX(DX!C:C,MATCH(ROW(C31),DX!$I:$I,)),INDEX(LR!C:C,MATCH(ROW(C31),LR!$I:$I,))),\"\")","v":""},{"$f":"IFERROR(IFERROR(INDEX(DX!D:D,MATCH(ROW(D31),DX!$I:$I,)),INDEX(LR!D:D,MATCH(ROW(D31),LR!$I:$I,))),\"\")","v":""},{"$f":"IFERROR(IFERROR(INDEX(DX!E:E,MATCH(ROW(E31),DX!$I:$I,)),INDEX(LR!E:E,MATCH(ROW(E31),LR!$I:$I,))),\"\")","v":""},{"$f":"IFERROR(IFERROR(INDEX(DX!F:F,MATCH(ROW(F31),DX!$I:$I,)),INDEX(LR!F:F,MATCH(ROW(F31),LR!$I:$I,))),\"\")","v":""},{"$f":"IFERROR(IFERROR(INDEX(DX!G:G,MATCH(ROW(G31),DX!$I:$I,)),INDEX(LR!G:G,MATCH(ROW(G31),LR!$I:$I,))),\"\")","v":""},{"$f":"IFERROR(IFERROR(INDEX(DX!H:H,MATCH(ROW(H31),DX!$I:$I,)),INDEX(LR!H:H,MATCH(ROW(H31),LR!$I:$I,))),\"\")","v":""}]

{"sheet":"DX","index":3,"n_rows":44,"n_cols":9,"rows_kept":44,"cut":false,"hidden":false,"merged":[[0,5,0,6],[2,5,2,6]]}
[null,null,null,null,null,"Сумма заказа",null,{"$f":"SUM(H6:H101)","v":0}]
[]
[null,null,null,null,null,"Вы сэкономили",null,{"$f":"SUM(E6:E101)-H1","v":38597.549999999996}]
[]
["Арт.","Наименование","Остаток","Тариф, руб.","Сумма, руб.","Кол-во","Спеццена, руб.","Сумма покупки, руб."]
["3392","DX ВА 1п C63 6000A 6кА",48,462.2,{"$f":"F6*D6","v":0},null,null,{"$f":"F6*G6","v":0},{"$f":"IF(F6,I5+1,I5)","v":0}]
["3391","DX ВА 1п C50 6000A 6кА",40,924.4,0,null,null,{"$f":"F7*G7","v":0},{"$f":"IF(F7,I6+1,I6)","v":0}]
["3389","DX ВА 1п C32 6000A 6кА",39,300.36,0,null,null,0,0]
["3390","DX ВА 1п C40 6000A 6кА",33,471.09000000000003,0,null,null,0,0]
["6375","DX ВА 1п C13 6000A 10кА",5,208.96,0,null,null,0,0]
["8014","DX АВДТ 4п 30мА С50 6000A 10кА",1,3878.58,0,null,null,0,0]
["8995","DX ВДТ 4п 30мA AC63",3,4219.42,16877.68,4,null,0,1]
["4076","Силов.реле 230В 2п 63А 2НЗ",3,4475.88,0,null,null,0,1]
["8916","DX ВДТ 2п 100мA AC40",1,1257.01,0,null,null,0,1]
["3498","DX ВА 4п C50 6000A 6кА",2,2654.34,0,null,null,0,1]
["7966","DX АВДТ 4п 30мА С25 6000A 10кА",1,3750.71,18753.55,5,null,0,2]
["6017","DX ВА 1п+н C10 4500А 4,5 кА",4,332.75,0,null,null,0,2]
["4358","Модул.выключатель 3п 125А 3м",1,2081.2600000000002,0,null,null,0,2]
["3308","DX ВА 2п B06 6000A 6кА",2,464.12,0,null,null,0,2]
["3431","DX ВА 2п C10 6000A 6кА",2,423.76,2966.3199999999997,7,null,0,3]
["3312","DX ВА 2п B16 6000A 6кА",4,480.12,0,null,null,0,3]
["4323","Модул.выключатель 2п 20А с инд",8,618.23,0,null,null,0,3]
["3435","DX ВА 2п C25 6000A 6кА",2,416.5,0,null,null,0,3]
["3449","DX ВА 3п C10 6000A 6кА",3,590.17999999999995,0,null,null,0,3]
["8994","DX ВДТ 4п 30мA AC40",2,1879.57,0,null,null,0,3]
["3451","DX ВА 3п C16 6000A 6кА",2,590.17999999999995,0,null,null,0,3]
["7964","DX АВДТ 4п 30мА С16 6000A 10кА",2,3670.91,0,null,null,0,3]
["9013","DX ВДТ 4п 300мA AC63",1,1699.04,0,null,null,0,3]
["9019","DX ВДТ 4п 300мA AC63 селек.",1,3495.79,0,null,null,0,3]
["9001","DX ВДТ 4п 100мA AC63",1,1879.49,0,null,null,0,3]
["7952","DX АВДТ 2п 300мА С63 6000A10кА",1,2672.94,0,null,null,0,3]
["3447","DX ВА 3п C06 6000A 6кА",1,590.17999999999995,0,null,null,0,3]
["26208","DPX125 Суппорт д/уст.на рейку",1,201.68,0,null,null,0,3]
["4079","Силов.реле 230В 4п 63А 4НЗ",1,2761.09,0,null,null,0,3]
["7901","DX АВДТ1п+н300мА AC40 6000А6кА",1,3059.44,0,null,null,0,3]
["8591","DXАВДТ1п+н30мА A40 6000А 10кА",1,6829.84,0,null,null,0,3]
["8927","DX ВДТ 2п 300мA AC25",1,1197.3800000000001,0,null,null,0,3]
["8911","DX ВДТ 2п 30мA AC63",1,1460.44,0,null,null,0,3]
["6383","DX ВА 1п C80 10000A 12,5кА",1,1452.78,0,null,null,0,3]
["4049","Силов.реле 230В 2п 20А 2НО",2,1246.68,0,null,null,0,3]
["4073","Силов.реле 24В 2п 63А 2НО",1,1708.88,0,null,null,0,3]
["8915","DX ВДТ 2п 100мA AC25",1,1164,0,null,null,0,3]
["8910","DX ВДТ 2п 30мA AC40",1,1116.46,0,null,null,0,3]
["22520","VistopВык.3п/100Афрон.прив чер",1,2542.8200000000002,0,null,null,0,3]

{"sheet":"LR","index":4,"n_rows":28,"n_cols":9,"rows_kept":28,"cut":false,"hidden":false,"merged":[[0,5,0,6],[2,5,2,6]]}
[null,null,null,null,null,"Сумма заказа",null,{"$f":"SUM(H6:H101)","v":0}]
[]
[null,null,null,null,null,"Вы сэкономили",null,{"$f":"SUM(E6:E101)-H1","v":40909.840000000004}]
[]
["Арт.","Наименование","Остаток","Тариф, руб.","Сумма, руб.","Кол-во","Спеццена, руб.","Сумма покупки, руб.",{"$f":"MAX(DX!I:I)","v":3}]
["604826","LR ВА 2п C63 6000A 6кА",9,669.74,{"$f":"F6*D6","v":0},null,null,{"$f":"F6*G6","v":0},{"$f":"IF(F6,I5+1,I5)","v":3}]
["604809","LR ВА 1п C40 6000A 6кА",80,544.08000000000004,0,null,null,0,{"$f":"IF(F7,I6+1,I6)","v":3}]
["604810","LR ВА 1п C50 6000A 6кА",62,737.35,0,null,null,0,3]
["604821","LR ВА 2п C20 6000A 6кА",17,558.98,0,null,null,0,3]
["602146","LR ВДТ 4п AC25 30мА 6кА",8,3289.52,0,null,null,0,3]
["604840","LR ВА 3п C50 6000A 6кА",6,999.32,0,null,null,0,3]
["604839","LR ВА 3п C40 6000A 6кА",4,899.36,0,null,null,0,3]
["604841","LR ВА 3п C63 6000A 6кА",4,1000.3,0,null,null,0,3]
["604832","LR ВА 3п C06 6000A 6кА",1,444.91,34702.980000000003,78,null,0,4]
["604837","LR ВА 3п C25 6000A 6кА",1,388.45,0,null,null,0,4]
["604833","LR ВА 3п C10 6000A 6кА",5,776.9,0,null,null,0,4]
["604836","LR ВА 3п C20 6000A 6кА",2,388.45,0,null,null,0,4]
["604835","LR ВА 3п C16 6000A 6кА",1,388.45,0,null,null,0,4]
["604811","LR ВА 1п C63 6000A 6кА",26,148.66,0,null,null,0,4]
["604820","LR ВА 2п C16 6000A 6кА",12,558.98,0,null,null,0,4]
["604818","LR ВА 2п C10 6000A 6кА",12,558.98,0,null,null,0,4]
["604823","LR ВА 2п C32 6000A 6кА",5,282.13,6206.86,22,null,0,5]
["604802","LR ВА 1п C06 6000А 6кА",80,252.58,0,null,null,0,5]
["604822","LR ВА 2п C25 6000A 6кА",20,558.98,0,null,null,0,5]
["604808","LR ВА 1п C32 6000A 6кА",20,257.60000000000002,0,null,null,0,5]
["604824","LR ВА 2п C40 6000A 6кА",2,282.13,0,null,null,0,5]
["602147","LR ВДТ 4п AC40 30мА 6кА",4,1646.72,0,null,null,0,5]
["602138","LR ВДТ 2п AC63 30мА 6кА",6,1105.79,0,null,null,0,5]

{"sheet":"Общий","index":5,"n_rows":528,"n_cols":5,"rows_kept":528,"cut":false,"hidden":false,"merged":[]}
["Арт.","Наименование","Кол-во","Цена, руб.","Сумма, руб."]
["470508","Блок питания 12В=, 60Вт",1,6296,6296]
["461067","Трансформатор электронный 60вт E-Trafo",8,969,7752]
["37300","XL3 160 Доп.латун.колодка  ",2,936.24,{"$f":"C4*D4","v":1872.48}]
["4848","Клемм.син.2х6-25+33х1.5-16мм2",1,436.72,{"$f":"C5*D5","v":436.72}]
["51694","IN ONEШнур перех.RJ45-RJ11",10,310.88,3108.8]
["601051","EkinoxeNX Шкаф 1x4м(бел.дв)",2,475.85,951.7]
["34080","VDIФикс-р д/каб. д/шкафа 400мм",2,591,1182]
["20051","XL3 160 Заглушка рAL 7035 24м",4,149.86000000000001,599.44000000000005]
["1631","Ekinoxe TX Дверь бел. 1X18м",1,689.53,689.53]
["1602","Ekinoxe TX Шкаф 2Х18м ",1,2068.9699999999998,2068.9699999999998]
["1412","NedboxЩит вст.д/ав.2х12+4м бел",1,1218.04,1218.04]
["1601","Ekinoxe TX Шкаф 1Х18м ",1,1487.97,1487.97]
["1769","Plexо шкафы Кронш.для креп.",1,428.89,428.89]
["32734","EkinoxeТелефон. блок 8RJ45 ",1,930.11,930.11]
["4803","Клем.б/изол.1х6-25+8х1.5-16мм2",2,97.48,194.96]
["1491","Nedbox Замок врезной №850",1,449.24,449.24]
["36806","Atl.Защел.с руч+кл.д/запир.шк.",7,348.96,2442.7199999999998]
["MTN478544","Рамка 5 постов бежевый",1,1831,1831]
["N1519-WH","Встраиваемый светильник Donolux N1519-WH",1,1180,1180]
["L4141","Розетка 2П + заземление (боков.) 10А/16А с защитными шторками 2 модуля",2,1042.23,2084.46]
["HA4802M2HBR","Рамка 2х2П 71мм горизонтальная Бронза Axolute",1,4517.49,4517.49]
["5572BL","Рамка 2-постовая вертикальная, серия TACTO, цвет альпийский белый",20,301,6020]
["NT4141","Розетка 2П + заземление (боков.) 10А/16А с защитными шторками 2 модуля",1,1042.23,1042.23]
["HC4279C6","Розетка Axolute RJ45 UTP Cat. 6",1,2361.63,2361.63]
["H4743/230B","Axolute. Лампа LED для подсветки 230В. Цвет Синий",1,1165.31,1165.31]
["L4951","Заглушка 2 модуля с выламываемой вставкой, чёрная",4,254.17,1016.68]
["LN4707","Суппорт 7 Модулей L/N/Nt",1,383.35,383.35]
["LN4704","Суппорт 4 Модуля L/N/Nt",1,282.8,282.8]
["LN4702","Livinglight Суппорт пластиковый на 2 модуля на винтах",4,209.48,837.92]
["1754-0-4171","Рамка 4-постовая, серия future, цвет savanne/слоновая кость",3,"1154,88",{"$f":"C31*D31","v":3464.6400000000003}]
["1754-0-4169","Рамка 2-постовая, серия future, цвет savanne/слоновая кость",1,"317,32",{"$f":"C32*D32","v":317.32}]
["1754-0-4168","Рамка 1-постовая, серия future, цвет savanne/слоновая кость",2,"253,13",506.26]
["1724-0-2758","Накладка (центральная плата) для TV-R-SAT розетки, серия solo/future, цвет savanne/слоновая кость",3,"351,72",1055.1600000000001]
["6430-0-0337","Клавиша для механизма электронного выключателя Busch-Jalousiecontrol 6411 U-101, 6411 U/S-101, 6418 U, реле 6402 U, серия impuls, цвет слоновая кость",2,"3503,10",7006.2]
["6410-0-0376","Механизм базового электронного выключателя жалюзи, 3А при cosφ=0.5",1,"5314,91",5314.91]
["1012-0-2110","Механизм 1-клавишного, 1-полюсного переключателя, 10А 250В",3,"440,14",1320.42]
["1012-0-2131","Механизм 1-клавишного, 1-полюсного выключателя, 10А 250В",1,"479,48",479.48]
["87745","Sagane-Xeliomat Обрамление  алюминий д/розетки 2P+E нем.стд.",2,426.3,852.6]
["84210","Sagane розетка  2P+E немец. Стандарт",2,366.7,733.4]
["82410","Sagane-Xeliomat Рамка  1-я хром",2,1046,2092]
["82815-61","Рамка декоративная, 1 пост, S82, вишня-графит",1,990.27551999999991,{"$f":"C42*D42","v":990.27551999999991}]
["73630-31","Рамка с вырезом под вставку, 3 поста, 82*231мм, S73, слоновая кость",7,405.99936000000002,{"$f":"C43*D43","v":2841.9955200000004}]
["82710-31","Рамка декоративная, 1 пост, S82, слоновая кость-слоновая кость",10,186.83808000000002,1868.3808000000001]
["73610-31","Рамка с вырезом под вставку, 1 пост, 82*89мм, S73, слоновая кость",6,162.47712000000001,974.86272000000008]
["73398-39","Выключатель двухклавишный, 10А 250В, S73, S73 Loft",27,603.04607999999996,16282.244159999998]
["73101-39","Выключатель одноклавишный, 10А 250В, S73, S73 Loft",7,392.29631999999998,2746.0742399999999]
["82066-32","Светящаяся клавиша под светофильтр с комплектом подключения к одноклавишному и кнопочному выключател",4,2127.5779200000002,8510.3116800000007]
["73910-39","Вставка декоративная в рамку, S73, слоновая кость",8,75.541439999999994,604.33151999999995]
["75432-39","Розетка двухполюсная с заземлением Schuko, 16А 250В, винтовой зажим, S82, S82N, S88, S82 Detail",1,359.03712000000002,359.03712000000002]
["75431-39","Розетка двухполюсная без заземления, 16А 250В, винтовой зажим, S82, S82N, S88, S82 Detail",1,355.81728000000004,355.81728000000004]
["75101-39","Выключатель одноклавишный, S82, S82N, S88, S82 Detail",3,305.18591999999995,915.55775999999992]
["75398-39","Выключатель двухклавишный, 10А 250В, S82, S82N, S88, S82 Detail",4,657.67104000000006,2630.6841600000002]
["775957","GLПерек.д/вен.1К 3п.б/\"0\"PRO21",1,1314.11,1314.11]
["771510","G.Life Л.п. выкл. Pearl ",2,723.2,723.2]
["771212","G.LifeЛ.п.д.дв.выкл.D. BR.",1,577.16,577.16]
["771275","G.Life Л.п.д.телеф.и RJ D.BR.",1,1109.21,1109.21]
["775821","G.L.Выкл.с подс./инд.PRO21",51,1497.2,19089.3]
["775802","G.L.Выключ.двухполюсн.PRO21",1,1606.95,1606.95]
["775811","G.L.Выключ.кнопочный PRO21",2,830.46,1660.92]
["775828","GaleaLifeRJ45кат.6 UTP 1 вых.",1,1443.66,1443.66]
["775847","GaleaLifeRJ 45кат.6 UTP 2вых. ",3,1482.8,4448.3999999999996]
["775806","G.L.Перекл.на 2напр.PRO21",5,1760.16,4400.4000000000005]
["771502","G.Life Р. 2п pearl гор.",1,901.43,901.43]
["775600","G.L.PRO21Вык.с подсв,ламп.зел.",20,2439.94,24399.399999999998]
["775789","G.L.TV-RD-SATзвезда1,5дБ PRO21",5,1864.32,9321.6]
["775971","G.L.Р.TV-FM-SAT пр.1,5дБPRO21",3,492.02,1476.06]
["777078","Galea-Деко Заглушка бел.",8,1203.52,9628.16]
["775801","G.L.Выключ.PRO21",29,2636.44,19114.190000000002]
["775938","G.L. Роз.1хRJ11 PRO21",3,1767.22,2650.83]
["775975","G.L.Р. тел. RJ45 ISDN 8 конт.",4,6986.67,9315.56]
["775903","G.L.Севтор.420Вт-420ВА PRO21",3,12830.65,38491.949999999997]
["775825","G.L.Выкл.двухкл.с подс.PRO21",2,2664.43,5328.86]
["775653","G.L.Светорегулятор на 600Вт",1,10331.459999999999,10331.459999999999]
["777878","Galea Л.пан.выв.каб.перламутр",1,152.53,152.53]
["775762","GaleaLifeRJ45к.5еUTP2вых.н/экр",6,2187.09,13122.54]
["775920","G.L.Р.с пруж.клем.нем.ст.PRO21",2,544.22,1088.44]
["775785","G.L. Роз. простая для колонки",11,3664.06,20152.329999999998]
["775784","G.L. Роз. двойная для колонки",13,4596.34,29876.21]
["775791","G.L.TV-RD-SATпрох.14дБ PRO21",1,1928.33,1928.33]
["775805","G.L.Выкл.двухклав.PRO21",1,1241.01,1241.01]
["771401","G.Life Рамка 1п titanium",3,613.23,1839.69]
["771420","G.Life Л.п. д.роз.2К+З titan.",1,327.97,327.97]
["771412","G.Life Л.п. д/дв. выкл.titan.",1,577.16,577.16]
["771512","G.Life Л.п. д/дв.выкл. Pearl",8,552.19000000000005,4417.5200000000004]
["777020","Galea-Деко Л.п.д/роз.2К+З н.ст",2,215.62,431.24]
["771310","G.Life Л. п. выкл. Aluminium ",7,384.91,2694.3700000000003]
["777066","Galea-ДекоЛ.п. TV бел.",5,353.59,1767.9499999999998]
["771079","GL Л.п.д.дв.вкл. с инд white",9,648.91999999999996,5840.28]
["771003","G.Life Рамка 3 п, WHITE, гор.",4,765.61,3062.44]
["771302","G.Life Р. 2п alum.гор.",1,1166.8900000000001,1166.8900000000001]
["771520","G.Life Л.п. роз. 2К+З pearl",1,292.38,292.38]
["3392","DX ВА 1п C63 6000A 6кА",48,462.2,11092.8]
["3391","DX ВА 1п C50 6000A 6кА",40,924.4,9244]
["3389","DX ВА 1п C32 6000A 6кА",39,300.36,5857.02]
["3390","DX ВА 1п C40 6000A 6кА",33,471.09000000000003,5181.99]
["6375","DX ВА 1п C13 6000A 10кА",5,208.96,1044.8]
["8014","DX АВДТ 4п 30мА С50 6000A 10кА",1,3878.58,3878.58]
["8995","DX ВДТ 4п 30мA AC63",3,4219.42,6329.13]
["4076","Силов.реле 230В 2п 63А 2НЗ",3,4475.88,6713.82]
["8916","DX ВДТ 2п 100мA AC40",1,1257.01,1257.01]
["3498","DX ВА 4п C50 6000A 6кА",2,2654.34,2654.34]
["7966","DX АВДТ 4п 30мА С25 6000A 10кА",1,3750.71,3750.71]
["6017","DX ВА 1п+н C10 4500А 4,5 кА",4,332.75,1331]
["4358","Модул.выключатель 3п 125А 3м",1,2081.2600000000002,2081.2600000000002]
["3308","DX ВА 2п B06 6000A 6кА",2,464.12,928.24]
["3431","DX ВА 2п C10 6000A 6кА",2,423.76,847.52]
["3312","DX ВА 2п B16 6000A 6кА",4,480.12,1920.48]
["4323","Модул.выключатель 2п 20А с инд",8,618.23,4945.84]
["3435","DX ВА 2п C25 6000A 6кА",2,416.5,833]
["3449","DX ВА 3п C10 6000A 6кА",3,590.17999999999995,1770.54]
["8994","DX ВДТ 4п 30мA AC40",2,1879.57,3759.14]
["3451","DX ВА 3п C16 6000A 6кА",2,590.17999999999995,1180.3599999999999]
["7964","DX АВДТ 4п 30мА С16 6000A 10кА",2,3670.91,7341.82]
["9013","DX ВДТ 4п 300мA AC63",1,1699.04,1699.04]
["9019","DX ВДТ 4п 300мA AC63 селек.",1,3495.79,3495.79]
["9001","DX ВДТ 4п 100мA AC63",1,1879.49,1879.49]
["7952","DX АВДТ 2п 300мА С63 6000A10кА",1,2672.94,2672.94]
["3447","DX ВА 3п C06 6000A 6кА",1,590.17999999999995,590.17999999999995]
["26208","DPX125 Суппорт д/уст.на рейку",1,201.68,201.68]
["4079","Силов.реле 230В 4п 63А 4НЗ",1,2761.09,2761.09]
["7901","DX АВДТ1п+н300мА AC40 6000А6кА",1,3059.44,3059.44]
["8591","DXАВДТ1п+н30мА A40 6000А 10кА",1,6829.84,6829.84]
["8927","DX ВДТ 2п 300мA AC25",1,1197.3800000000001,1197.3800000000001]
["8911","DX ВДТ 2п 30мA AC63",1,1460.44,1460.44]
["6383","DX ВА 1п C80 10000A 12,5кА",1,1452.78,1452.78]
["4049","Силов.реле 230В 2п 20А 2НО",2,1246.68,1246.68]
["4073","Силов.реле 24В 2п 63А 2НО",1,1708.88,1708.88]
["8915","DX ВДТ 2п 100мA AC25",1,1164,1164]
["8910","DX ВДТ 2п 30мA AC40",1,1116.46,1116.46]
["22520","VistopВык.3п/100Афрон.прив чер",1,2542.8200000000002,{"$f":"C131*D131","v":2542.8200000000002}]
["604826","LR ВА 2п C63 6000A 6кА",9,669.74,3013.83]
["604809","LR ВА 1п C40 6000A 6кА",80,544.08000000000004,10881.6]
["604810","LR ВА 1п C50 6000A 6кА",62,737.35,9143.1400000000012]
["604821","LR ВА 2п C20 6000A 6кА",17,558.98,4751.33]
["602146","LR ВДТ 4п AC25 30мА 6кА",8,3289.52,13158.08]
["604840","LR ВА 3п C50 6000A 6кА",6,999.32,2997.96]
["604839","LR ВА 3п C40 6000A 6кА",4,899.36,1798.72]
["604841","LR ВА 3п C63 6000A 6кА",4,1000.3,2000.6]
["604832","LR ВА 3п C06 6000A 6кА",1,444.91,444.91]
["604837","LR ВА 3п C25 6000A 6кА",1,388.45,388.45]
["604833","LR ВА 3п C10 6000A 6кА",5,776.9,1942.25]
["604836","LR ВА 3п C20 6000A 6кА",2,388.45,776.9]
["604835","LR ВА 3п C16 6000A 6кА",1,388.45,388.45]
["604811","LR ВА 1п C63 6000A 6кА",26,148.66,3865.16]
["604820","LR ВА 2п C16 6000A 6кА",12,558.98,3353.88]
["604818","LR ВА 2п C10 6000A 6кА",12,558.98,3353.88]
["604823","LR ВА 2п C32 6000A 6кА",5,282.13,1410.65]
["604802","LR ВА 1п C06 6000А 6кА",80,252.58,10103.200000000001]
["604822","LR ВА 2п C25 6000A 6кА",20,558.98,5589.8]
["604808","LR ВА 1п C32 6000A 6кА",20,257.60000000000002,2576]
["604824","LR ВА 2п C40 6000A 6кА",2,282.13,564.26]
["602147","LR ВДТ 4п AC40 30мА 6кА",4,1646.72,6586.88]
["602138","LR ВДТ 2п AC63 30мА 6кА",6,1105.79,6634.74]
["774161","Регулирование и управление поворотом рукоятки - Valena - 40-400 Вт/40-400 ВА - слоновая кость",1,2594.04,2594.04]
["774417","Valena Светорег.40-400Вт(бел)",4,2355.9,4711.8]
["770074","Кнопочный светорегулятор - Valena - 40-600 Вт/40-600 ВА - белый",3,3703.12,11109.36]
["770061","Регулирование и управление поворотом рукоятки - Valena - 40-400 Вт/40-400 ВА - белый",3,2594.04,7782.12]
["774281","Valena Рамка 1п.гор.золото",30,165.28,2479.1999999999998]
["774453","Рамка - Valena - 3 поста - горизонтальный монтаж - белый",9,454.92,2047.14]
["774322","Силовая розетка - Valena - 2К+3 - с откидной крышкой - на винтах - 10/16 А - 230/250 В~ - слоновая кость",12,703.54,4221.24]
["774306","Переключатель на два направления - Valena - 10 A - 250 В~ - слоновая кость",2,591.74,591.74]
["774310","Выключатель с подсветкой - Valena - 10 A - 250 В~ - слоновая кость",213,2165.48,115311.81]
["774130","Информационная розетка - Valena - RJ45 - категория 5e - UTP - 1 выход - с захватами - слоновая кость",5,2091.87,3486.45]
["770492","Рамка - Valena - 2 поста - горизонтальный монтаж - белый/серебряный штрих",1,515.58000000000004,515.58000000000004]
["774316","Силовая розетка - Valena - 2К - на винтах - 10/16 А - 230/250 В~ - слоновая кость",20,418.82,4188.2]
["774329","ТВ розетка - Valena - звезда - 1.5 дБ - 2400 МГц - слоновая кость",2,1076.68,1076.68]
["774334","Розетка TV-FM - Valena - проходная - 14 дБ - 862 МГц - слоновая кость",8,1142.81,9142.48]
["774331","ТВ розетка - Valena - проходная - 14 дБ - 2400 МГц - слоновая кость",10,919.17,9191.6999999999989]
["774422","Силовая розетка - Valena - 2К+3 - с откидной крышкой - на винтах - 10/16 А - 230/250 В~ - белый",6,351.77,2110.62]
["774438","Телефонная розетка - Valena - RJ11 - 4 контакта - 1 выход - White",17,900.76,7656.46]
["774405","Выключатель двухклавишный - Valena - 10 A - 250 В~ - White",9,707.8,3185.0999999999995]
["774445","Выключатель двухклавишный с индикацией - Valena - 10 A - 250 В~ - White",8,898.29,7186.32]
["774441","Телефонная розетка - Valena - RJ45 - ISDN / Интернет - 8 контактов - 1 выход - White",1,1122.94,1122.94]
["774304","Переключатель с механической блокировкой - Valena - 10 А - 250 В~ - слоновая кость",6,2058.16,6174.48]
["774174","Кнопочный светорегулятор - Valena - 40-600 Вт/40-600 ВА - слоновая кость",1,3703.12,3703.12]
["774319","Выключатель без фиксации перекидной - Valena - со шнуром - 10 A - 250 В~ - слоновая кость",1,692.09,692.09]
["774309","ValenaПерекл.3-х поз.(сл.к)",1,1577.85,1577.85]
["774360","Valena Светорег.50-500Вт гал.",2,2269.5,4539]
["774460","Valena Светор.500Вт гал.бел.",2,2291.11,4582.22]
["774393","Розетка 2х2К+З францйзкий стандарт",10,503.93,5039.3]
["774400","Розеточный блок - Valena - немецкий стандарт - 2х2К+3 - на винтах - укомплектованный - белый",3,564.04999999999995,1692.1499999999999]
["774370","Розеточный блок - Valena - немецкий стандарт - 2х2К+3 - укомплектованный - слоновая кость",3,564.04999999999995,1692.1499999999999]
["774402","Выключатель двухполюсный - Valena - 10 A - 250 В~ - White",5,601.08000000000004,3005.4]
["774394","Силовая розетка - Valena - 2К+3 - с механической системой выталкивания вилки - на винтах - 10/16 А - White",3,926.73,2780.19]
["774353","Рамка - Valena - 3 поста - горизонтальный монтаж - слоновая кость",16,454.92,3639.36]
["774295","Valena Рамка 5п.гор.хром",2,557.1,1114.2]
["774285","Valena Рамка 5п.гор.золото",2,557.1,1114.2]
["774275","Valena Рамка 5п.гор.синий",4,557.1,2228.4]
["774265","Valena Рамка 5п.гор.янтарь",3,557.1,1671.3000000000002]
["774262","Valena Рамка 2п.гор.янтарь",35,273.36,4783.8000000000011]
["774261","Valena Рамка 1п.гор.янтарь",25,165.28,2066]
["774271","Valena Рамка 1п.гор.синий",21,165.28,1735.44]
["774284","Valena Рамка 4п.гор.золото",6,339.6,2037.6000000000001]
["774454","Рамка - Valena - 4 поста - горизонтальный монтаж - белый",2,423.55,847.1]
["774428","Выключатель двойной с подсветкой / переключатель на 2 напр. двухклавишный с подсветкой - Valena - 10 A - 250 В~ - White",41,1331.68,27299.440000000002]
["774410","Выключатель с подсветкой - Valena - 10 A - 250 В~ - White",43,1624.1100000000001,23278.91]
["774401","Выключатель одноклавишный - Valena - 10 A - 250 В~ - White",4,653.43000000000006,871.24]
["774307","Переключатель промежуточный - Valena - 10 A - 250 В~ - слоновая кость",11,1158.4000000000001,6371.2000000000007]
["774305","Выключатель двухклавишный - Valena - 10 A - 250 В~ - слоновая кость",1,353.9,353.9]
["774339","Телефонная розетка - Valena - RJ11 - 4 контакта - 2 выхода - слоновая кость",23,3537.36,20339.82]
["774328","Двойной выключатель с подсветкой - Valena - 10 A - 250 В~ - слоновая кость",27,2663.36,17977.68]
["774412","Выключатель без фиксации с символом лампы - Valena - 10 A - 250 В~ - белый",4,261.62,1046.48]
["774416","Силовая розетка - Valena - 2К - на винтах - 10/16 А - 230/250 В~ - белый",14,418.82,2931.74]
["774301","Выключатель одноклавишный - Valena - 10 A - 250 В~ - слоновая кость",1,217.81,217.81]
["774408","Переключатель на два направления двухклавишный - Valena - 10 A - 250 В~ - White",7,466.79,3267.53]
["774439","Телефонная розетка - Valena - RJ11 - 4 контакта - 2 выхода - White",8,3537.36,7074.7199999999993]
["774406","Переключатель на два направления - Valena - 10 A - 250 В~ - White",3,591.74,887.61]
["774338","Телефонная розетка - Valena - RJ11 - 4 контакта - 1 выход - слоновая кость",1,450.38,450.38]
["776133","Коробка накладная 3п слоновая кость Valena",3,812.64,2437.92]
["774292","Valena Рамка 2п.гор.хром",20,273.36,2733.6000000000004]
["774282","Valena Рамка 2п.гор.золото",10,136.68,1366.8000000000002]
["774272","Valena Рамка 2п.гор.синий",16,136.68,2186.88]
["774291","Valena Рамка 1п.гор.хром",16,165.28,1322.24]
["774308","Переключатель на два направления двухклавишный - Valena - 10 A - 250 В~ - слоновая кость",4,466.79,1867.16]
["774424","Розетка для колонок - Valena - двойная - белый",3,3088.06,4632.09]
["774426","Переключатель на два направления с подсветкой - Valena - 10 A - 250 В~ - White",6,621.95000000000005,3731.7000000000003]
["774435","Розетка TV-FM-SAT - Valena - звезда - 1.5 дБ - 2400 МГц - белый",1,1286.92,1286.92]
["774433","Розетка TV-FM - Valena - оконечная - 10 дБ - 862 МГц - белый",2,1142.81,2285.62]
["774455","Рамка - Valena - 5 постов - горизонтальный монтаж - белый",27,804.71,21727.170000000002]
["774481","Valena Рамка 1п.гор.б-жел.оп",19,82.64,1570.16]
["774461","Рамка - Valena - 1 пост - белый/кристалл",4,183.25,733]
["774333","Розетка TV-FM - Valena - оконечная - 10 дБ - 862 МГц - слоновая кость",1,1142.81,1142.81]
["776181","Накладная коробка - Valena - 1 пост - белый",2,570.28,570.28]
["774342","Лицевая панель для розетки TV-R - Valena - слоновая кость",10,208.78,2087.8000000000002]
["770105","Выключатель двухклавишный - Valena - 10 A - 250 В~ - алюминий",1,446.26,446.26]
["770152","Рамка - Valena - 2 поста - горизонтальный монтаж - алюминий",1,368.74,368.74]
["774293","Valena Рамка 3п.гор.хром",2,213.45,426.9]
["774273","Valena Рамка 3п.гор.синий",2,213.45,426.9]
["774263","Valena Рамка 3п.гор.янтарь",6,213.45,1280.6999999999998]
["774274","Valena Рамка 4п.гор.синий",3,339.6,1018.8000000000001]
["774264","Valena Рамка 4п.гор.янтарь",4,339.6,1358.4]
["771000","Лицевая панель - Galea Life - для одиночной розетки для колонок - Кат. № 7 757 85 - White",9,467.2,4204.8]
["18854","Вставка розетки с з/к ",67,1033.4546879999996,23080.48803199999]
["018828","Вставка розетки с з/к",43,1457.6,31338.400000000001]
["18855","Вставка розетки с з/к ",5,371.26790399999987,1856.3395199999993]
["295111","Клавиша двойная",18,938.13965279999979,5628.8379167999992]
["012628","Выключатель одноклавишный с клавишей",1,1364.8,1364.8]
["026828","Заглушка с опорной платой",5,1130.4000000000001,5652]
["027626","Накладка телефонной розетки TAE+Стерео+USB",7,2126.4,7442.4000000000005]
["018000","Компьютерная розетка cat-5e,1-местная",1,1542.4,1542.4]
["289100","Монтажная коробка Е22 1-местная",1,414.4,414.4]
["2881201","Монтажная коробка Е22 с рамкой Thermoplast",1,800,800]
["45258","Розетка с з/к и контрольной лампой и полем для надписи",1,1979.7209600000001,1979.7209600000001]
["18858","Вставка розетки с з/к ",2,729.43583999999998,1458.87168]
["44858","Розетка с поворотом на 30 градусов",1,883.71583999999996,883.71583999999996]
["046201","Розетка с з/к, защитой от детей и полем для надписи",1,910.4,910.4]
["045201","Розетка с з/к и контрольной лампой и полем для надписи",1,1674.4,1674.4]
["041801","Розетка с з/к  споворот на 30° с защитой от детей",1,830.4,830.4]
["021403","Рамка четырехкратная",72,1905.6,68601.599999999991]
["021303","Рамка тройная",68,1104,37536]
["029528","Клавиша двойная",41,1361.6,27912.799999999999]
["065028","Накладка с поворотной кнопкой для светорегуляторов и эл. потенциометров",50,2211.1999999999998,55280]
["065026","Накладка с поворотной кнопкой для светорегуляторов и эл. потенциометров",46,3361.6,77316.800000000003]
["029628","Клавиша одинарная",56,734.4,20563.199999999997]
["066328","Накладка телефонной розетки",20,1068.8,21376]
["045428","Розетка с з/к и крышкой",3,1387.2,4161.6000000000004]
["650111","Накладка светорегулятора",47,604.89676799999995,28430.148095999997]
["029666","Клавиша одинарная",5,658.4,3292]
["276111","Накладка телефонной розетки TAE",3,274.30983999999995,822.92951999999991]
["93800","Антенная розетка с 4 выводами (Hirschmann EVU 02 F)",2,2743.8729920000001,5487.7459840000001]
["068066","Плата с крышкой с полем для надписи",1,1509.6,1509.6]
["049708","Светодиод синий",4,1019.2,4076.8]
["021117","Рамка одинарная",6,7019.2,21057.599999999999]
["21111","Рамка одинарная",1,2664.4943360000002,2664.4943360000002]
["21154","Рамка одинарная",35,457.94985599999995,8014.1224799999991]
["019100","Опорная плата телефонной розетки",7,443.2,3102.4]
["029603","Клавиша одинарная",41,787.19999999999993,10758.4]
["021101","Рамка одинарная",5,358.4,896]
["066326","Накладка телефонной розетки",9,1278.4000000000001,11505.6]
["021126","Рамка одинарная",1,953.6,953.6]
["21254","Рамка двойная",7,439.08300799999995,3073.5810559999995]
["62111","Рамка для открытого монтажа двойная",1,1846.1144800000002,1846.1144800000002]
["296111","Клавиша одинарная",4,174.77455520000001,699.09822080000004]
["663111","Накладка телефонной розетки",20,537.53918399999998,10750.78368]
["017900","Розетка UAE 3 категории. одинарная",2,1422.4,2844.8]
["027628","Накладка телефонной розетки TAE+Стерео+USB",8,736,5888]
["65054","Накладка светорегулятора",4,626.50022400000012,2506.0008960000005]
["27054","Накладка 50*50 мм для розеток UAE/IAE",2,215.18761599999999,430.37523199999998]
["45454","Вставка розетки с крышкой ",8,725.9118719999999,5807.2949759999992]
["4600","Вставка антенной розетки",6,4228.8,12686.400000000001]
["245100","Розетка сет. 1 местн. Cat.6A IEEE 802.3an",1,1858.4,1858.4]
["110910","Розетка для подключения стереофонических акустических систем",3,1569.1148479999997,4707.3445439999996]
["030000","Вставка светорегулятора 400 Вт",2,3892.8,7785.6]
["111000","Монтажная плата для радиопередатчиков",1,1180.8,1180.8]
["1013100","Кнопочный выключатель на 3 направления без контроллера с полем для надписи",1,8503.2000000000007,8503.2000000000007]
["188111","Розетка с заземляющими контактами",5,314.51312256,1572.5656128000001]
["018803","Вставка розетки с з/к",3,910.4,1365.6]
["018801","Вставка розетки с з/к",1,446.4,446.4]
["045403","Розетка с з/к и крышкой",14,2024,14168]
["029526","Клавиша двойная",1,959.2,959.2]
["029626","Клавиша одинарная",1,668.8,668.8]
["29654","Клавиша одинарная",5,213.30752799999999,1066.53764]
["065003","Накладка с поворотной кнопкой для светорегуляторов и эл. потенциометров",50,1516.8,37920]
["066303","Накладка телефонной розетки",17,1377.6,11709.599999999999]
["027603","Накладка телефонной розетки TAE+Стерео+USB",5,402.4,2012]
["052100","Универсальный радио-передатчик",2,11164,22328]
["021503","Рамка пятикратная",2,1565.6,3131.2]
["21554","Рамка пятикратная",1,1619.1185919999998,1619.1185919999998]
["0214726","Рамка четырехкратная",1,4676,4676]
["0214738","Рамка четырехкратная",1,4335.2,4335.2]
["0212738","Рамка двойная",1,1671.2,1671.2]
["021325","Рамка тройная",1,2263.1999999999998,2263.1999999999998]
["21355","Рамка тройная",3,936.48172799999986,2809.4451839999997]
["021218","Рамка двойная",3,5997.6,17992.800000000003]
["021217","Рамка двойная",1,5996.8,5996.8]
["0212512","Рамка двойная",1,5997.6,5997.6]
["021312","Рамка тройная",3,10000.799999999999,30002.399999999998]
["0213663","Рамка тройная",1,10972,10972]
["0212663","Рамка двойная",1,6598.4,6598.4]
["0211512","Рамка одинарная",1,3509.6,3509.6]
["021118","Рамка одинарная",2,3509.6,7019.2]
["027027","Накладка 50*50 мм для розеток UAE/IAE",1,304,304]
["038000","Встроенный усилитель мощности Tronic 700 Вт",2,18016,36032]
["211111","Рамка одинарная",3,209.25922079999998,627.77766239999994]
["211112","Рамка одинарная",1,209.25922079999998,209.25922079999998]
["021121","Рамка одинарная",1,1436,1436]
["021221","Рамка двойная",1,2227.1999999999998,2227.1999999999998]
["021120","Рамка одинарная",1,1436,1436]
["029620","Клавиша одинарная",3,1209.5999999999999,3628.7999999999997]
["021204","Рамка двойная",1,306.39999999999998,306.39999999999998]
["021104","Рамка одинарная",3,179.2,537.59999999999991]
["021103","Рамка одинарная",3,179.2,537.59999999999991]
["021201","Рамка двойная",4,306.39999999999998,1225.5999999999999]
["018820","Вставка розетки с з/к",1,1684,1684]
["0211726","Рамка одинарная",1,1155.2,1155.2]
["021136","Рамка одинарная",1,1155.2,1155.2]
["0211334","Рамка одинарная",5,1021.6,5108]
["021550","Рамка пятикратная",1,7114.4,7114.4]
["029503","Клавиша двойная",1,498.4,498.4]
["774816","SUNO Розетка 2K бежев",31,109.42,1696.01]
["774001","SUNO Выключатель белый",35,408.40000000000003,1786.7499999999998]
["774021","SUNO Розетка со шт.2К+З белая",1,119.19,119.19]
["774601","SUNO Выключатель сл. кость",15,255.25,765.74999999999989]
["774639","SUNO Розетки  2хRJ11 сл.к.",42,1236.96,12988.079999999998]
["774097","SUNO Р. TV \"звезда\" белая",54,765.48,10333.980000000001]
["774897","SUNO Р. TV \"звезда\" бежев.",53,765.48,10142.61]
["774005","SUNO Выкл.двойн.белый",30,440.65,2643.8999999999996]
["774026","SUNOПерекл.на 2 н.с подсв.бел.",18,834.04,3753.18]
["774801","SUNO Выключатель бежев",33,255.25,1684.6499999999999]
["774642","SUNO Рамка 2поста сл.к.",37,181.53,2238.8700000000003]
["774043","SUNO Рамка 3поста белая",30,197.68,2965.2000000000003]
["774620","SUNO Розетка 2К+З сл. Кость",1,65.400000000000006,65.400000000000006]
["774641","SUNO Рамка 1пост сл.к.",28,79.53,742.28]
["774605","SUNO Выкл.двойн.сл.кость",20,352.52,1762.6]
["774041","SUNO Рамка 1пост белая",9,79.53,238.59000000000003]
["774039","SUNO Розетки 2хRJ11белые",6,618.48,1855.44]
["774072","SUNO RJ45 UTP Cat. 5е 1в бел",12,4053.18,16212.72]
["774042","SUNO Рамка 2поста белая",14,121.02,847.14]
["774843","SUNO Рамка 3поста бежев.",31,197.68,3064.04]
["774661","Suno светорег 400Вт сл.к",1,880.38,880.38]
["774643","SUNO Рамка 3поста сл.к.",11,98.84,1087.24]
["774644","SUNO Рамка 4поста сл.к.",4,196.49,785.96]
["774044","SUNO Рамка 4поста бел.",3,196.49,589.47]
["774842","SUNO Рамка 2поста бежев.",17,121.02,1028.67]
["774841","SUNO Рамка 1пост бежев.",26,53.02,689.26]
["774638","SUNO Р. SUNO RJ11 сл.к. ",28,467.06,6538.84]
["774608","SUNOПер.дв.н/два напр. сл.к.",10,195.94,1959.4]
["774633","SUNO Р. TV-FM оконечная сл.к.",24,1570.8,9424.7999999999993]
["774808","SUNO Пер.дв.н/два напр.бежев",11,391.88,2155.34]
["774805","SUNO Выключатель двойн.бежев",30,352.52,2643.8999999999996]
["774038","SUNO Р. SUNO RJ11белая",10,467.06,2335.3000000000002]
["774806","SUNO Перекл.на два напр.бежев",11,173.62,954.91000000000008]
["774006","SUNO Перекл.на 2 напр.белый",9,86.81,781.29]
["774832","SUNO Р. TV-FM \"звезда\" бежев.",8,344.68,2757.44]
["774839","SUNO Розетки 2хRJ11бежев.",21,927.72,6494.04]
["774844","SUNO Рамка 4поста беж",10,196.49,1964.9]
["774813","SUNO Кнопка с подсв.220В беж.",10,212.94,2129.4]
["774826","SUNO Перекл.на 2н.с подсв.беж.",6,417.02,1251.06]
["774838","SUNO Розетка RJ11бежев.",28,467.06,6538.84]
["774697","SUNO Р. TV\"звезда\" сл.к.",2,191.37,382.74]
["774833","SUNO Р. TV-FM оконечная бежев.",8,392.7,3141.6]
["774672","SUNO RJ45 UTP Cat. 5е 1в слоновая кость",3,1125.48,3376.44]
["774817","SUNO Светорегулятор 400Вт беж.",4,917.33,3669.32]
["774017","SUNO Светорегулятор 400Вт бел.",7,917.33,6421.31]
["774626","SUNOПерекл.на 2н.с подсв.сл.к.",15,208.51,3127.6499999999996]
["774033","SUNO Р. TV-FM оконечная белая",5,392.7,1963.5]
["774034","SUNO Р. TV-FM проходная белая",5,392.7,1963.5]
["774008","SUNOПер.дв.н/два напр.белый",5,195.94,979.7]
["774013","SUNO Кнопка с подсв.220В бел.",10,212.94,2129.4]
["773660","Рамка - Cariva - 1 пост - белый",117,129.34,7566.3899999999994]
["773672","Cariva Рамка 2 поста алюм.",10,77.63,776.3]
["773752","Рамка - Cariva - 2 поста - горизонтальный/вертикальный монтаж - слоновая кость",53,104.5,5538.5]
["773652","Рамка - Cariva - 2 поста - горизонтальный/вертикальный монтаж - белый",7,209,731.5]
["773653","Рамка - Cariva - 3 поста - горизонтальный/вертикальный монтаж - белый",2,360.7,360.7]
["773753","Рамка - Cariva - 3 поста - горизонтальный/вертикальный монтаж - слоновая кость",38,360.7,6853.2999999999993]
["773754","Рамка - Cariva - 4 поста - горизонтальный/вертикальный монтаж - слоновая кость",30,656.74,9851.0999999999985]
["773680","ТВ розетка - Cariva - проходная - 14 дБ - 2150/2400 МГц - белый",15,2042.31,10211.549999999999]
["773621","Розетка - Cariva - 2К+3 - с защитными шторками - 16 А - 250 В~ - белый",10,261.33999999999997,2613.3999999999996]
["773638","Телефонная розетка - Cariva - RJ11 - 4 контакта - 1 выход - White",58,2358.9500000000003,27363.820000000007]
["773657","Переключатель на 2 направления - Cariva - автоматические клеммы - 10 АX - 250 В~ - белый",3,235.16,705.48]
["773673","Рамка - Cariva - 3 поста - горизонтальный/вертикальный монтаж - алюминий",5,554.73,2773.65]
["773693","Рамка - Cariva - 3 поста - горизонтальный/вертикальный монтаж - жемчужно-серый",4,501.8,2007.2]
["773663","Cariva Рамка 3п.  мат. Зол. ",6,120.6,723.59999999999991]
["773683","Рамка - Cariva - 3 поста - горизонтальный/вертикальный монтаж - песок",6,501.8,3010.8]
["773654","Рамка - Cariva - 4 поста - горизонтальный/вертикальный монтаж - белый",36,328.37,11821.32]
["773664","Рамка - Cariva - 4 поста - горизонтальный/вертикальный монтаж - матовое золото",4,824.69,3298.76]
["773674","Рамка - Cariva - 4 поста - горизонтальный/вертикальный монтаж - алюминий",2,824.69,1649.38]
["773684","Рамка - Cariva - 4 поста - горизонтальный/вертикальный монтаж - песок",4,746.04,2984.16]
["773694","CarivaРамка 4 поста жемч-сер",4,162.99,651.96]
["773627","Розетка - Cariva - 2х2К+3 - немецкий стандарт - 16 А - 250 В~ - белый",7,424.77,2973.39]
["773779","ТВ розетка - Cariva - оконечная - 10 дБ - 2150/2400 МГц - слоновая кость",17,1314.42,11172.57]
["773757","Переключатель на 2 направления - Cariva - автоматические клеммы - 10 АX - 250 В~ - слоновая кость",21,470.32,4938.3599999999997]
["773758","Выключатель - Cariva - двухклавишный - автоматические клеммы - 10 А - 250 В~ - слоновая кость",58,1276.0999999999999,14802.760000000002]
["773738","Телефонная розетка - Cariva - RJ11 - 4 контакта - 1 выход - слоновая кость",35,1887.36,16514.400000000001]
["773678","ТВ розетка - Cariva - звезда - 1.5 дБ - 2400 МГц - белый",32,1080.3600000000001,11523.84]
["773741","Информационная розетка - Cariva - RJ45 - категория 6 UTP - слоновая кость",8,971.44,7771.52]
["773616","Розетка - Cariva - 2К - 16 А - 250 В~ - белый",44,316.82,6970.04]
["773659","Розетка - Cariva - 2К+3 - немецкий стандарт - 16 А - 250 В~ - белый",45,751.04,8449.1999999999989]
["773756","Выключатель - Cariva - автоматические клеммы - 10 А - 250 В~ - слоновая кость",37,928.75,6872.75]
["773656","Выключатель - Cariva - автоматические клеммы - 10 А - 250 В~ - белый",7,743,1300.25]
["773610","Выключатель - Cariva - с подсветкой - автоматические клеммы - 10 АX - 250 В~ - белый",23,1012.92,7765.72]
["773658","Выключатель - Cariva - автоматические клеммы - 10 А - 250 В~ - белый",5,765.66,1276.0999999999999]
["773739","Телефонная розетка - Cariva - RJ11 - 4 контакта - 2 выхода - слоновая кость",28,1291.8800000000001,18086.32]
["773716","Розетка - Cariva - 2К - 16 А - 250 В~ - слоновая кость",168,633.64,26612.880000000001]
["773759","Розетка - Cariva - 2К+3 - немецкий стандарт - 16 А - 250 В~ - слоновая кость",6,187.76,1126.56]
["773710","Выключатель - Cariva - с подсветкой - автоматические клеммы - 10 АX - 250 В~ - слоновая кость",58,675.28,19583.12]
["773727","Розетка - Cariva - 2х2К+3 - немецкий стандарт - 16 А - 250 В~ - слоновая кость",35,849.54,14866.949999999999]
["773691","Рамка - Cariva - 1 пост - жемчужно-серый",18,200.71,3612.78]
["773681","Рамка - Cariva - 1 пост - песок",21,200.71,4214.91]
["773639","Телефонная розетка - Cariva - RJ11 - 4 контакта - 2 выхода - White",12,1291.8800000000001,7751.2800000000007]
["773778","ТВ розетка - Cariva - звезда - 1.5 дБ - 2400 МГц - слоновая кость",33,360.12,11883.960000000001]
["773780","ТВ розетка - Cariva - проходная - 14 дБ - 2150/2400 МГц - слоновая кость",20,680.77,13615.4]
["773644","3-постовой моноблок - Cariva - 250 В~ - белый",3,1010.44,3031.32]
["773744","3-постовой моноблок - Cariva - 250 В~ - слоновая кость",2,213.21,426.42]
["773760","Рамка - Cariva - 1 пост - слоновая кость",38,64.67,2457.46]
["773661","Рамка - Cariva - 1 пост - матовое золото",17,225.53,3834.01]
["773671","Рамка - Cariva - 1 пост - алюминий",19,225.53,4285.07]
["773692","Рамка - Cariva - 2 поста - горизонтальный/вертикальный монтаж - жемчужно-серый",8,323.06,2584.48]
["773682","Рамка - Cariva - 2 поста - горизонтальный/вертикальный монтаж - песок",10,323.06,3230.6]
["773642","Информационная розетка - Cariva - 2xRJ45 - категория 6 UTP - White",2,1127.43,2254.86]
["MGU5.492.25ZD","UNICA РОЗЕТКА телефонная, RJ11, одиночная, 4 контакта, БЕЖЕВЫЙ",34,496.45440000000002,16879.4496]
["MGU5.203.18ZD","UNICA ПЕРЕКЛЮЧАТЕЛЬ 1-клавишный, сх. 6, 10 АX, 250 В, БЕЛЫЙ",21,781.85520000000008,8209.4796000000006]
["MGU5.203.18NZD","UNICA ПЕРЕКЛЮЧАТЕЛЬ 1-клавишный, с подсветкой, сх. 6а, БЕЛЫЙ",22,2871.5147999999999,21057.775200000004]
["MGU5.9090.18ZD","UNICA РОЗЕТКА телефонная, RJ11, двойная, 4 контакта, БЕЛЫЙ",12,892.94399999999996,10715.328]
["MGU5.201.18ZD","UNICA ВЫКЛЮЧАТЕЛЬ 1-клавишный, сх. 1, 10 АX, 250 В, БЕЛЫЙ",57,1956.6035999999999,15932.343600000002]
["MGU5.452.18ZD","UNICA РОЗЕТКА TV/ FM, оконечная, БЕЛЫЙ",7,1397.52,9782.64]
["MGU5.486.25ZD","UNICA АУДИОРОЗЕТКА, БЕЖЕВЫЙ",6,876.09600000000012,5256.5760000000009]
["MGU5.0303.25NZD","UNICA ПЕРЕКЛЮЧАТЕЛЬ 2-клавишный, 2 модуля, с подсветкой, 2 х сх. 6а, БЕЖЕВЫЙ",14,5278.9967999999999,24635.3184]
["MGU5.203.25ZD","UNICA ПЕРЕКЛЮЧАТЕЛЬ 1-клавишный, сх. 6, 10 АX, 250 В, БЕЖЕВЫЙ",7,390.92760000000004,2736.4932000000003]
["MGU5.033.18ZD","UNICA РОЗЕТКА без заземления, со шторками, 16 А, 250 В, БЕЛЫЙ",20,383.28120000000001,7665.6239999999998]
["MGU5.203.25NZD","UNICA ПЕРЕКЛЮЧАТЕЛЬ 1-клавишный, с подсветкой, сх. 6а, БЕЖЕВЫЙ",7,957.17160000000001,6700.2012000000004]
["MGU5.211.18ZD","UNICA ВЫКЛЮЧАТЕЛЬ 2-клавишный, сх. 5, 10 АX, 250 В, БЕЛЫЙ",33,1887.8183999999999,20766.002399999998]
["MGU6.004.866","UNICA ХАМЕЛЕОН РАМКА 2-постовая, горизонтальная, БЕЛЫЙ/ ФИСТАШКОВЫЙ",12,2010.9335999999998,8043.7343999999994]
["MGU6.004.854","UNICA ХАМЕЛЕОН РАМКА 2-постовая, горизонтальная, БЕЛЫЙ/ ГОЛУБОЙ ЛЕД",10,809.01599999999996,8090.16]
["MGU6.002.870","UNICA ХАМЕЛЕОН РАМКА 1-постовая, БЕЛЫЙ/ МОРСКАЯ ВОЛНА",12,411.23680000000002,4934.8415999999997]
["MGU6.004.576","UNICA ХАМЕЛЕОН РАМКА 2-постовая, горизонтальная, БЕЖЕВЫЙ/ ЛИЛОВЫЙ",7,670.31119999999999,4692.1783999999998]
["MGU6.004.25","UNICA ХАМЕЛЕОН РАМКА 2-постовая, горизонтальная, БЕЖЕВЫЙ",25,1067.1232,6669.52]
["MGU6.002.25","UNICA ХАМЕЛЕОН РАМКА 1-постовая, БЕЖЕВЫЙ",32,442.9776,4725.0944]
["MGU6.004.870","UNICA ХАМЕЛЕОН РАМКА 2-постовая, горизонтальная, БЕЛЫЙ/ МОРСКАЯ ВОЛНА",5,670.31119999999999,3351.556]
["MGU6.004.18","UNICA ХАМЕЛЕОН РАМКА 2-постовая, горизонтальная, БЕЛЫЙ",3,266.7808,800.3424]
["MGU6.004.872","UNICA ХАМЕЛЕОН РАМКА 2-постовая, горизонтальная, БЕЛЫЙ/ ГРАНАТ",2,1340.6224,1340.6224]
["MGU6.002.867","UNICA ХАМЕЛЕОН РАМКА 1-постовая, БЕЛЫЙ/ ПЕСЧАНЫЙ",5,822.47360000000003,2056.1840000000002]
["MGU2.002.18M","UNICA РАМКА моноблок, 1-постовая, БЕЛЫЙ",12,152.88,917.28]
["MGU6.002.874","UNICA ХАМЕЛЕОН РАМКА 1-постовая, БЕЛЫЙ/ КОРИЧНЕВЫЙ",1,411.23680000000002,411.23680000000002]
["MGU6.002.551","UNICA ХАМЕЛЕОН РАМКА 1-постовая, БЕЖЕВЫЙ/ ТЕРРАКОТОВЫЙ",4,490.20400000000006,1960.8160000000003]
["MGU6.002.542","UNICA ХАМЕЛЕОН РАМКА 1-постовая, БЕЖЕВЫЙ/ ИНДИГО",7,490.20400000000006,3431.4280000000003]
["MGU6.002.876","UNICA ХАМЕЛЕОН РАМКА 1-постовая, БЕЛЫЙ/ ЛИЛОВЫЙ",2,411.23680000000002,822.47360000000003]
["MGU8.006.18","UNICA КОРОБКА для открытой установки, 3-постовая, БЕЛЫЙ",5,1522.1520000000003,3805.380000000001]
["MGU6.002.854","UNICA ХАМЕЛЕОН РАМКА 1-постовая, БЕЛЫЙ/ ГОЛУБОЙ ЛЕД",11,490.20400000000006,5392.2440000000006]
["MGU6.004.842","UNICA ХАМЕЛЕОН РАМКА 2-постовая, горизонтальная, БЕЛЫЙ/ ИНДИГО",5,809.01599999999996,4045.08]
["MGU6.004.551","UNICA ХАМЕЛЕОН РАМКА 2-постовая, горизонтальная, БЕЖЕВЫЙ/ ТЕРРАКОТОВЫЙ",2,809.01599999999996,1618.0319999999999]
["MGU6.004.554","UNICA ХАМЕЛЕОН РАМКА 2-постовая, горизонтальная, БЕЖЕВЫЙ/ ГОЛУБОЙ ЛЕД",2,809.01599999999996,1618.0319999999999]
["MGU6.004.524","UNICA ХАМЕЛЕОН РАМКА 2-постовая, горизонтальная, БЕЖЕВЫЙ/ ШАМПАНЬ",2,809.01599999999996,1618.0319999999999]
["MGU6.002.863","UNICA ХАМЕЛЕОН РАМКА 1-постовая, БЕЛЫЙ/ ЗЕЛЕНОЕ ЯБЛОКО",2,822.47360000000003,822.47360000000003]
["MGU6.002.866","UNICA ХАМЕЛЕОН РАМКА 1-постовая, БЕЛЫЙ/ ФИСТАШКОВЫЙ",23,822.47360000000003,9458.4464000000007]
["MGU6.006.25","UNICA ХАМЕЛЕОН РАМКА 3-постовая, горизонтальная, БЕЖЕВЫЙ",7,1432.2983999999999,3342.0295999999998]
["MGU6.008.869","UNICA ХАМЕЛЕОН РАМКА 4-постовая, горизонтальная, БЕЛЫЙ/ ОРАНЖЕВЫЙ",2,1490.5176000000001,2981.0352000000003]
["MGU6.008.870","UNICA ХАМЕЛЕОН РАМКА 4-постовая, горизонтальная, БЕЛЫЙ/ МОРСКАЯ ВОЛНА",1,1490.5176000000001,1490.5176000000001]
["MGU6.008.851","UNICA ХАМЕЛЕОН РАМКА 4-постовая, горизонтальная, БЕЛЫЙ/ ТЕРРАКОТОВЫЙ",1,1776.528,1776.528]
["MGU6.008.18","UNICA ХАМЕЛЕОН РАМКА 4-постовая, горизонтальная, БЕЛЫЙ",6,1094.2048,3282.6143999999999]
["MGU6.008.25","UNICA ХАМЕЛЕОН РАМКА 4-постовая, горизонтальная, БЕЖЕВЫЙ",6,547.10239999999999,3282.6143999999999]
["MGU6.008.566","UNICA ХАМЕЛЕОН РАМКА 4-постовая, горизонтальная, БЕЖЕВЫЙ/ ФИСТАШКОВЫЙ",1,1490.5176000000001,1490.5176000000001]
["MGU6.008.567","UNICA ХАМЕЛЕОН РАМКА 4-постовая, горизонтальная, БЕЖЕВЫЙ/ ПЕСЧАНЫЙ",2,1490.5176000000001,2981.0352000000003]
["MGU6.008.572","UNICA ХАМЕЛЕОН РАМКА 4-постовая, горизонтальная, БЕЖЕВЫЙ/ ГРАНАТ",1,1490.5176000000001,1490.5176000000001]
["MGU6.006.869","UNICA ХАМЕЛЕОН РАМКА 3-постовая, горизонтальная, БЕЛЫЙ/ ОРАНЖЕВЫЙ",4,1138.9560000000001,4555.8240000000005]
["MGU6.006.842","UNICA ХАМЕЛЕОН РАМКА 3-постовая, горизонтальная, БЕЛЫЙ/ ИНДИГО",2,1357.4080000000001,2714.8160000000003]
["MGU6.006.567","UNICA ХАМЕЛЕОН РАМКА 3-постовая, горизонтальная, БЕЖЕВЫЙ/ ПЕСЧАНЫЙ",1,1138.9560000000001,1138.9560000000001]
["MGU6.004V.551","UNICA ХАМЕЛЕОН РАМКА 2-постовая, вертикальная, БЕЖЕВЫЙ/ ТЕРРАКОТОВЫЙ",4,836.00400000000002,3344.0160000000001]
["MGU6.004.567","UNICA ХАМЕЛЕОН РАМКА 2-постовая, горизонтальная, БЕЖЕВЫЙ/ ПЕСЧАНЫЙ",4,670.31119999999999,2681.2447999999999]
["MGU6.006.572","UNICA ХАМЕЛЕОН РАМКА 3-постовая, горизонтальная, БЕЖЕВЫЙ/ ГРАНАТ",2,1138.9560000000001,2277.9120000000003]
["MGU6.004V.869","UNICA ХАМЕЛЕОН РАМКА 2-постовая, вертикальная, БЕЛЫЙ/ ОРАНЖЕВЫЙ",3,701.1472,2103.4416000000001]
["MGU6.004.869","UNICA ХАМЕЛЕОН РАМКА 2-постовая, горизонтальная, БЕЛЫЙ/ ОРАНЖЕВЫЙ",5,670.31119999999999,3351.556]
["MGU6.002.842","UNICA ХАМЕЛЕОН РАМКА 1-постовая, БЕЛЫЙ/ ИНДИГО",27,980.40800000000013,13235.508000000002]
["MGU6.002.872","UNICA ХАМЕЛЕОН РАМКА 1-постовая, БЕЛЫЙ/ ГРАНАТ",5,411.23680000000002,2056.1840000000002]
["MGU6.002.824","UNICA ХАМЕЛЕОН РАМКА 1-постовая, БЕЛЫЙ/ ШАМПАНЬ",11,490.20400000000006,5392.2440000000006]
["MGU6.004.824","UNICA ХАМЕЛЕОН РАМКА 2-постовая, горизонтальная, БЕЛЫЙ/ ШАМПАНЬ",2,809.01599999999996,1618.0319999999999]
["MGU2.008.18","UNICA РАМКА с декоративным элементом, 4-постовая, БЕЛЫЙ",7,736.77760000000012,2578.7216000000008]
["MGU5.201.18NZD","UNICA ВЫКЛЮЧАТЕЛЬ 1-клавишный, с подсветкой, сх. 1а, БЕЛЫЙ",4,693.06840000000011,2772.2736000000004]
["MGU5.211.25ZD","UNICA ВЫКЛЮЧАТЕЛЬ 2-клавишный, сх. 5, 10 АX, 250 В, БЕЖЕВЫЙ",10,1887.8183999999999,6292.7279999999992]
["MGU8.002.18","UNICA КОРОБКА для открытой установки, 1-постовая, БЕЛЫЙ",2,658.13040000000001,658.13040000000001]
["MGU5.501.18ZD","UNICA ТЕРМОСТАТ электронный, 8 А, встроенный термодатчик, БЕЛЫЙ",2,7268.4000000000005,14536.800000000001]
["MGU5.524.18ZD","UNICA ДАТЧИК ДВИЖЕНИЯ без нейтр. провод., 40-300 Вт, 2-провод. подключ., БЕЛЫЙ",1,10969.560000000001,10969.560000000001]
["MGU5.524.25ZD","MGUnica Беж Датчик движения 40- 500VA",1,5465,5465]
["MGU5.511.18ZD","UNICA ДИММЕР пов.-нажим., для ламп накал. и галог., 2-провод. подключ., БЕЛЫЙ",1,4673.16,4673.16]
["MGU5.486.18ZD","UNICA АУДИОРОЗЕТКА, БЕЛЫЙ",10,1752.1920000000002,8760.9600000000009]
["MGU5.036.25ZD","UNICA РОЗЕТКА с заземлением, без шторок, 16 А, 250 В, БЕЖЕВЫЙ",3,270.99360000000001,812.98080000000004]
["MGU5.421.18ZD","UNICA РОЗЕТКА компьютерная, RJ45, одиночная, с полем для надписи, кат. 5е, БЕЛЫЙ",7,2451.6000000000004,8580.6000000000022]
["MGU5.201.25ZD","UNICA ВЫКЛЮЧАТЕЛЬ 1-клавишный, сх. 1, 10 АX, 250 В, БЕЖЕВЫЙ",8,559.02960000000007,2236.1184000000003]
["MGU6.004.566","UNICA ХАМЕЛЕОН РАМКА 2-постовая, горизонтальная, БЕЖЕВЫЙ/ ФИСТАШКОВЫЙ",8,670.31119999999999,5362.4895999999999]
["MGU6.004.851","UNICA ХАМЕЛЕОН РАМКА 2-постовая, горизонтальная, БЕЛЫЙ/ ТЕРРАКОТОВЫЙ",3,809.01599999999996,2427.0479999999998]
["MGU6.002.869","UNICA ХАМЕЛЕОН РАМКА 1-постовая, БЕЛЫЙ/ ОРАНЖЕВЫЙ",29,822.47360000000003,11925.867200000001]
["MGU4.000.54","UNICA ДЕКОРАТИВНЫЙ ЭЛЕМЕНТ, ГОЛУБОЙ ЛЕД",19,346.61520000000002,3292.8444000000004]
["MGU6.004.867","UNICA ХАМЕЛЕОН РАМКА 2-постовая, горизонтальная, БЕЛЫЙ/ ПЕСЧАНЫЙ",6,670.31119999999999,4021.8671999999997]
["MGU6.002.871","UNICA ХАМЕЛЕОН РАМКА 1-постовая, БЕЛЫЙ/ КАКАО",1,411.23680000000002,411.23680000000002]
["MGU6.006.871","UNICA ХАМЕЛЕОН РАМКА 3-постовая, горизонтальная, БЕЛЫЙ/ КАКАО",1,1138.9560000000001,1138.9560000000001]
["MGU6.002.554","UNICA ХАМЕЛЕОН РАМКА 1-постовая, БЕЖЕВЫЙ/ ГОЛУБОЙ ЛЕД",2,490.20400000000006,980.40800000000013]
["MGU6.002.566","UNICA ХАМЕЛЕОН РАМКА 1-постовая, БЕЖЕВЫЙ/ ФИСТАШКОВЫЙ",4,411.23680000000002,1644.9472000000001]
["MGU6.002.570","UNICA ХАМЕЛЕОН РАМКА 1-постовая, БЕЖЕВЫЙ/ МОРСКАЯ ВОЛНА",1,411.23680000000002,411.23680000000002]
["MGU6.002.563","UNICA ХАМЕЛЕОН РАМКА 1-постовая, БЕЖЕВЫЙ/ ЗЕЛЕНОЕ ЯБЛОКО",1,411.23680000000002,411.23680000000002]
["MGU6.002.572","UNICA ХАМЕЛЕОН РАМКА 1-постовая, БЕЖЕВЫЙ/ ГРАНАТ",1,411.23680000000002,411.23680000000002]
["MGU6.006.576","UNICA ХАМЕЛЕОН РАМКА 3-постовая, горизонтальная, БЕЖЕВЫЙ/ ЛИЛОВЫЙ",4,1138.9560000000001,4555.8240000000005]
["MGU8.002.25","UNICA КОРОБКА для открытой установки, 1-постовая, БЕЖЕВЫЙ",1,329.0652,329.0652]
["MGU5.037.18TAZD","UNICA РОЗЕТКА с заземлением, со шторками, с крышкой, 16 А, 250 В, БЕЛЫЙ",4,612.53279999999995,2450.1311999999998]
["MGU5.492.18ZD","UNICA РОЗЕТКА телефонная, RJ11, одиночная, 4 контакта, БЕЛЫЙ",3,496.45440000000002,1489.3632]
["MGU5.205.18NZD","UNICA ПЕРЕКЛЮЧАТЕЛЬ 1-клавишный, перекрестный, с подсветкой, сх. 7а, БЕЛЫЙ",1,1248.1344000000001,1248.1344000000001]
["MGU5.201.25NZD","UNICA ВЫКЛЮЧАТЕЛЬ 1-клавишный, с подсветкой, сх. 1а, БЕЖЕВЫЙ",1,693.06840000000011,693.06840000000011]
["MGU5.213.18ZD","UNICA ПЕРЕКЛЮЧАТЕЛЬ 2-клавишный, 2 х сх. 6, 10 АX, 250 В, БЕЛЫЙ",6,788.94,4733.6400000000003]
["MGU5.0303.18NZD","UNICA ПЕРЕКЛЮЧАТЕЛЬ 2-клавишный, 2 модуля, с подсветкой, 2 х сх. 6а, БЕЛЫЙ",11,3519.3312000000001,19356.321599999999]
["MGU5.213.25ZD","UNICA ПЕРЕКЛЮЧАТЕЛЬ 2-клавишный, 2 х сх. 6, 10 АX, 250 В, БЕЖЕВЫЙ",3,788.94,2366.8200000000002]
["MGU5.9090.25ZD","UNICA РОЗЕТКА телефонная, RJ11, двойная, 4 контакта, БЕЖЕВЫЙ",1,892.94399999999996,892.94399999999996]
["MGU5.0101.25NZD","UNICA ВЫКЛЮЧАТЕЛЬ 2-клавишный, 2 модуля, с подсветкой, 2 х сх. 1а, БЕЖЕВЫЙ",1,1536.7428000000002,1536.7428000000002]
["MGU5.456.25ZD","UNICA РОЗЕТКА R-TV/ SAT, проходная, БЕЖЕВЫЙ",1,1928.88,1928.88]
["MGU6.004.569","UNICA ХАМЕЛЕОН РАМКА 2-постовая, горизонтальная, БЕЖЕВЫЙ/ ОРАНЖЕВЫЙ",4,670.31119999999999,2681.2447999999999]
["MGU6.004.563","UNICA ХАМЕЛЕОН РАМКА 2-постовая, горизонтальная, БЕЖЕВЫЙ/ ЗЕЛЕНОЕ ЯБЛОКО",3,670.31119999999999,2010.9335999999998]
["MGU4.000.51","UNICA ДЕКОРАТИВНЫЙ ЭЛЕМЕНТ, ТЕРРАКОТОВЫЙ",2,187.25040000000001,374.50080000000003]
["MGU4.000.59","UNICA ДЕКОРАТИВНЫЙ ЭЛЕМЕНТ, КРЕМОВЫЙ",1,70.707599999999999,70.707599999999999]
["MGU4.000.42","UNICA ДЕКОРАТИВНЫЙ ЭЛЕМЕНТ, ИНДИГО",7,187.25040000000001,1310.7528000000002]