{"text_format":"1","workbook":"xlsx","n_sheets":2,"sheets":["СВОД","кабинет"],"not_rendered":{"charts":0,"images":0,"macros":0,"external_links":0,"defined_names":2,"comments":0,"pivot_tables":0},"unopened":[],"bounds":{"document_bytes":16777216,"sheet_cells":100000,"rows_first":2000,"rows_last":500,"rows_between":2000,"halvings":0,"cell_chars":16384,"cell_head_chars":4096},"cells_cut":0,"cells_raw":0,"read":"whole","date_system":"1900"}

{"sheet":"СВОД","index":0,"n_rows":34,"n_cols":11,"rows_kept":34,"cut":false,"hidden":false,"merged":[[32,0,32,2],[32,4,32,5],[32,9,32,10],[35,0,35,2],[36,0,36,2],[36,4,36,5],[33,0,33,1],[1,5,1,10],[2,2,2,5],[2,6,2,7],[27,0,29,4],[27,5,29,5],[4,0,6,0],[5,3,6,3],[5,4,6,4],[5,5,6,5],[4,1,6,1],[4,2,6,2],[4,3,4,5],[4,6,4,10],[5,6,6,6],[5,7,5,8]]}
[]
[]
[null,null,"ОТЧЕТ ПО койко-дням",null,null,null,"ЯНВАРЬ",null,"2019г."]
[]
["№ п/п"]
[]
[]
[1,{"$f":"IFERROR(INDIRECT(\"'\"&TRIM(RIGHTB(SUBSTITUTE(INDEX(Ю,ROW(A2)),\"]\",REPT(\" \",30)),31))&\"'!K2\"),\"\")","v":""},{"$f":"IFERROR(INDIRECT(\"'\"&TRIM(RIGHTB(SUBSTITUTE(INDEX(Ю,ROW(A2)),\"]\",REPT(\" \",30)),31))&\"'!K3\"),\"\")","v":""},{"$f":"IFERROR(INDIRECT(\"'\"&TRIM(RIGHTB(SUBSTITUTE(INDEX(Ю,ROW(A2)),\"]\",REPT(\" \",30)),31))&\"'!E42\"),\"\")","v":""},{"$f":"IFERROR(INDIRECT(\"'\"&TRIM(RIGHTB(SUBSTITUTE(INDEX(Ю,ROW(A2)),\"]\",REPT(\" \",30)),31))&\"'!F42\"),\"\")","v":""},{"$f":"IFERROR(INDIRECT(\"'\"&TRIM(RIGHTB(SUBSTITUTE(INDEX(Ю,ROW(A2)),\"]\",REPT(\" \",30)),31))&\"'!G42\"),\"\")","v":""},{"$f":"IFERROR(INDIRECT(\"'\"&TRIM(RIGHTB(SUBSTITUTE(INDEX(Ю,ROW(B2)),\"]\",REPT(\" \",30)),31))&\"'!N6\"),\"\")","v":""},{"$f":"IFERROR(INDIRECT(\"'\"&TRIM(RIGHTB(SUBSTITUTE(INDEX(Ю,ROW(C2)),\"]\",REPT(\" \",30)),31))&\"'!H42\"),\"\")","v":""},{"$f":"IFERROR(INDIRECT(\"'\"&TRIM(RIGHTB(SUBSTITUTE(INDEX(Ю,ROW(D2)),\"]\",REPT(\" \",30)),31))&\"'!I42\"),\"\")","v":""},{"$f":"IFERROR(INDIRECT(\"'\"&TRIM(RIGHTB(SUBSTITUTE(INDEX(Ю,ROW(E2)),\"]\",REPT(\" \",30)),31))&\"'!J42\"),\"\")","v":""},{"$f":"IFERROR(INDIRECT(\"'\"&TRIM(RIGHTB(SUBSTITUTE(INDEX(Ю,ROW(F2)),\"]\",REPT(\" \",30)),31))&\"'!K42\"),\"\")","v":""}]
[{"$f":"A8+1","v":2},{"$f":"IFERROR(INDIRECT(\"'\"&TRIM(RIGHTB(SUBSTITUTE(INDEX(Ю,ROW(A3)),\"]\",REPT(\" \",30)),31))&\"'!K2\"),\"\")","v":""},{"$f":"IFERROR(INDIRECT(\"'\"&TRIM(RIGHTB(SUBSTITUTE(INDEX(Ю,ROW(A3)),\"]\",REPT(\" \",30)),31))&\"'!K3\"),\"\")","v":""},{"$f":"IFERROR(INDIRECT(\"'\"&TRIM(RIGHTB(SUBSTITUTE(INDEX(Ю,ROW(A3)),\"]\",REPT(\" \",30)),31))&\"'!E42\"),\"\")","v":""},{"$f":"IFERROR(INDIRECT(\"'\"&TRIM(RIGHTB(SUBSTITUTE(INDEX(Ю,ROW(A3)),\"]\",REPT(\" \",30)),31))&\"'!F42\"),\"\")","v":""},{"$f":"IFERROR(INDIRECT(\"'\"&TRIM(RIGHTB(SUBSTITUTE(INDEX(Ю,ROW(A3)),\"]\",REPT(\" \",30)),31))&\"'!G42\"),\"\")","v":""},{"$f":"IFERROR(INDIRECT(\"'\"&TRIM(RIGHTB(SUBSTITUTE(INDEX(Ю,ROW(B3)),\"]\",REPT(\" \",30)),31))&\"'!N6\"),\"\")","v":""},{"$f":"IFERROR(INDIRECT(\"'\"&TRIM(RIGHTB(SUBSTITUTE(INDEX(Ю,ROW(C3)),\"]\",REPT(\" \",30)),31))&\"'!H42\"),\"\")","v":""},{"$f":"IFERROR(INDIRECT(\"'\"&TRIM(RIGHTB(SUBSTITUTE(INDEX(Ю,ROW(D3)),\"]\",REPT(\" \",30)),31))&\"'!I42\"),\"\")","v":""},{"$f":"IFERROR(INDIRECT(\"'\"&TRIM(RIGHTB(SUBSTITUTE(INDEX(Ю,ROW(E3)),\"]\",REPT(\" \",30)),31))&\"'!J42\"),\"\")","v":""},{"$f":"IFERROR(INDIRECT(\"'\"&TRIM(RIGHTB(SUBSTITUTE(INDEX(Ю,ROW(F3)),\"]\",REPT(\" \",30)),31))&\"'!K42\"),\"\")","v":""}]
[{"$f":"A9+1","v":3},{"$f":"IFERROR(INDIRECT(\"'\"&TRIM(RIGHTB(SUBSTITUTE(INDEX(Ю,ROW(A4)),\"]\",REPT(\" \",30)),31))&\"'!K2\"),\"\")","v":""},{"$f":"IFERROR(INDIRECT(\"'\"&TRIM(RIGHTB(SUBSTITUTE(INDEX(Ю,ROW(A4)),\"]\",REPT(\" \",30)),31))&\"'!K3\"),\"\")","v":""},{"$f":"IFERROR(INDIRECT(\"'\"&TRIM(RIGHTB(SUBSTITUTE(INDEX(Ю,ROW(A4)),\"]\",REPT(\" \",30)),31))&\"'!E42\"),\"\")","v":""},{"$f":"IFERROR(INDIRECT(\"'\"&TRIM(RIGHTB(SUBSTITUTE(INDEX(Ю,ROW(A4)),\"]\",REPT(\" \",30)),31))&\"'!F42\"),\"\")","v":""},{"$f":"IFERROR(INDIRECT(\"'\"&TRIM(RIGHTB(SUBSTITUTE(INDEX(Ю,ROW(A4)),\"]\",REPT(\" \",30)),31))&\"'!G42\"),\"\")","v":""},{"$f":"IFERROR(INDIRECT(\"'\"&TRIM(RIGHTB(SUBSTITUTE(INDEX(Ю,ROW(B4)),\"]\",REPT(\" \",30)),31))&\"'!N6\"),\"\")","v":""},{"$f":"IFERROR(INDIRECT(\"'\"&TRIM(RIGHTB(SUBSTITUTE(INDEX(Ю,ROW(C4)),\"]\",REPT(\" \",30)),31))&\"'!H42\"),\"\")","v":""},{"$f":"IFERROR(INDIRECT(\"'\"&TRIM(RIGHTB(SUBSTITUTE(INDEX(Ю,ROW(D4)),\"]\",REPT(\" \",30)),31))&\"'!I42\"),\"\")","v":""},{"$f":"IFERROR(INDIRECT(\"'\"&TRIM(RIGHTB(SUBSTITUTE(INDEX(Ю,ROW(E4)),\"]\",REPT(\" \",30)),31))&\"'!J42\"),\"\")","v":""},{"$f":"IFERROR(INDIRECT(\"'\"&TRIM(RIGHTB(SUBSTITUTE(INDEX(Ю,ROW(F4)),\"]\",REPT(\" \",30)),31))&\"'!K42\"),\"\")","v":""}]
[4,{"$f":"IFERROR(INDIRECT(\"'\"&TRIM(RIGHTB(SUBSTITUTE(INDEX(Ю,ROW(A5)),\"]\",REPT(\" \",30)),31))&\"'!K2\"),\"\")","v":""},{"$f":"IFERROR(INDIRECT(\"'\"&TRIM(RIGHTB(SUBSTITUTE(INDEX(Ю,ROW(A5)),\"]\",REPT(\" \",30)),31))&\"'!K3\"),\"\")","v":""},{"$f":"IFERROR(INDIRECT(\"'\"&TRIM(RIGHTB(SUBSTITUTE(INDEX(Ю,ROW(A5)),\"]\",REPT(\" \",30)),31))&\"'!E42\"),\"\")","v":""},{"$f":"IFERROR(INDIRECT(\"'\"&TRIM(RIGHTB(SUBSTITUTE(INDEX(Ю,ROW(A5)),\"]\",REPT(\" \",30)),31))&\"'!F42\"),\"\")","v":""},{"$f":"IFERROR(INDIRECT(\"'\"&TRIM(RIGHTB(SUBSTITUTE(INDEX(Ю,ROW(A5)),\"]\",REPT(\" \",30)),31))&\"'!G42\"),\"\")","v":""},{"$f":"IFERROR(INDIRECT(\"'\"&TRIM(RIGHTB(SUBSTITUTE(INDEX(Ю,ROW(B5)),\"]\",REPT(\" \",30)),31))&\"'!N6\"),\"\")","v":""},{"$f":"IFERROR(INDIRECT(\"'\"&TRIM(RIGHTB(SUBSTITUTE(INDEX(Ю,ROW(C5)),\"]\",REPT(\" \",30)),31))&\"'!H42\"),\"\")","v":""},{"$f":"IFERROR(INDIRECT(\"'\"&TRIM(RIGHTB(SUBSTITUTE(INDEX(Ю,ROW(D5)),\"]\",REPT(\" \",30)),31))&\"'!I42\"),\"\")","v":""},{"$f":"IFERROR(INDIRECT(\"'\"&TRIM(RIGHTB(SUBSTITUTE(INDEX(Ю,ROW(E5)),\"]\",REPT(\" \",30)),31))&\"'!J42\"),\"\")","v":""},{"$f":"IFERROR(INDIRECT(\"'\"&TRIM(RIGHTB(SUBSTITUTE(INDEX(Ю,ROW(F5)),\"]\",REPT(\" \",30)),31))&\"'!K42\"),\"\")","v":""}]
[5,{"$f":"IFERROR(INDIRECT(\"'\"&TRIM(RIGHTB(SUBSTITUTE(INDEX(Ю,ROW(A6)),\"]\",REPT(\" \",30)),31))&\"'!K2\"),\"\")","v":""},{"$f":"IFERROR(INDIRECT(\"'\"&TRIM(RIGHTB(SUBSTITUTE(INDEX(Ю,ROW(A6)),\"]\",REPT(\" \",30)),31))&\"'!K3\"),\"\")","v":""},{"$f":"IFERROR(INDIRECT(\"'\"&TRIM(RIGHTB(SUBSTITUTE(INDEX(Ю,ROW(A6)),\"]\",REPT(\" \",30)),31))&\"'!E42\"),\"\")","v":""},{"$f":"IFERROR(INDIRECT(\"'\"&TRIM(RIGHTB(SUBSTITUTE(INDEX(Ю,ROW(A6)),\"]\",REPT(\" \",30)),31))&\"'!F42\"),\"\")","v":""},{"$f":"IFERROR(INDIRECT(\"'\"&TRIM(RIGHTB(SUBSTITUTE(INDEX(Ю,ROW(A6)),\"]\",REPT(\" \",30)),31))&\"'!G42\"),\"\")","v":""},{"$f":"IFERROR(INDIRECT(\"'\"&TRIM(RIGHTB(SUBSTITUTE(INDEX(Ю,ROW(B6)),\"]\",REPT(\" \",30)),31))&\"'!N6\"),\"\")","v":""},{"$f":"IFERROR(INDIRECT(\"'\"&TRIM(RIGHTB(SUBSTITUTE(INDEX(Ю,ROW(C6)),\"]\",REPT(\" \",30)),31))&\"'!H42\"),\"\")","v":""},{"$f":"IFERROR(INDIRECT(\"'\"&TRIM(RIGHTB(SUBSTITUTE(INDEX(Ю,ROW(D6)),\"]\",REPT(\" \",30)),31))&\"'!I42\"),\"\")","v":""},{"$f":"IFERROR(INDIRECT(\"'\"&TRIM(RIGHTB(SUBSTITUTE(INDEX(Ю,ROW(E6)),\"]\",REPT(\" \",30)),31))&\"'!J42\"),\"\")","v":""},{"$f":"IFERROR(INDIRECT(\"'\"&TRIM(RIGHTB(SUBSTITUTE(INDEX(Ю,ROW(F6)),\"]\",REPT(\" \",30)),31))&\"'!K42\"),\"\")","v":""}]
[6,{"$f":"IFERROR(INDIRECT(\"'\"&TRIM(RIGHTB(SUBSTITUTE(INDEX(Ю,ROW(A7)),\"]\",REPT(\" \",30)),31))&\"'!K2\"),\"\")","v":""},{"$f":"IFERROR(INDIRECT(\"'\"&TRIM(RIGHTB(SUBSTITUTE(INDEX(Ю,ROW(A7)),\"]\",REPT(\" \",30)),31))&\"'!K3\"),\"\")","v":""},{"$f":"IFERROR(INDIRECT(\"'\"&TRIM(RIGHTB(SUBSTITUTE(INDEX(Ю,ROW(A7)),\"]\",REPT(\" \",30)),31))&\"'!E42\"),\"\")","v":""},{"$f":"IFERROR(INDIRECT(\"'\"&TRIM(RIGHTB(SUBSTITUTE(INDEX(Ю,ROW(A7)),\"]\",REPT(\" \",30)),31))&\"'!F42\"),\"\")","v":""},{"$f":"IFERROR(INDIRECT(\"'\"&TRIM(RIGHTB(SUBSTITUTE(INDEX(Ю,ROW(A7)),\"]\",REPT(\" \",30)),31))&\"'!G42\"),\"\")","v":""},{"$f":"IFERROR(INDIRECT(\"'\"&TRIM(RIGHTB(SUBSTITUTE(INDEX(Ю,ROW(B7)),\"]\",REPT(\" \",30)),31))&\"'!N6\"),\"\")","v":""},{"$f":"IFERROR(INDIRECT(\"'\"&TRIM(RIGHTB(SUBSTITUTE(INDEX(Ю,ROW(C7)),\"]\",REPT(\" \",30)),31))&\"'!H42\"),\"\")","v":""},{"$f":"IFERROR(INDIRECT(\"'\"&TRIM(RIGHTB(SUBSTITUTE(INDEX(Ю,ROW(D7)),\"]\",REPT(\" \",30)),31))&\"'!I42\"),\"\")","v":""},{"$f":"IFERROR(INDIRECT(\"'\"&TRIM(RIGHTB(SUBSTITUTE(INDEX(Ю,ROW(E7)),\"]\",REPT(\" \",30)),31))&\"'!J42\"),\"\")","v":""},{"$f":"IFERROR(INDIRECT(\"'\"&TRIM(RIGHTB(SUBSTITUTE(INDEX(Ю,ROW(F7)),\"]\",REPT(\" \",30)),31))&\"'!K42\"),\"\")","v":""}]
[7,{"$f":"IFERROR(INDIRECT(\"'\"&TRIM(RIGHTB(SUBSTITUTE(INDEX(Ю,ROW(A8)),\"]\",REPT(\" \",30)),31))&\"'!K2\"),\"\")","v":""},{"$f":"IFERROR(INDIRECT(\"'\"&TRIM(RIGHTB(SUBSTITUTE(INDEX(Ю,ROW(A8)),\"]\",REPT(\" \",30)),31))&\"'!K3\"),\"\")","v":""},{"$f":"IFERROR(INDIRECT(\"'\"&TRIM(RIGHTB(SUBSTITUTE(INDEX(Ю,ROW(A8)),\"]\",REPT(\" \",30)),31))&\"'!E42\"),\"\")","v":""},{"$f":"IFERROR(INDIRECT(\"'\"&TRIM(RIGHTB(SUBSTITUTE(INDEX(Ю,ROW(A8)),\"]\",REPT(\" \",30)),31))&\"'!F42\"),\"\")","v":""},{"$f":"IFERROR(INDIRECT(\"'\"&TRIM(RIGHTB(SUBSTITUTE(INDEX(Ю,ROW(A8)),\"]\",REPT(\" \",30)),31))&\"'!G42\"),\"\")","v":""},{"$f":"IFERROR(INDIRECT(\"'\"&TRIM(RIGHTB(SUBSTITUTE(INDEX(Ю,ROW(B8)),\"]\",REPT(\" \",30)),31))&\"'!N6\"),\"\")","v":""},{"$f":"IFERROR(INDIRECT(\"'\"&TRIM(RIGHTB(SUBSTITUTE(INDEX(Ю,ROW(C8)),\"]\",REPT(\" \",30)),31))&\"'!H42\"),\"\")","v":""},{"$f":"IFERROR(INDIRECT(\"'\"&TRIM(RIGHTB(SUBSTITUTE(INDEX(Ю,ROW(D8)),\"]\",REPT(\" \",30)),31))&\"'!I42\"),\"\")","v":""},{"$f":"IFERROR(INDIRECT(\"'\"&TRIM(RIGHTB(SUBSTITUTE(INDEX(Ю,ROW(E8)),\"]\",REPT(\" \",30)),31))&\"'!J42\"),\"\")","v":""},{"$f":"IFERROR(INDIRECT(\"'\"&TRIM(RIGHTB(SUBSTITUTE(INDEX(Ю,ROW(F8)),\"]\",REPT(\" \",30)),31))&\"'!K42\"),\"\")","v":""}]
[8,{"$f":"IFERROR(INDIRECT(\"'\"&TRIM(RIGHTB(SUBSTITUTE(INDEX(Ю,ROW(A9)),\"]\",REPT(\" \",30)),31))&\"'!K2\"),\"\")","v":""},{"$f":"IFERROR(INDIRECT(\"'\"&TRIM(RIGHTB(SUBSTITUTE(INDEX(Ю,ROW(A9)),\"]\",REPT(\" \",30)),31))&\"'!K3\"),\"\")","v":""},{"$f":"IFERROR(INDIRECT(\"'\"&TRIM(RIGHTB(SUBSTITUTE(INDEX(Ю,ROW(A9)),\"]\",REPT(\" \",30)),31))&\"'!E42\"),\"\")","v":""},{"$f":"IFERROR(INDIRECT(\"'\"&TRIM(RIGHTB(SUBSTITUTE(INDEX(Ю,ROW(A9)),\"]\",REPT(\" \",30)),31))&\"'!F42\"),\"\")","v":""},{"$f":"IFERROR(INDIRECT(\"'\"&TRIM(RIGHTB(SUBSTITUTE(INDEX(Ю,ROW(A9)),\"]\",REPT(\" \",30)),31))&\"'!G42\"),\"\")","v":""},{"$f":"IFERROR(INDIRECT(\"'\"&TRIM(RIGHTB(SUBSTITUTE(INDEX(Ю,ROW(B9)),\"]\",REPT(\" \",30)),31))&\"'!N6\"),\"\")","v":""},{"$f":"IFERROR(INDIRECT(\"'\"&TRIM(RIGHTB(SUBSTITUTE(INDEX(Ю,ROW(C9)),\"]\",REPT(\" \",30)),31))&\"'!H42\"),\"\")","v":""},{"$f":"IFERROR(INDIRECT(\"'\"&TRIM(RIGHTB(SUBSTITUTE(INDEX(Ю,ROW(D9)),\"]\",REPT(\" \",30)),31))&\"'!I42\"),\"\")","v":""},{"$f":"IFERROR(INDIRECT(\"'\"&TRIM(RIGHTB(SUBSTITUTE(INDEX(Ю,ROW(E9)),\"]\",REPT(\" \",30)),31))&\"'!J42\"),\"\")","v":""},{"$f":"IFERROR(INDIRECT(\"'\"&TRIM(RIGHTB(SUBSTITUTE(INDEX(Ю,ROW(F9)),\"]\",REPT(\" \",30)),31))&\"'!K42\"),\"\")","v":""}]
[9,{"$f":"IFERROR(INDIRECT(\"'\"&TRIM(RIGHTB(SUBSTITUTE(INDEX(Ю,ROW(A10)),\"]\",REPT(\" \",30)),31))&\"'!K2\"),\"\")","v":""},{"$f":"IFERROR(INDIRECT(\"'\"&TRIM(RIGHTB(SUBSTITUTE(INDEX(Ю,ROW(A10)),\"]\",REPT(\" \",30)),31))&\"'!K3\"),\"\")","v":""},{"$f":"IFERROR(INDIRECT(\"'\"&TRIM(RIGHTB(SUBSTITUTE(INDEX(Ю,ROW(A10)),\"]\",REPT(\" \",30)),31))&\"'!E42\"),\"\")","v":""},{"$f":"IFERROR(INDIRECT(\"'\"&TRIM(RIGHTB(SUBSTITUTE(INDEX(Ю,ROW(A10)),\"]\",REPT(\" \",30)),31))&\"'!F42\"),\"\")","v":""},{"$f":"IFERROR(INDIRECT(\"'\"&TRIM(RIGHTB(SUBSTITUTE(INDEX(Ю,ROW(A10)),\"]\",REPT(\" \",30)),31))&\"'!G42\"),\"\")","v":""},{"$f":"IFERROR(INDIRECT(\"'\"&TRIM(RIGHTB(SUBSTITUTE(INDEX(Ю,ROW(B10)),\"]\",REPT(\" \",30)),31))&\"'!N6\"),\"\")","v":""},{"$f":"IFERROR(INDIRECT(\"'\"&TRIM(RIGHTB(SUBSTITUTE(INDEX(Ю,ROW(C10)),\"]\",REPT(\" \",30)),31))&\"'!H42\"),\"\")","v":""},{"$f":"IFERROR(INDIRECT(\"'\"&TRIM(RIGHTB(SUBSTITUTE(INDEX(Ю,ROW(D10)),\"]\",REPT(\" \",30)),31))&\"'!I42\"),\"\")","v":""},{"$f":"IFERROR(INDIRECT(\"'\"&TRIM(RIGHTB(SUBSTITUTE(INDEX(Ю,ROW(E10)),\"]\",REPT(\" \",30)),31))&\"'!J42\"),\"\")","v":""},{"$f":"IFERROR(INDIRECT(\"'\"&TRIM(RIGHTB(SUBSTITUTE(INDEX(Ю,ROW(F10)),\"]\",REPT(\" \",30)),31))&\"'!K42\"),\"\")","v":""}]
[10,{"$f":"IFERROR(INDIRECT(\"'\"&TRIM(RIGHTB(SUBSTITUTE(INDEX(Ю,ROW(A11)),\"]\",REPT(\" \",30)),31))&\"'!K2\"),\"\")","v":""},{"$f":"IFERROR(INDIRECT(\"'\"&TRIM(RIGHTB(SUBSTITUTE(INDEX(Ю,ROW(A11)),\"]\",REPT(\" \",30)),31))&\"'!K3\"),\"\")","v":""},{"$f":"IFERROR(INDIRECT(\"'\"&TRIM(RIGHTB(SUBSTITUTE(INDEX(Ю,ROW(A11)),\"]\",REPT(\" \",30)),31))&\"'!E42\"),\"\")","v":""},{"$f":"IFERROR(INDIRECT(\"'\"&TRIM(RIGHTB(SUBSTITUTE(INDEX(Ю,ROW(A11)),\"]\",REPT(\" \",30)),31))&\"'!F42\"),\"\")","v":""},{"$f":"IFERROR(INDIRECT(\"'\"&TRIM(RIGHTB(SUBSTITUTE(INDEX(Ю,ROW(A11)),\"]\",REPT(\" \",30)),31))&\"'!G42\"),\"\")","v":""},{"$f":"IFERROR(INDIRECT(\"'\"&TRIM(RIGHTB(SUBSTITUTE(INDEX(Ю,ROW(B11)),\"]\",REPT(\" \",30)),31))&\"'!N6\"),\"\")","v":""},{"$f":"IFERROR(INDIRECT(\"'\"&TRIM(RIGHTB(SUBSTITUTE(INDEX(Ю,ROW(C11)),\"]\",REPT(\" \",30)),31))&\"'!H42\"),\"\")","v":""},{"$f":"IFERROR(INDIRECT(\"'\"&TRIM(RIGHTB(SUBSTITUTE(INDEX(Ю,ROW(D11)),\"]\",REPT(\" \",30)),31))&\"'!I42\"),\"\")","v":""},{"$f":"IFERROR(INDIRECT(\"'\"&TRIM(RIGHTB(SUBSTITUTE(INDEX(Ю,ROW(E11)),\"]\",REPT(\" \",30)),31))&\"'!J42\"),\"\")","v":""},{"$f":"IFERROR(INDIRECT(\"'\"&TRIM(RIGHTB(SUBSTITUTE(INDEX(Ю,ROW(F11)),\"]\",REPT(\" \",30)),31))&\"'!K42\"),\"\")","v":""}]
[11,{"$f":"IFERROR(INDIRECT(\"'\"&TRIM(RIGHTB(SUBSTITUTE(INDEX(Ю,ROW(A12)),\"]\",REPT(\" \",30)),31))&\"'!K2\"),\"\")","v":""},{"$f":"IFERROR(INDIRECT(\"'\"&TRIM(RIGHTB(SUBSTITUTE(INDEX(Ю,ROW(A12)),\"]\",REPT(\" \",30)),31))&\"'!K3\"),\"\")","v":""},{"$f":"IFERROR(INDIRECT(\"'\"&TRIM(RIGHTB(SUBSTITUTE(INDEX(Ю,ROW(A12)),\"]\",REPT(\" \",30)),31))&\"'!E42\"),\"\")","v":""},{"$f":"IFERROR(INDIRECT(\"'\"&TRIM(RIGHTB(SUBSTITUTE(INDEX(Ю,ROW(A12)),\"]\",REPT(\" \",30)),31))&\"'!F42\"),\"\")","v":""},{"$f":"IFERROR(INDIRECT(\"'\"&TRIM(RIGHTB(SUBSTITUTE(INDEX(Ю,ROW(A12)),\"]\",REPT(\" \",30)),31))&\"'!G42\"),\"\")","v":""},{"$f":"IFERROR(INDIRECT(\"'\"&TRIM(RIGHTB(SUBSTITUTE(INDEX(Ю,ROW(B12)),\"]\",REPT(\" \",30)),31))&\"'!N6\"),\"\")","v":""},{"$f":"IFERROR(INDIRECT(\"'\"&TRIM(RIGHTB(SUBSTITUTE(INDEX(Ю,ROW(C12)),\"]\",REPT(\" \",30)),31))&\"'!H42\"),\"\")","v":""},{"$f":"IFERROR(INDIRECT(\"'\"&TRIM(RIGHTB(SUBSTITUTE(INDEX(Ю,ROW(D12)),\"]\",REPT(\" \",30)),31))&\"'!I42\"),\"\")","v":""},{"$f":"IFERROR(INDIRECT(\"'\"&TRIM(RIGHTB(SUBSTITUTE(INDEX(Ю,ROW(E12)),\"]\",REPT(\" \",30)),31))&\"'!J42\"),\"\")","v":""},{"$f":"IFERROR(INDIRECT(\"'\"&TRIM(RIGHTB(SUBSTITUTE(INDEX(Ю,ROW(F12)),\"]\",REPT(\" \",30)),31))&\"'!K42\"),\"\")","v":""}]
[12,{"$f":"IFERROR(INDIRECT(\"'\"&TRIM(RIGHTB(SUBSTITUTE(INDEX(Ю,ROW(A13)),\"]\",REPT(\" \",30)),31))&\"'!K2\"),\"\")","v":""},{"$f":"IFERROR(INDIRECT(\"'\"&TRIM(RIGHTB(SUBSTITUTE(INDEX(Ю,ROW(A13)),\"]\",REPT(\" \",30)),31))&\"'!K3\"),\"\")","v":""},{"$f":"IFERROR(INDIRECT(\"'\"&TRIM(RIGHTB(SUBSTITUTE(INDEX(Ю,ROW(A13)),\"]\",REPT(\" \",30)),31))&\"'!E42\"),\"\")","v":""},{"$f":"IFERROR(INDIRECT(\"'\"&TRIM(RIGHTB(SUBSTITUTE(INDEX(Ю,ROW(A13)),\"]\",REPT(\" \",30)),31))&\"'!F42\"),\"\")","v":""},{"$f":"IFERROR(INDIRECT(\"'\"&TRIM(RIGHTB(SUBSTITUTE(INDEX(Ю,ROW(A13)),\"]\",REPT(\" \",30)),31))&\"'!G42\"),\"\")","v":""},{"$f":"IFERROR(INDIRECT(\"'\"&TRIM(RIGHTB(SUBSTITUTE(INDEX(Ю,ROW(B13)),\"]\",REPT(\" \",30)),31))&\"'!N6\"),\"\")","v":""},{"$f":"IFERROR(INDIRECT(\"'\"&TRIM(RIGHTB(SUBSTITUTE(INDEX(Ю,ROW(C13)),\"]\",REPT(\" \",30)),31))&\"'!H42\"),\"\")","v":""},{"$f":"IFERROR(INDIRECT(\"'\"&TRIM(RIGHTB(SUBSTITUTE(INDEX(Ю,ROW(D13)),\"]\",REPT(\" \",30)),31))&\"'!I42\"),\"\")","v":""},{"$f":"IFERROR(INDIRECT(\"'\"&TRIM(RIGHTB(SUBSTITUTE(INDEX(Ю,ROW(E13)),\"]\",REPT(\" \",30)),31))&\"'!J42\"),\"\")","v":""},{"$f":"IFERROR(INDIRECT(\"'\"&TRIM(RIGHTB(SUBSTITUTE(INDEX(Ю,ROW(F13)),\"]\",REPT(\" \",30)),31))&\"'!K42\"),\"\")","v":""}]
[13,{"$f":"IFERROR(INDIRECT(\"'\"&TRIM(RIGHTB(SUBSTITUTE(INDEX(Ю,ROW(A14)),\"]\",REPT(\" \",30)),31))&\"'!K2\"),\"\")","v":""},{"$f":"IFERROR(INDIRECT(\"'\"&TRIM(RIGHTB(SUBSTITUTE(INDEX(Ю,ROW(A14)),\"]\",REPT(\" \",30)),31))&\"'!K3\"),\"\")","v":""},{"$f":"IFERROR(INDIRECT(\"'\"&TRIM(RIGHTB(SUBSTITUTE(INDEX(Ю,ROW(A14)),\"]\",REPT(\" \",30)),31))&\"'!E42\"),\"\")","v":""},{"$f":"IFERROR(INDIRECT(\"'\"&TRIM(RIGHTB(SUBSTITUTE(INDEX(Ю,ROW(A14)),\"]\",REPT(\" \",30)),31))&\"'!F42\"),\"\")","v":""},{"$f":"IFERROR(INDIRECT(\"'\"&TRIM(RIGHTB(SUBSTITUTE(INDEX(Ю,ROW(A14)),\"]\",REPT(\" \",30)),31))&\"'!G42\"),\"\")","v":""},{"$f":"IFERROR(INDIRECT(\"'\"&TRIM(RIGHTB(SUBSTITUTE(INDEX(Ю,ROW(B14)),\"]\",REPT(\" \",30)),31))&\"'!N6\"),\"\")","v":""},{"$f":"IFERROR(INDIRECT(\"'\"&TRIM(RIGHTB(SUBSTITUTE(INDEX(Ю,ROW(C14)),\"]\",REPT(\" \",30)),31))&\"'!H42\"),\"\")","v":""},{"$f":"IFERROR(INDIRECT(\"'\"&TRIM(RIGHTB(SUBSTITUTE(INDEX(Ю,ROW(D14)),\"]\",REPT(\" \",30)),31))&\"'!I42\"),\"\")","v":""},{"$f":"IFERROR(INDIRECT(\"'\"&TRIM(RIGHTB(SUBSTITUTE(INDEX(Ю,ROW(E14)),\"]\",REPT(\" \",30)),31))&\"'!J42\"),\"\")","v":""},{"$f":"IFERROR(INDIRECT(\"'\"&TRIM(RIGHTB(SUBSTITUTE(INDEX(Ю,ROW(F14)),\"]\",REPT(\" \",30)),31))&\"'!K42\"),\"\")","v":""}]
{"$rows_left_out":15}
{"sheet":"кабинет","index":1,"n_rows":42,"n_cols":12,"rows_kept":42,"cut":false,"hidden":false,"merged":[[1,1,1,4],[1,5,1,6],[7,4,9,4],[7,5,9,5],[7,7,7,8],[8,6,9,6],[8,7,9,7],[8,8,9,8],[5,1,5,8],[2,1,2,4],[2,5,2,7],[3,1,3,7],[3,9,3,10],[41,1,41,3],[8,9,9,9],[8,11,8,14],[9,11,9,15],[6,1,9,1],[6,2,9,2],[6,3,9,3],[6,4,6,6],[6,7,6,10]]}
[]
[1]
[]
[null,null,null,null,null,null,null,null,null,"ЗАПОЛНЯЕМОСТЬ"]
[null,null,null,null,null,null,null,null,null,"ЛЕТО",15]
[null,null,null,null,null,null,null,null,null,"ЗИМА",21]
[null,null,null,null,null,null,null,"койко-дни"]
[null,null,null,null,null,null,null,null,null,null,"заполняемость"]
[null,null,null,null,null,null,null,null,null,null,{"$f":"IF(OR(MONTH(СВОД!A34)=11,MONTH(СВОД!A34)=12,MONTH(СВОД!A34)=1,MONTH(СВОД!A34)=2,MONTH(СВОД!A34)=3),\"ЗИМА\",\"ЛЕТО\")","v":"ЛЕТО"},"Вот в эту ячейку зима (лето) попадает автоматически - в зависимости от месяца, в котором заполняется отчет - с листа СВОД"]
[null,null,null,null,null,null,null,null,null,null,{"$f":"VLOOKUP(K9,J5:K6,2,)","v":15},"Формула НЕ работает. Когда стоит лето, формула работает. Когда стоит зима - не работает. Почему, я не понимаю!!!"]
[null,null,null,null,null,null,null,null,null,null,{"$f":"ROUND((G11*$K$10/100),2)","v":0}]
[null,null,null,null,null,null,null,null,null,null,{"$f":"ROUND((G12*$K$10/100),2)","v":0}]
[null,null,null,null,null,null,null,null,null,null,{"$f":"ROUND((G13*$K$10/100),2)","v":0}]
[null,null,null,null,null,null,null,null,null,null,0]
[null,null,null,null,null,null,null,null,null,null,0]
[null,null,null,null,null,null,null,null,null,null,0]
[null,null,null,null,null,null,null,null,null,null,0]
[null,null,null,null,null,null,null,null,null,null,0]
[null,null,null,null,null,null,null,null,null,null,0]
[null,null,null,null,null,null,null,null,null,null,0]
{"$rows_left_out":22}