{"text_format":"1","workbook":"xlsx","n_sheets":3,"sheets":["Справочник","Основной","ЮТ"],"not_rendered":{"charts":0,"images":4,"macros":1,"external_links":0,"defined_names":0,"comments":0,"pivot_tables":0},"unopened":[],"bounds":{"document_bytes":16777216,"sheet_cells":100000,"rows_first":2000,"rows_last":500,"rows_between":2000,"halvings":0,"cell_chars":16384,"cell_head_chars":4096},"cells_cut":0,"cells_raw":0,"read":"whole","date_system":"1900"}

{"sheet":"Справочник","index":0,"n_rows":12,"n_cols":3,"rows_kept":12,"cut":false,"hidden":false,"merged":[]}
[null,"Представление"]
[{"$f":"A1+1","v":1},"Ана","РШ"]
[2,"Паша","МА"]
[3,"Володя","МА"]
[4,"Сережа","ЮТ "]
[5,"Никита","ИПД"]
[6,"Лена","ИПД"]
[7,"Оля","РШ"]
[8,"Таня","ЮТ "]
[9,"Юра","МШ"]
[10,"Миша","МШ"]
[11,"Саша","ИПД"]

{"sheet":"Основной","index":1,"n_rows":1301,"n_cols":13,"rows_kept":1301,"cut":false,"hidden":false,"merged":[[0,11,0,12]]}
[null,"Дата ","Сумма","Плательщик","БНФ/П","Получатель","П/БНФ","Формат","Комментарий",null,{"$f":"TODAY()","v":"2019-08-15"},{"$f":"L2+M2","v":1250}]
[null,"2019-08-05",200,"Миша",{"$f":"IFERROR(VLOOKUP($D2,Справочник!$B:$C,2,FALSE),\"\")","v":"МШ"},"Сережа",{"$f":"IFERROR(VLOOKUP(F2,Справочник!B:C,2,FALSE),\"\")","v":"ЮТ "},null,null,null,"детали ",{"$f":"SUMIF($C:$C,\">0\")","v":1250},{"$f":"SUMIF($C:$C,\"<0\")","v":0}]
[null,"2019-08-06",100,"Саша",{"$f":"IFERROR(VLOOKUP($D3,Справочник!$B:$C,2,FALSE),\"\")","v":"ИПД"},"Юра",{"$f":"IFERROR(VLOOKUP(F3,Справочник!B:C,2,FALSE),\"\")","v":"МШ"}]
[null,"2019-08-07",300,"Сережа",{"$f":"IFERROR(VLOOKUP($D4,Справочник!$B:$C,2,FALSE),\"\")","v":"ЮТ "},"Паша",{"$f":"IFERROR(VLOOKUP(F4,Справочник!B:C,2,FALSE),\"\")","v":"МА"}]
[null,"2019-08-08",150,"Оля",{"$f":"IFERROR(VLOOKUP($D5,Справочник!$B:$C,2,FALSE),\"\")","v":"РШ"},"Таня","ют"]
[null,"2019-08-09",500,"Таня",{"$f":"IFERROR(VLOOKUP($D6,Справочник!$B:$C,2,FALSE),\"\")","v":"ЮТ "},"Лена",{"$f":"IFERROR(VLOOKUP(F6,Справочник!B:C,2,FALSE),\"\")","v":"ИПД"}]
[null,null,null,null,{"$f":"IFERROR(VLOOKUP($D7,Справочник!$B:$C,2,FALSE),\"\")","v":""},"Таня",{"$f":"IFERROR(VLOOKUP(F7,Справочник!B:C,2,FALSE),\"\")","v":"ЮТ "}]
[null,null,null,null,{"$f":"IFERROR(VLOOKUP($D8,Справочник!$B:$C,2,FALSE),\"\")","v":""},null,{"$f":"IFERROR(VLOOKUP(F8,Справочник!B:C,2,FALSE),\"\")","v":""}]
[null,null,null,null,{"$f":"IFERROR(VLOOKUP($D9,Справочник!$B:$C,2,FALSE),\"\")","v":""},null,{"$f":"IFERROR(VLOOKUP(F9,Справочник!B:C,2,FALSE),\"\")","v":""}]
[null,null,null,null,{"$f":"IFERROR(VLOOKUP($D10,Справочник!$B:$C,2,FALSE),\"\")","v":""},null,{"$f":"IFERROR(VLOOKUP(F10,Справочник!B:C,2,FALSE),\"\")","v":""}]
[null,null,null,null,{"$f":"IFERROR(VLOOKUP($D11,Справочник!$B:$C,2,FALSE),\"\")","v":""},null,{"$f":"IFERROR(VLOOKUP(F11,Справочник!B:C,2,FALSE),\"\")","v":""}]
[null,null,null,null,{"$f":"IFERROR(VLOOKUP($D12,Справочник!$B:$C,2,FALSE),\"\")","v":""},null,{"$f":"IFERROR(VLOOKUP(F12,Справочник!B:C,2,FALSE),\"\")","v":""}]
[null,null,null,null,{"$f":"IFERROR(VLOOKUP($D13,Справочник!$B:$C,2,FALSE),\"\")","v":""},null,{"$f":"IFERROR(VLOOKUP(F13,Справочник!B:C,2,FALSE),\"\")","v":""}]
[null,null,null,null,{"$f":"IFERROR(VLOOKUP($D14,Справочник!$B:$C,2,FALSE),\"\")","v":""},null,{"$f":"IFERROR(VLOOKUP(F14,Справочник!B:C,2,FALSE),\"\")","v":""}]
[null,null,null,null,{"$f":"IFERROR(VLOOKUP($D15,Справочник!$B:$C,2,FALSE),\"\")","v":""},null,{"$f":"IFERROR(VLOOKUP(F15,Справочник!B:C,2,FALSE),\"\")","v":""}]
[null,null,null,null,{"$f":"IFERROR(VLOOKUP($D16,Справочник!$B:$C,2,FALSE),\"\")","v":""},null,{"$f":"IFERROR(VLOOKUP(F16,Справочник!B:C,2,FALSE),\"\")","v":""}]
[null,null,null,null,{"$f":"IFERROR(VLOOKUP($D17,Справочник!$B:$C,2,FALSE),\"\")","v":""},null,{"$f":"IFERROR(VLOOKUP(F17,Справочник!B:C,2,FALSE),\"\")","v":""}]
[null,null,null,null,{"$f":"IFERROR(VLOOKUP($D18,Справочник!$B:$C,2,FALSE),\"\")","v":""},null,{"$f":"IFERROR(VLOOKUP(F18,Справочник!B:C,2,FALSE),\"\")","v":""}]
[null,null,null,null,{"$f":"IFERROR(VLOOKUP($D19,Справочник!$B:$C,2,FALSE),\"\")","v":""},null,{"$f":"IFERROR(VLOOKUP(F19,Справочник!B:C,2,FALSE),\"\")","v":""}]
[null,null,null,null,{"$f":"IFERROR(VLOOKUP($D20,Справочник!$B:$C,2,FALSE),\"\")","v":""},null,{"$f":"IFERROR(VLOOKUP(F20,Справочник!B:C,2,FALSE),\"\")","v":""}]
[null,null,null,null,{"$f":"IFERROR(VLOOKUP($D21,Справочник!$B:$C,2,FALSE),\"\")","v":""},null,{"$f":"IFERROR(VLOOKUP(F21,Справочник!B:C,2,FALSE),\"\")","v":""}]
[null,null,null,null,{"$f":"IFERROR(VLOOKUP($D22,Справочник!$B:$C,2,FALSE),\"\")","v":""},null,{"$f":"IFERROR(VLOOKUP(F22,Справочник!B:C,2,FALSE),\"\")","v":""}]
[null,null,null,null,{"$f":"IFERROR(VLOOKUP($D23,Справочник!$B:$C,2,FALSE),\"\")","v":""},null,{"$f":"IFERROR(VLOOKUP(F23,Справочник!B:C,2,FALSE),\"\")","v":""}]
[null,null,null,null,{"$f":"IFERROR(VLOOKUP($D24,Справочник!$B:$C,2,FALSE),\"\")","v":""},null,{"$f":"IFERROR(VLOOKUP(F24,Справочник!B:C,2,FALSE),\"\")","v":""}]
[null,null,null,null,{"$f":"IFERROR(VLOOKUP($D25,Справочник!$B:$C,2,FALSE),\"\")","v":""},null,{"$f":"IFERROR(VLOOKUP(F25,Справочник!B:C,2,FALSE),\"\")","v":""}]
[null,null,null,null,{"$f":"IFERROR(VLOOKUP($D26,Справочник!$B:$C,2,FALSE),\"\")","v":""},null,{"$f":"IFERROR(VLOOKUP(F26,Справочник!B:C,2,FALSE),\"\")","v":""}]
[null,null,null,null,{"$f":"IFERROR(VLOOKUP($D27,Справочник!$B:$C,2,FALSE),\"\")","v":""},null,{"$f":"IFERROR(VLOOKUP(F27,Справочник!B:C,2,FALSE),\"\")","v":""}]
[null,null,null,null,{"$f":"IFERROR(VLOOKUP($D28,Справочник!$B:$C,2,FALSE),\"\")","v":""},null,{"$f":"IFERROR(VLOOKUP(F28,Справочник!B:C,2,FALSE),\"\")","v":""}]
[null,null,null,null,{"$f":"IFERROR(VLOOKUP($D29,Справочник!$B:$C,2,FALSE),\"\")","v":""},null,{"$f":"IFERROR(VLOOKUP(F29,Справочник!B:C,2,FALSE),\"\")","v":""}]
[null,null,null,null,{"$f":"IFERROR(VLOOKUP($D30,Справочник!$B:$C,2,FALSE),\"\")","v":""},null,{"$f":"IFERROR(VLOOKUP(F30,Справочник!B:C,2,FALSE),\"\")","v":""}]
[null,null,null,null,{"$f":"IFERROR(VLOOKUP($D31,Справочник!$B:$C,2,FALSE),\"\")","v":""},null,{"$f":"IFERROR(VLOOKUP(F31,Справочник!B:C,2,FALSE),\"\")","v":""}]
[null,null,null,null,{"$f":"IFERROR(VLOOKUP($D32,Справочник!$B:$C,2,FALSE),\"\")","v":""},null,{"$f":"IFERROR(VLOOKUP(F32,Справочник!B:C,2,FALSE),\"\")","v":""}]
[null,null,null,null,{"$f":"IFERROR(VLOOKUP($D33,Справочник!$B:$C,2,FALSE),\"\")","v":""},null,{"$f":"IFERROR(VLOOKUP(F33,Справочник!B:C,2,FALSE),\"\")","v":""}]
[null,null,null,null,{"$f":"IFERROR(VLOOKUP($D34,Справочник!$B:$C,2,FALSE),\"\")","v":""},null,{"$f":"IFERROR(VLOOKUP(F34,Справочник!B:C,2,FALSE),\"\")","v":""}]
[null,null,null,null,{"$f":"IFERROR(VLOOKUP($D35,Справочник!$B:$C,2,FALSE),\"\")","v":""},null,{"$f":"IFERROR(VLOOKUP(F35,Справочник!B:C,2,FALSE),\"\")","v":""}]
[null,null,null,null,{"$f":"IFERROR(VLOOKUP($D36,Справочник!$B:$C,2,FALSE),\"\")","v":""},null,{"$f":"IFERROR(VLOOKUP(F36,Справочник!B:C,2,FALSE),\"\")","v":""}]
[null,null,null,null,{"$f":"IFERROR(VLOOKUP($D37,Справочник!$B:$C,2,FALSE),\"\")","v":""},null,{"$f":"IFERROR(VLOOKUP(F37,Справочник!B:C,2,FALSE),\"\")","v":""}]
[null,null,null,null,{"$f":"IFERROR(VLOOKUP($D38,Справочник!$B:$C,2,FALSE),\"\")","v":""},null,{"$f":"IFERROR(VLOOKUP(F38,Справочник!B:C,2,FALSE),\"\")","v":""}]
[null,null,null,null,{"$f":"IFERROR(VLOOKUP($D39,Справочник!$B:$C,2,FALSE),\"\")","v":""},null,{"$f":"IFERROR(VLOOKUP(F39,Справочник!B:C,2,FALSE),\"\")","v":""}]
[null,null,null,null,{"$f":"IFERROR(VLOOKUP($D40,Справочник!$B:$C,2,FALSE),\"\")","v":""},null,{"$f":"IFERROR(VLOOKUP(F40,Справочник!B:C,2,FALSE),\"\")","v":""}]
[null,null,null,null,{"$f":"IFERROR(VLOOKUP($D41,Справочник!$B:$C,2,FALSE),\"\")","v":""},null,{"$f":"IFERROR(VLOOKUP(F41,Справочник!B:C,2,FALSE),\"\")","v":""}]
[null,null,null,null,{"$f":"IFERROR(VLOOKUP($D42,Справочник!$B:$C,2,FALSE),\"\")","v":""},null,{"$f":"IFERROR(VLOOKUP(F42,Справочник!B:C,2,FALSE),\"\")","v":""}]
[null,null,null,null,{"$f":"IFERROR(VLOOKUP($D43,Справочник!$B:$C,2,FALSE),\"\")","v":""},null,{"$f":"IFERROR(VLOOKUP(F43,Справочник!B:C,2,FALSE),\"\")","v":""}]
[null,null,null,null,{"$f":"IFERROR(VLOOKUP($D44,Справочник!$B:$C,2,FALSE),\"\")","v":""},null,{"$f":"IFERROR(VLOOKUP(F44,Справочник!B:C,2,FALSE),\"\")","v":""}]
[null,null,null,null,{"$f":"IFERROR(VLOOKUP($D45,Справочник!$B:$C,2,FALSE),\"\")","v":""},null,{"$f":"IFERROR(VLOOKUP(F45,Справочник!B:C,2,FALSE),\"\")","v":""}]
[null,null,null,null,{"$f":"IFERROR(VLOOKUP($D46,Справочник!$B:$C,2,FALSE),\"\")","v":""},null,{"$f":"IFERROR(VLOOKUP(F46,Справочник!B:C,2,FALSE),\"\")","v":""}]
[null,null,null,null,{"$f":"IFERROR(VLOOKUP($D47,Справочник!$B:$C,2,FALSE),\"\")","v":""},null,{"$f":"IFERROR(VLOOKUP(F47,Справочник!B:C,2,FALSE),\"\")","v":""}]
[null,null,null,null,{"$f":"IFERROR(VLOOKUP($D48,Справочник!$B:$C,2,FALSE),\"\")","v":""},null,{"$f":"IFERROR(VLOOKUP(F48,Справочник!B:C,2,FALSE),\"\")","v":""}]
[null,null,null,null,{"$f":"IFERROR(VLOOKUP($D49,Справочник!$B:$C,2,FALSE),\"\")","v":""},null,{"$f":"IFERROR(VLOOKUP(F49,Справочник!B:C,2,FALSE),\"\")","v":""}]
[null,null,null,null,{"$f":"IFERROR(VLOOKUP($D50,Справочник!$B:$C,2,FALSE),\"\")","v":""},null,{"$f":"IFERROR(VLOOKUP(F50,Справочник!B:C,2,FALSE),\"\")","v":""}]
[null,null,null,null,{"$f":"IFERROR(VLOOKUP($D51,Справочник!$B:$C,2,FALSE),\"\")","v":""},null,{"$f":"IFERROR(VLOOKUP(F51,Справочник!B:C,2,FALSE),\"\")","v":""}]
[null,null,null,null,{"$f":"IFERROR(VLOOKUP($D52,Справочник!$B:$C,2,FALSE),\"\")","v":""},null,{"$f":"IFERROR(VLOOKUP(F52,Справочник!B:C,2,FALSE),\"\")","v":""}]
[null,null,null,null,{"$f":"IFERROR(VLOOKUP($D53,Справочник!$B:$C,2,FALSE),\"\")","v":""},null,{"$f":"IFERROR(VLOOKUP(F53,Справочник!B:C,2,FALSE),\"\")","v":""}]
[null,null,null,null,{"$f":"IFERROR(VLOOKUP($D54,Справочник!$B:$C,2,FALSE),\"\")","v":""},null,{"$f":"IFERROR(VLOOKUP(F54,Справочник!B:C,2,FALSE),\"\")","v":""}]
[null,null,null,null,{"$f":"IFERROR(VLOOKUP($D55,Справочник!$B:$C,2,FALSE),\"\")","v":""},null,{"$f":"IFERROR(VLOOKUP(F55,Справочник!B:C,2,FALSE),\"\")","v":""}]
[null,null,null,null,{"$f":"IFERROR(VLOOKUP($D56,Справочник!$B:$C,2,FALSE),\"\")","v":""},null,{"$f":"IFERROR(VLOOKUP(F56,Справочник!B:C,2,FALSE),\"\")","v":""}]
[null,null,null,null,{"$f":"IFERROR(VLOOKUP($D57,Справочник!$B:$C,2,FALSE),\"\")","v":""},null,{"$f":"IFERROR(VLOOKUP(F57,Справочник!B:C,2,FALSE),\"\")","v":""}]
[null,null,null,null,{"$f":"IFERROR(VLOOKUP($D58,Справочник!$B:$C,2,FALSE),\"\")","v":""},null,{"$f":"IFERROR(VLOOKUP(F58,Справочник!B:C,2,FALSE),\"\")","v":""}]
[null,null,null,null,{"$f":"IFERROR(VLOOKUP($D59,Справочник!$B:$C,2,FALSE),\"\")","v":""},null,{"$f":"IFERROR(VLOOKUP(F59,Справочник!B:C,2,FALSE),\"\")","v":""}]
[null,null,null,null,{"$f":"IFERROR(VLOOKUP($D60,Справочник!$B:$C,2,FALSE),\"\")","v":""},null,{"$f":"IFERROR(VLOOKUP(F60,Справочник!B:C,2,FALSE),\"\")","v":""}]
[null,null,null,null,{"$f":"IFERROR(VLOOKUP($D61,Справочник!$B:$C,2,FALSE),\"\")","v":""},null,{"$f":"IFERROR(VLOOKUP(F61,Справочник!B:C,2,FALSE),\"\")","v":""}]
[null,null,null,null,{"$f":"IFERROR(VLOOKUP($D62,Справочник!$B:$C,2,FALSE),\"\")","v":""},null,{"$f":"IFERROR(VLOOKUP(F62,Справочник!B:C,2,FALSE),\"\")","v":""}]
[null,null,null,null,{"$f":"IFERROR(VLOOKUP($D63,Справочник!$B:$C,2,FALSE),\"\")","v":""},null,{"$f":"IFERROR(VLOOKUP(F63,Справочник!B:C,2,FALSE),\"\")","v":""}]
[null,null,null,null,{"$f":"IFERROR(VLOOKUP($D64,Справочник!$B:$C,2,FALSE),\"\")","v":""},null,{"$f":"IFERROR(VLOOKUP(F64,Справочник!B:C,2,FALSE),\"\")","v":""}]
[null,null,null,null,{"$f":"IFERROR(VLOOKUP($D65,Справочник!$B:$C,2,FALSE),\"\")","v":""},null,{"$f":"IFERROR(VLOOKUP(F65,Справочник!B:C,2,FALSE),\"\")","v":""}]
[null,null,null,null,{"$f":"IFERROR(VLOOKUP($D66,Справочник!$B:$C,2,FALSE),\"\")","v":""},null,{"$f":"IFERROR(VLOOKUP(F66,Справочник!B:C,2,FALSE),\"\")","v":""}]
[null,null,null,null,{"$f":"IFERROR(VLOOKUP($D67,Справочник!$B:$C,2,FALSE),\"\")","v":""},null,{"$f":"IFERROR(VLOOKUP(F67,Справочник!B:C,2,FALSE),\"\")","v":""}]
[null,null,null,null,{"$f":"IFERROR(VLOOKUP($D68,Справочник!$B:$C,2,FALSE),\"\")","v":""},null,{"$f":"IFERROR(VLOOKUP(F68,Справочник!B:C,2,FALSE),\"\")","v":""}]
[null,null,null,null,{"$f":"IFERROR(VLOOKUP($D69,Справочник!$B:$C,2,FALSE),\"\")","v":""},null,{"$f":"IFERROR(VLOOKUP(F69,Справочник!B:C,2,FALSE),\"\")","v":""}]
[null,null,null,null,{"$f":"IFERROR(VLOOKUP($D70,Справочник!$B:$C,2,FALSE),\"\")","v":""},null,{"$f":"IFERROR(VLOOKUP(F70,Справочник!B:C,2,FALSE),\"\")","v":""}]
[null,null,null,null,{"$f":"IFERROR(VLOOKUP($D71,Справочник!$B:$C,2,FALSE),\"\")","v":""},null,{"$f":"IFERROR(VLOOKUP(F71,Справочник!B:C,2,FALSE),\"\")","v":""}]
[null,null,null,null,{"$f":"IFERROR(VLOOKUP($D72,Справочник!$B:$C,2,FALSE),\"\")","v":""},null,{"$f":"IFERROR(VLOOKUP(F72,Справочник!B:C,2,FALSE),\"\")","v":""}]
[null,null,null,null,{"$f":"IFERROR(VLOOKUP($D73,Справочник!$B:$C,2,FALSE),\"\")","v":""},null,{"$f":"IFERROR(VLOOKUP(F73,Справочник!B:C,2,FALSE),\"\")","v":""}]
[null,null,null,null,{"$f":"IFERROR(VLOOKUP($D74,Справочник!$B:$C,2,FALSE),\"\")","v":""},null,{"$f":"IFERROR(VLOOKUP(F74,Справочник!B:C,2,FALSE),\"\")","v":""}]
[null,null,null,null,{"$f":"IFERROR(VLOOKUP($D75,Справочник!$B:$C,2,FALSE),\"\")","v":""},null,{"$f":"IFERROR(VLOOKUP(F75,Справочник!B:C,2,FALSE),\"\")","v":""}]
[null,null,null,null,{"$f":"IFERROR(VLOOKUP($D76,Справочник!$B:$C,2,FALSE),\"\")","v":""},null,{"$f":"IFERROR(VLOOKUP(F76,Справочник!B:C,2,FALSE),\"\")","v":""}]
[null,null,null,null,{"$f":"IFERROR(VLOOKUP($D77,Справочник!$B:$C,2,FALSE),\"\")","v":""},null,{"$f":"IFERROR(VLOOKUP(F77,Справочник!B:C,2,FALSE),\"\")","v":""}]
[null,null,null,null,{"$f":"IFERROR(VLOOKUP($D78,Справочник!$B:$C,2,FALSE),\"\")","v":""},null,{"$f":"IFERROR(VLOOKUP(F78,Справочник!B:C,2,FALSE),\"\")","v":""}]
[null,null,null,null,{"$f":"IFERROR(VLOOKUP($D79,Справочник!$B:$C,2,FALSE),\"\")","v":""},null,{"$f":"IFERROR(VLOOKUP(F79,Справочник!B:C,2,FALSE),\"\")","v":""}]
[null,null,null,null,{"$f":"IFERROR(VLOOKUP($D80,Справочник!$B:$C,2,FALSE),\"\")","v":""},null,{"$f":"IFERROR(VLOOKUP(F80,Справочник!B:C,2,FALSE),\"\")","v":""}]
[null,null,null,null,{"$f":"IFERROR(VLOOKUP($D81,Справочник!$B:$C,2,FALSE),\"\")","v":""},null,{"$f":"IFERROR(VLOOKUP(F81,Справочник!B:C,2,FALSE),\"\")","v":""}]
[null,null,null,null,{"$f":"IFERROR(VLOOKUP($D82,Справочник!$B:$C,2,FALSE),\"\")","v":""},null,{"$f":"IFERROR(VLOOKUP(F82,Справочник!B:C,2,FALSE),\"\")","v":""}]
[null,null,null,null,{"$f":"IFERROR(VLOOKUP($D83,Справочник!$B:$C,2,FALSE),\"\")","v":""},null,{"$f":"IFERROR(VLOOKUP(F83,Справочник!B:C,2,FALSE),\"\")","v":""}]
[null,null,null,null,{"$f":"IFERROR(VLOOKUP($D84,Справочник!$B:$C,2,FALSE),\"\")","v":""},null,{"$f":"IFERROR(VLOOKUP(F84,Справочник!B:C,2,FALSE),\"\")","v":""}]
[null,null,null,null,{"$f":"IFERROR(VLOOKUP($D85,Справочник!$B:$C,2,FALSE),\"\")","v":""},null,{"$f":"IFERROR(VLOOKUP(F85,Справочник!B:C,2,FALSE),\"\")","v":""}]
[null,null,null,null,{"$f":"IFERROR(VLOOKUP($D86,Справочник!$B:$C,2,FALSE),\"\")","v":""},null,{"$f":"IFERROR(VLOOKUP(F86,Справочник!B:C,2,FALSE),\"\")","v":""}]
[null,null,null,null,{"$f":"IFERROR(VLOOKUP($D87,Справочник!$B:$C,2,FALSE),\"\")","v":""},null,{"$f":"IFERROR(VLOOKUP(F87,Справочник!B:C,2,FALSE),\"\")","v":""}]
[null,null,null,null,{"$f":"IFERROR(VLOOKUP($D88,Справочник!$B:$C,2,FALSE),\"\")","v":""},null,{"$f":"IFERROR(VLOOKUP(F88,Справочник!B:C,2,FALSE),\"\")","v":""}]
[null,null,null,null,{"$f":"IFERROR(VLOOKUP($D89,Справочник!$B:$C,2,FALSE),\"\")","v":""},null,{"$f":"IFERROR(VLOOKUP(F89,Справочник!B:C,2,FALSE),\"\")","v":""}]
[null,null,null,null,{"$f":"IFERROR(VLOOKUP($D90,Справочник!$B:$C,2,FALSE),\"\")","v":""},null,{"$f":"IFERROR(VLOOKUP(F90,Справочник!B:C,2,FALSE),\"\")","v":""}]
[null,null,null,null,{"$f":"IFERROR(VLOOKUP($D91,Справочник!$B:$C,2,FALSE),\"\")","v":""},null,{"$f":"IFERROR(VLOOKUP(F91,Справочник!B:C,2,FALSE),\"\")","v":""}]
[null,null,null,null,{"$f":"IFERROR(VLOOKUP($D92,Справочник!$B:$C,2,FALSE),\"\")","v":""},null,{"$f":"IFERROR(VLOOKUP(F92,Справочник!B:C,2,FALSE),\"\")","v":""}]
[null,null,null,null,{"$f":"IFERROR(VLOOKUP($D93,Справочник!$B:$C,2,FALSE),\"\")","v":""},null,{"$f":"IFERROR(VLOOKUP(F93,Справочник!B:C,2,FALSE),\"\")","v":""}]
[null,null,null,null,{"$f":"IFERROR(VLOOKUP($D94,Справочник!$B:$C,2,FALSE),\"\")","v":""},null,{"$f":"IFERROR(VLOOKUP(F94,Справочник!B:C,2,FALSE),\"\")","v":""}]
[null,null,null,null,{"$f":"IFERROR(VLOOKUP($D95,Справочник!$B:$C,2,FALSE),\"\")","v":""},null,{"$f":"IFERROR(VLOOKUP(F95,Справочник!B:C,2,FALSE),\"\")","v":""}]
[null,null,null,null,{"$f":"IFERROR(VLOOKUP($D96,Справочник!$B:$C,2,FALSE),\"\")","v":""},null,{"$f":"IFERROR(VLOOKUP(F96,Справочник!B:C,2,FALSE),\"\")","v":""}]
[null,null,null,null,{"$f":"IFERROR(VLOOKUP($D97,Справочник!$B:$C,2,FALSE),\"\")","v":""},null,{"$f":"IFERROR(VLOOKUP(F97,Справочник!B:C,2,FALSE),\"\")","v":""}]
[null,null,null,null,{"$f":"IFERROR(VLOOKUP($D98,Справочник!$B:$C,2,FALSE),\"\")","v":""},null,{"$f":"IFERROR(VLOOKUP(F98,Справочник!B:C,2,FALSE),\"\")","v":""}]
[null,null,null,null,{"$f":"IFERROR(VLOOKUP($D99,Справочник!$B:$C,2,FALSE),\"\")","v":""},null,{"$f":"IFERROR(VLOOKUP(F99,Справочник!B:C,2,FALSE),\"\")","v":""}]
[null,null,null,null,{"$f":"IFERROR(VLOOKUP($D100,Справочник!$B:$C,2,FALSE),\"\")","v":""},null,{"$f":"IFERROR(VLOOKUP(F100,Справочник!B:C,2,FALSE),\"\")","v":""}]
[null,null,null,null,{"$f":"IFERROR(VLOOKUP($D101,Справочник!$B:$C,2,FALSE),\"\")","v":""},null,{"$f":"IFERROR(VLOOKUP(F101,Справочник!B:C,2,FALSE),\"\")","v":""}]
[null,null,null,null,{"$f":"IFERROR(VLOOKUP($D102,Справочник!$B:$C,2,FALSE),\"\")","v":""},null,{"$f":"IFERROR(VLOOKUP(F102,Справочник!B:C,2,FALSE),\"\")","v":""}]
[null,null,null,null,{"$f":"IFERROR(VLOOKUP($D103,Справочник!$B:$C,2,FALSE),\"\")","v":""},null,{"$f":"IFERROR(VLOOKUP(F103,Справочник!B:C,2,FALSE),\"\")","v":""}]
[null,null,null,null,{"$f":"IFERROR(VLOOKUP($D104,Справочник!$B:$C,2,FALSE),\"\")","v":""},null,{"$f":"IFERROR(VLOOKUP(F104,Справочник!B:C,2,FALSE),\"\")","v":""}]
[null,null,null,null,{"$f":"IFERROR(VLOOKUP($D105,Справочник!$B:$C,2,FALSE),\"\")","v":""},null,{"$f":"IFERROR(VLOOKUP(F105,Справочник!B:C,2,FALSE),\"\")","v":""}]
[null,null,null,null,{"$f":"IFERROR(VLOOKUP($D106,Справочник!$B:$C,2,FALSE),\"\")","v":""},null,{"$f":"IFERROR(VLOOKUP(F106,Справочник!B:C,2,FALSE),\"\")","v":""}]
[null,null,null,null,{"$f":"IFERROR(VLOOKUP($D107,Справочник!$B:$C,2,FALSE),\"\")","v":""},null,{"$f":"IFERROR(VLOOKUP(F107,Справочник!B:C,2,FALSE),\"\")","v":""}]
[null,null,null,null,{"$f":"IFERROR(VLOOKUP($D108,Справочник!$B:$C,2,FALSE),\"\")","v":""},null,{"$f":"IFERROR(VLOOKUP(F108,Справочник!B:C,2,FALSE),\"\")","v":""}]
[null,null,null,null,{"$f":"IFERROR(VLOOKUP($D109,Справочник!$B:$C,2,FALSE),\"\")","v":""},null,{"$f":"IFERROR(VLOOKUP(F109,Справочник!B:C,2,FALSE),\"\")","v":""}]
[null,null,null,null,{"$f":"IFERROR(VLOOKUP($D110,Справочник!$B:$C,2,FALSE),\"\")","v":""},null,{"$f":"IFERROR(VLOOKUP(F110,Справочник!B:C,2,FALSE),\"\")","v":""}]
[null,null,null,null,{"$f":"IFERROR(VLOOKUP($D111,Справочник!$B:$C,2,FALSE),\"\")","v":""},null,{"$f":"IFERROR(VLOOKUP(F111,Справочник!B:C,2,FALSE),\"\")","v":""}]
[null,null,null,null,{"$f":"IFERROR(VLOOKUP($D112,Справочник!$B:$C,2,FALSE),\"\")","v":""},null,{"$f":"IFERROR(VLOOKUP(F112,Справочник!B:C,2,FALSE),\"\")","v":""}]
[null,null,null,null,{"$f":"IFERROR(VLOOKUP($D113,Справочник!$B:$C,2,FALSE),\"\")","v":""},null,{"$f":"IFERROR(VLOOKUP(F113,Справочник!B:C,2,FALSE),\"\")","v":""}]
[null,null,null,null,{"$f":"IFERROR(VLOOKUP($D114,Справочник!$B:$C,2,FALSE),\"\")","v":""},null,{"$f":"IFERROR(VLOOKUP(F114,Справочник!B:C,2,FALSE),\"\")","v":""}]
[null,null,null,null,{"$f":"IFERROR(VLOOKUP($D115,Справочник!$B:$C,2,FALSE),\"\")","v":""},null,{"$f":"IFERROR(VLOOKUP(F115,Справочник!B:C,2,FALSE),\"\")","v":""}]
[null,null,null,null,{"$f":"IFERROR(VLOOKUP($D116,Справочник!$B:$C,2,FALSE),\"\")","v":""},null,{"$f":"IFERROR(VLOOKUP(F116,Справочник!B:C,2,FALSE),\"\")","v":""}]
[null,null,null,null,{"$f":"IFERROR(VLOOKUP($D117,Справочник!$B:$C,2,FALSE),\"\")","v":""},null,{"$f":"IFERROR(VLOOKUP(F117,Справочник!B:C,2,FALSE),\"\")","v":""}]
[null,null,null,null,{"$f":"IFERROR(VLOOKUP($D118,Справочник!$B:$C,2,FALSE),\"\")","v":""},null,{"$f":"IFERROR(VLOOKUP(F118,Справочник!B:C,2,FALSE),\"\")","v":""}]
[null,null,null,null,{"$f":"IFERROR(VLOOKUP($D119,Справочник!$B:$C,2,FALSE),\"\")","v":""},null,{"$f":"IFERROR(VLOOKUP(F119,Справочник!B:C,2,FALSE),\"\")","v":""}]
[null,null,null,null,{"$f":"IFERROR(VLOOKUP($D120,Справочник!$B:$C,2,FALSE),\"\")","v":""},null,{"$f":"IFERROR(VLOOKUP(F120,Справочник!B:C,2,FALSE),\"\")","v":""}]
{"$rows_left_out":1182}
{"sheet":"ЮТ","index":2,"n_rows":35,"n_cols":12,"rows_kept":35,"cut":false,"hidden":false,"merged":[]}
[null,"Дата ","Сумма","Ставка","Должно быть выдано","Плательщик","БНФ/П","Получатель ",null,"Дата ","Сумма","Получатель "]
[null,{"$f":"IFERROR(INDEX(Основной!$B:$B,SMALL(IF(Основной!$G$2:$G$2225=\"ЮТ\",ROW(Основной!$2:$2225)),ROW(A1))),\"\")","v":"2019-08-08"},{"$f":"IFERROR(INDEX(Основной!$C:$C,SMALL(IF(Основной!#REF!=\"ЮТ\",ROW(Основной!$2:$2225)),ROW(A1))),\"\")","v":""}]
[null,{"$f":"IFERROR(INDEX(Основной!$B:$B,SMALL(IF(Основной!#REF!=\"ЮТ\",ROW(Основной!$2:$2225)),ROW(A2))),\"\")","v":""}]
[null,{"$f":"IFERROR(INDEX(Основной!$B:$B,SMALL(IF(Основной!#REF!=\"ЮТ\",ROW(Основной!$2:$2225)),ROW(A3))),\"\")","v":""}]
[null,{"$f":"IFERROR(INDEX(Основной!$B:$B,SMALL(IF(Основной!#REF!=\"ЮТ\",ROW(Основной!$2:$2225)),ROW(A4))),\"\")","v":""}]
[null,{"$f":"IFERROR(INDEX(Основной!$B:$B,SMALL(IF(Основной!#REF!=\"ЮТ\",ROW(Основной!$2:$2225)),ROW(A5))),\"\")","v":""}]
[null,{"$f":"IFERROR(INDEX(Основной!$B:$B,SMALL(IF(Основной!#REF!=\"ЮТ\",ROW(Основной!$2:$2225)),ROW(A6))),\"\")","v":""}]
[null,{"$f":"IFERROR(INDEX(Основной!$B:$B,SMALL(IF(Основной!#REF!=\"ЮТ\",ROW(Основной!$2:$2225)),ROW(A7))),\"\")","v":""}]
[null,{"$f":"IFERROR(INDEX(Основной!$B:$B,SMALL(IF(Основной!#REF!=\"ЮТ\",ROW(Основной!$2:$2225)),ROW(A8))),\"\")","v":""}]
[null,{"$f":"IFERROR(INDEX(Основной!$B:$B,SMALL(IF(Основной!#REF!=\"ЮТ\",ROW(Основной!$2:$2225)),ROW(A9))),\"\")","v":""}]
[null,{"$f":"IFERROR(INDEX(Основной!$B:$B,SMALL(IF(Основной!#REF!=\"ЮТ\",ROW(Основной!$2:$2225)),ROW(A10))),\"\")","v":""}]
[null,{"$f":"IFERROR(INDEX(Основной!$B:$B,SMALL(IF(Основной!#REF!=\"ЮТ\",ROW(Основной!$2:$2225)),ROW(A11))),\"\")","v":""}]
[null,{"$f":"IFERROR(INDEX(Основной!$B:$B,SMALL(IF(Основной!#REF!=\"ЮТ\",ROW(Основной!$2:$2225)),ROW(A12))),\"\")","v":""}]
[null,{"$f":"IFERROR(INDEX(Основной!$B:$B,SMALL(IF(Основной!#REF!=\"ЮТ\",ROW(Основной!$2:$2225)),ROW(A13))),\"\")","v":""}]
[null,{"$f":"IFERROR(INDEX(Основной!$B:$B,SMALL(IF(Основной!#REF!=\"ЮТ\",ROW(Основной!$2:$2225)),ROW(A14))),\"\")","v":""}]
[null,{"$f":"IFERROR(INDEX(Основной!$B:$B,SMALL(IF(Основной!#REF!=\"ЮТ\",ROW(Основной!$2:$2225)),ROW(A15))),\"\")","v":""}]
[null,{"$f":"IFERROR(INDEX(Основной!$B:$B,SMALL(IF(Основной!#REF!=\"ЮТ\",ROW(Основной!$2:$2225)),ROW(A16))),\"\")","v":""}]
[null,{"$f":"IFERROR(INDEX(Основной!$B:$B,SMALL(IF(Основной!#REF!=\"ЮТ\",ROW(Основной!$2:$2225)),ROW(A17))),\"\")","v":""}]
[null,{"$f":"IFERROR(INDEX(Основной!$B:$B,SMALL(IF(Основной!#REF!=\"ЮТ\",ROW(Основной!$2:$2225)),ROW(A18))),\"\")","v":""}]
[null,{"$f":"IFERROR(INDEX(Основной!$B:$B,SMALL(IF(Основной!#REF!=\"ЮТ\",ROW(Основной!$2:$2225)),ROW(A19))),\"\")","v":""}]
[null,{"$f":"IFERROR(INDEX(Основной!$B:$B,SMALL(IF(Основной!#REF!=\"ЮТ\",ROW(Основной!$2:$2225)),ROW(A20))),\"\")","v":""}]
[null,{"$f":"IFERROR(INDEX(Основной!$B:$B,SMALL(IF(Основной!#REF!=\"ЮТ\",ROW(Основной!$2:$2225)),ROW(A21))),\"\")","v":""}]
[null,{"$f":"IFERROR(INDEX(Основной!$B:$B,SMALL(IF(Основной!#REF!=\"ЮТ\",ROW(Основной!$2:$2225)),ROW(A22))),\"\")","v":""}]
[null,{"$f":"IFERROR(INDEX(Основной!$B:$B,SMALL(IF(Основной!#REF!=\"ЮТ\",ROW(Основной!$2:$2225)),ROW(A23))),\"\")","v":""}]
[null,{"$f":"IFERROR(INDEX(Основной!$B:$B,SMALL(IF(Основной!#REF!=\"ЮТ\",ROW(Основной!$2:$2225)),ROW(A24))),\"\")","v":""}]
[null,{"$f":"IFERROR(INDEX(Основной!$B:$B,SMALL(IF(Основной!#REF!=\"ЮТ\",ROW(Основной!$2:$2225)),ROW(A25))),\"\")","v":""}]
[null,{"$f":"IFERROR(INDEX(Основной!$B:$B,SMALL(IF(Основной!#REF!=\"ЮТ\",ROW(Основной!$2:$2225)),ROW(A26))),\"\")","v":""}]
[null,{"$f":"IFERROR(INDEX(Основной!$B:$B,SMALL(IF(Основной!#REF!=\"ЮТ\",ROW(Основной!$2:$2225)),ROW(A27))),\"\")","v":""}]
[null,{"$f":"IFERROR(INDEX(Основной!$B:$B,SMALL(IF(Основной!#REF!=\"ЮТ\",ROW(Основной!$2:$2225)),ROW(A28))),\"\")","v":""}]
[null,{"$f":"IFERROR(INDEX(Основной!$B:$B,SMALL(IF(Основной!#REF!=\"ЮТ\",ROW(Основной!$2:$2225)),ROW(A29))),\"\")","v":""}]
[null,{"$f":"IFERROR(INDEX(Основной!$B:$B,SMALL(IF(Основной!#REF!=\"ЮТ\",ROW(Основной!$2:$2225)),ROW(A30))),\"\")","v":""}]
[null,{"$f":"IFERROR(INDEX(Основной!$B:$B,SMALL(IF(Основной!#REF!=\"ЮТ\",ROW(Основной!$2:$2225)),ROW(A31))),\"\")","v":""}]
[null,{"$f":"IFERROR(INDEX(Основной!$B:$B,SMALL(IF(Основной!#REF!=\"ЮТ\",ROW(Основной!$2:$2225)),ROW(A32))),\"\")","v":""}]
[null,{"$f":"IFERROR(INDEX(Основной!$B:$B,SMALL(IF(Основной!#REF!=\"ЮТ\",ROW(Основной!$2:$2225)),ROW(A33))),\"\")","v":""}]
[null,{"$f":"IFERROR(INDEX(Основной!$B:$B,SMALL(IF(Основной!#REF!=\"ЮТ\",ROW(Основной!$2:$2225)),ROW(A34))),\"\")","v":""}]