{"text_format":"1","workbook":"xlsx","n_sheets":2,"sheets":["Нак1","Модель"],"not_rendered":{"charts":0,"images":0,"macros":1,"external_links":1,"defined_names":22,"comments":0,"pivot_tables":0},"unopened":[],"bounds":{"document_bytes":16777216,"sheet_cells":100000,"rows_first":2000,"rows_last":500,"rows_between":2000,"halvings":0,"cell_chars":16384,"cell_head_chars":4096},"cells_cut":0,"cells_raw":0,"read":"whole","date_system":"1900"}

{"sheet":"Нак1","index":0,"n_rows":130,"n_cols":5,"rows_kept":130,"cut":false,"hidden":false,"merged":[[1,0,1,1],[0,0,0,1]]}
["Поставщик: "]
["Покупатель:",null,null,"Дата:",{"$f":"TODAY()","v":"2019-09-23"}]
["№ п/п","                                                   aaaaТовар","Кол-во, шт.","Цена, руб.","Сумма, руб."]
[{"$f":"IF(OR(ТабЧастьНакладной[[#This Row],[                                                   aaaaТовар]]=\"\",RIGHTB(ТабЧастьНакладной[[#This Row],[                                                   aaaaТовар]])=\".\"),\"\",IFERROR(VLOOKUP(9E+307,A$1:INDEX(A:A,ROW()-1),1),)+1)","v":1},"Антрацит трико, светло-серый, размер 42, ШК 2000003665655",1,{"$f":"VLOOKUP(ТабЧастьНакладной[[                                                   aaaaТовар]],#REF!,2,0)","v":{"$error":"#REF!"}},{"$f":"C4*D4","v":{"$error":"#REF!"}}]
[{"$f":"IF(OR(ТабЧастьНакладной[[#This Row],[                                                   aaaaТовар]]=\"\",RIGHTB(ТабЧастьНакладной[[#This Row],[                                                   aaaaТовар]])=\".\"),\"\",IFERROR(VLOOKUP(9E+307,A$1:INDEX(A:A,ROW()-1),1),)+1)","v":2},"Антрацит трико, светло-серый, размер 44, ШК 2000003665662",2,{"$f":"VLOOKUP(ТабЧастьНакладной[[                                                   aaaaТовар]],#REF!,2,0)","v":{"$error":"#REF!"}},{"$f":"C5*D5","v":{"$error":"#REF!"}}]
[{"$f":"IF(OR(ТабЧастьНакладной[[#This Row],[                                                   aaaaТовар]]=\"\",RIGHTB(ТабЧастьНакладной[[#This Row],[                                                   aaaaТовар]])=\".\"),\"\",IFERROR(VLOOKUP(9E+307,A$1:INDEX(A:A,ROW()-1),1),)+1)","v":3},"Антрацит трико, светло-серый, размер 46, ШК 2000003665679",3,{"$f":"VLOOKUP(ТабЧастьНакладной[[                                                   aaaaТовар]],#REF!,2,0)","v":{"$error":"#REF!"}},{"$f":"C6*D6","v":{"$error":"#REF!"}}]
[{"$f":"IF(OR(ТабЧастьНакладной[[#This Row],[                                                   aaaaТовар]]=\"\",RIGHTB(ТабЧастьНакладной[[#This Row],[                                                   aaaaТовар]])=\".\"),\"\",IFERROR(VLOOKUP(9E+307,A$1:INDEX(A:A,ROW()-1),1),)+1)","v":4},"Антрацит трико, светло-серый, размер 48, ШК 2000003665686",4,{"$f":"VLOOKUP(ТабЧастьНакладной[[                                                   aaaaТовар]],#REF!,2,0)","v":{"$error":"#REF!"}},{"$f":"C7*D7","v":{"$error":"#REF!"}}]
[{"$f":"IF(OR(ТабЧастьНакладной[[#This Row],[                                                   aaaaТовар]]=\"\",RIGHTB(ТабЧастьНакладной[[#This Row],[                                                   aaaaТовар]])=\".\"),\"\",IFERROR(VLOOKUP(9E+307,A$1:INDEX(A:A,ROW()-1),1),)+1)","v":5},"Антрацит трико, светло-серый, размер 50, ШК 2000003665693",5,{"$f":"VLOOKUP(ТабЧастьНакладной[[                                                   aaaaТовар]],#REF!,2,0)","v":{"$error":"#REF!"}},{"$f":"C8*D8","v":{"$error":"#REF!"}}]
[{"$f":"IF(OR(ТабЧастьНакладной[[#This Row],[                                                   aaaaТовар]]=\"\",RIGHTB(ТабЧастьНакладной[[#This Row],[                                                   aaaaТовар]])=\".\"),\"\",IFERROR(VLOOKUP(9E+307,A$1:INDEX(A:A,ROW()-1),1),)+1)","v":6},"Антрацит трико, светло-серый, размер 52, ШК 2000003665709",6,{"$f":"VLOOKUP(ТабЧастьНакладной[[                                                   aaaaТовар]],#REF!,2,0)","v":{"$error":"#REF!"}},{"$f":"C9*D9","v":{"$error":"#REF!"}}]
[{"$f":"IF(OR(ТабЧастьНакладной[[#This Row],[                                                   aaaaТовар]]=\"\",RIGHTB(ТабЧастьНакладной[[#This Row],[                                                   aaaaТовар]])=\".\"),\"\",IFERROR(VLOOKUP(9E+307,A$1:INDEX(A:A,ROW()-1),1),)+1)","v":""},"Антрацит трико, светло-серый.",21,{"$f":"VLOOKUP(ТабЧастьНакладной[[                                                   aaaaТовар]],#REF!,2,0)","v":{"$error":"#REF!"}},{"$f":"C10*D10","v":{"$error":"#REF!"}}]
[{"$f":"IF(OR(ТабЧастьНакладной[[#This Row],[                                                   aaaaТовар]]=\"\",RIGHTB(ТабЧастьНакладной[[#This Row],[                                                   aaaaТовар]])=\".\"),\"\",IFERROR(VLOOKUP(9E+307,A$1:INDEX(A:A,ROW()-1),1),)+1)","v":7},"Брейк трико, черный, размер 30, ШК 2000003750221",1,{"$f":"VLOOKUP(ТабЧастьНакладной[[                                                   aaaaТовар]],#REF!,2,0)","v":{"$error":"#REF!"}},{"$f":"C11*D11","v":{"$error":"#REF!"}}]
[{"$f":"IF(OR(ТабЧастьНакладной[[#This Row],[                                                   aaaaТовар]]=\"\",RIGHTB(ТабЧастьНакладной[[#This Row],[                                                   aaaaТовар]])=\".\"),\"\",IFERROR(VLOOKUP(9E+307,A$1:INDEX(A:A,ROW()-1),1),)+1)","v":8},"Брейк трико, черный, размер 32, ШК 2000003750238",2,{"$f":"VLOOKUP(ТабЧастьНакладной[[                                                   aaaaТовар]],#REF!,2,0)","v":{"$error":"#REF!"}},{"$f":"C12*D12","v":{"$error":"#REF!"}}]
[{"$f":"IF(OR(ТабЧастьНакладной[[#This Row],[                                                   aaaaТовар]]=\"\",RIGHTB(ТабЧастьНакладной[[#This Row],[                                                   aaaaТовар]])=\".\"),\"\",IFERROR(VLOOKUP(9E+307,A$1:INDEX(A:A,ROW()-1),1),)+1)","v":9},"Брейк трико, черный, размер 34, ШК 2000003750245",3,{"$f":"VLOOKUP(ТабЧастьНакладной[[                                                   aaaaТовар]],#REF!,2,0)","v":{"$error":"#REF!"}},{"$f":"C13*D13","v":{"$error":"#REF!"}}]
[{"$f":"IF(OR(ТабЧастьНакладной[[#This Row],[                                                   aaaaТовар]]=\"\",RIGHTB(ТабЧастьНакладной[[#This Row],[                                                   aaaaТовар]])=\".\"),\"\",IFERROR(VLOOKUP(9E+307,A$1:INDEX(A:A,ROW()-1),1),)+1)","v":10},"Брейк трико, черный, размер 36, ШК 2000003750252",4,{"$f":"VLOOKUP(ТабЧастьНакладной[[                                                   aaaaТовар]],#REF!,2,0)","v":{"$error":"#REF!"}},{"$f":"C14*D14","v":{"$error":"#REF!"}}]
[{"$f":"IF(OR(ТабЧастьНакладной[[#This Row],[                                                   aaaaТовар]]=\"\",RIGHTB(ТабЧастьНакладной[[#This Row],[                                                   aaaaТовар]])=\".\"),\"\",IFERROR(VLOOKUP(9E+307,A$1:INDEX(A:A,ROW()-1),1),)+1)","v":11},"Брейк трико, черный, размер 36, Штрих-код 2000003750252",5,{"$f":"VLOOKUP(ТабЧастьНакладной[[                                                   aaaaТовар]],#REF!,2,0)","v":{"$error":"#REF!"}},{"$f":"C15*D15","v":{"$error":"#REF!"}}]
[{"$f":"IF(OR(ТабЧастьНакладной[[#This Row],[                                                   aaaaТовар]]=\"\",RIGHTB(ТабЧастьНакладной[[#This Row],[                                                   aaaaТовар]])=\".\"),\"\",IFERROR(VLOOKUP(9E+307,A$1:INDEX(A:A,ROW()-1),1),)+1)","v":12},"Брейк трико, черный, размер 38, ШК 2000003750269",6,{"$f":"VLOOKUP(ТабЧастьНакладной[[                                                   aaaaТовар]],#REF!,2,0)","v":{"$error":"#REF!"}},{"$f":"C16*D16","v":{"$error":"#REF!"}}]
[{"$f":"IF(OR(ТабЧастьНакладной[[#This Row],[                                                   aaaaТовар]]=\"\",RIGHTB(ТабЧастьНакладной[[#This Row],[                                                   aaaaТовар]])=\".\"),\"\",IFERROR(VLOOKUP(9E+307,A$1:INDEX(A:A,ROW()-1),1),)+1)","v":13},"Брейк трико, черный, размер 40, ШК 2000003750276",7,{"$f":"VLOOKUP(ТабЧастьНакладной[[                                                   aaaaТовар]],#REF!,2,0)","v":{"$error":"#REF!"}},{"$f":"C17*D17","v":{"$error":"#REF!"}}]
[{"$f":"IF(OR(ТабЧастьНакладной[[#This Row],[                                                   aaaaТовар]]=\"\",RIGHTB(ТабЧастьНакладной[[#This Row],[                                                   aaaaТовар]])=\".\"),\"\",IFERROR(VLOOKUP(9E+307,A$1:INDEX(A:A,ROW()-1),1),)+1)","v":14},"Брейк трико, черный, размер 42, ШК 2000003750283",8,{"$f":"VLOOKUP(ТабЧастьНакладной[[                                                   aaaaТовар]],#REF!,2,0)","v":{"$error":"#REF!"}},{"$f":"C18*D18","v":{"$error":"#REF!"}}]
[{"$f":"IF(OR(ТабЧастьНакладной[[#This Row],[                                                   aaaaТовар]]=\"\",RIGHTB(ТабЧастьНакладной[[#This Row],[                                                   aaaaТовар]])=\".\"),\"\",IFERROR(VLOOKUP(9E+307,A$1:INDEX(A:A,ROW()-1),1),)+1)","v":""},"Брейк трико, черный.",36,{"$f":"VLOOKUP(ТабЧастьНакладной[[                                                   aaaaТовар]],#REF!,2,0)","v":{"$error":"#REF!"}},{"$f":"C19*D19","v":{"$error":"#REF!"}}]
[{"$f":"IF(OR(ТабЧастьНакладной[[#This Row],[                                                   aaaaТовар]]=\"\",RIGHTB(ТабЧастьНакладной[[#This Row],[                                                   aaaaТовар]])=\".\"),\"\",IFERROR(VLOOKUP(9E+307,A$1:INDEX(A:A,ROW()-1),1),)+1)","v":15},"Вуаль футболка, молочный, размер 44, ШК 4650105315002",1,{"$f":"VLOOKUP(ТабЧастьНакладной[[                                                   aaaaТовар]],#REF!,2,0)","v":{"$error":"#REF!"}},{"$f":"C20*D20","v":{"$error":"#REF!"}}]
[{"$f":"IF(OR(ТабЧастьНакладной[[#This Row],[                                                   aaaaТовар]]=\"\",RIGHTB(ТабЧастьНакладной[[#This Row],[                                                   aaaaТовар]])=\".\"),\"\",IFERROR(VLOOKUP(9E+307,A$1:INDEX(A:A,ROW()-1),1),)+1)","v":16},"Вуаль футболка, молочный, размер 46, ШК 4650105315019",2,{"$f":"VLOOKUP(ТабЧастьНакладной[[                                                   aaaaТовар]],#REF!,2,0)","v":{"$error":"#REF!"}},{"$f":"C21*D21","v":{"$error":"#REF!"}}]
[{"$f":"IF(OR(ТабЧастьНакладной[[#This Row],[                                                   aaaaТовар]]=\"\",RIGHTB(ТабЧастьНакладной[[#This Row],[                                                   aaaaТовар]])=\".\"),\"\",IFERROR(VLOOKUP(9E+307,A$1:INDEX(A:A,ROW()-1),1),)+1)","v":17},"Вуаль футболка, молочный, размер 48, ШК 4650105315026",3,{"$f":"VLOOKUP(ТабЧастьНакладной[[                                                   aaaaТовар]],#REF!,2,0)","v":{"$error":"#REF!"}},{"$f":"C22*D22","v":{"$error":"#REF!"}}]
[{"$f":"IF(OR(ТабЧастьНакладной[[#This Row],[                                                   aaaaТовар]]=\"\",RIGHTB(ТабЧастьНакладной[[#This Row],[                                                   aaaaТовар]])=\".\"),\"\",IFERROR(VLOOKUP(9E+307,A$1:INDEX(A:A,ROW()-1),1),)+1)","v":18},"Вуаль футболка, молочный, размер 50, ШК 4650105315033",4,{"$f":"VLOOKUP(ТабЧастьНакладной[[                                                   aaaaТовар]],#REF!,2,0)","v":{"$error":"#REF!"}},{"$f":"C23*D23","v":{"$error":"#REF!"}}]
[{"$f":"IF(OR(ТабЧастьНакладной[[#This Row],[                                                   aaaaТовар]]=\"\",RIGHTB(ТабЧастьНакладной[[#This Row],[                                                   aaaaТовар]])=\".\"),\"\",IFERROR(VLOOKUP(9E+307,A$1:INDEX(A:A,ROW()-1),1),)+1)","v":19},"Вуаль футболка, молочный, размер 52, ШК 4650105315040",5,{"$f":"VLOOKUP(ТабЧастьНакладной[[                                                   aaaaТовар]],#REF!,2,0)","v":{"$error":"#REF!"}},{"$f":"C24*D24","v":{"$error":"#REF!"}}]
[{"$f":"IF(OR(ТабЧастьНакладной[[#This Row],[                                                   aaaaТовар]]=\"\",RIGHTB(ТабЧастьНакладной[[#This Row],[                                                   aaaaТовар]])=\".\"),\"\",IFERROR(VLOOKUP(9E+307,A$1:INDEX(A:A,ROW()-1),1),)+1)","v":20},"Вуаль футболка, молочный, размер 54, ШК 4650105315057",6,{"$f":"VLOOKUP(ТабЧастьНакладной[[                                                   aaaaТовар]],#REF!,2,0)","v":{"$error":"#REF!"}},{"$f":"C25*D25","v":{"$error":"#REF!"}}]
[{"$f":"IF(OR(ТабЧастьНакладной[[#This Row],[                                                   aaaaТовар]]=\"\",RIGHTB(ТабЧастьНакладной[[#This Row],[                                                   aaaaТовар]])=\".\"),\"\",IFERROR(VLOOKUP(9E+307,A$1:INDEX(A:A,ROW()-1),1),)+1)","v":21},"Вуаль футболка, молочный, размер 56, ШК 4650105315064",7,{"$f":"VLOOKUP(ТабЧастьНакладной[[                                                   aaaaТовар]],#REF!,2,0)","v":{"$error":"#REF!"}},{"$f":"C26*D26","v":{"$error":"#REF!"}}]
[{"$f":"IF(OR(ТабЧастьНакладной[[#This Row],[                                                   aaaaТовар]]=\"\",RIGHTB(ТабЧастьНакладной[[#This Row],[                                                   aaaaТовар]])=\".\"),\"\",IFERROR(VLOOKUP(9E+307,A$1:INDEX(A:A,ROW()-1),1),)+1)","v":22},"Вуаль футболка, молочный, размер 58, ШК 4650105315071",8,{"$f":"VLOOKUP(ТабЧастьНакладной[[                                                   aaaaТовар]],#REF!,2,0)","v":{"$error":"#REF!"}},{"$f":"C27*D27","v":{"$error":"#REF!"}}]
[{"$f":"IF(OR(ТабЧастьНакладной[[#This Row],[                                                   aaaaТовар]]=\"\",RIGHTB(ТабЧастьНакладной[[#This Row],[                                                   aaaaТовар]])=\".\"),\"\",IFERROR(VLOOKUP(9E+307,A$1:INDEX(A:A,ROW()-1),1),)+1)","v":""},"Вуаль футболка, молочный.",36,{"$f":"VLOOKUP(ТабЧастьНакладной[[                                                   aaaaТовар]],#REF!,2,0)","v":{"$error":"#REF!"}},{"$f":"C28*D28","v":{"$error":"#REF!"}}]
[{"$f":"IF(OR(ТабЧастьНакладной[[#This Row],[                                                   aaaaТовар]]=\"\",RIGHTB(ТабЧастьНакладной[[#This Row],[                                                   aaaaТовар]])=\".\"),\"\",IFERROR(VLOOKUP(9E+307,A$1:INDEX(A:A,ROW()-1),1),)+1)","v":23},"Вуаль футболка, черный, размер 44, ШК 4650105315088",1,{"$f":"VLOOKUP(ТабЧастьНакладной[[                                                   aaaaТовар]],#REF!,2,0)","v":{"$error":"#REF!"}},{"$f":"C29*D29","v":{"$error":"#REF!"}}]
[{"$f":"IF(OR(ТабЧастьНакладной[[#This Row],[                                                   aaaaТовар]]=\"\",RIGHTB(ТабЧастьНакладной[[#This Row],[                                                   aaaaТовар]])=\".\"),\"\",IFERROR(VLOOKUP(9E+307,A$1:INDEX(A:A,ROW()-1),1),)+1)","v":24},"Вуаль футболка, черный, размер 46, ШК 4650105315095",2,{"$f":"VLOOKUP(ТабЧастьНакладной[[                                                   aaaaТовар]],#REF!,2,0)","v":{"$error":"#REF!"}},{"$f":"C30*D30","v":{"$error":"#REF!"}}]
[{"$f":"IF(OR(ТабЧастьНакладной[[#This Row],[                                                   aaaaТовар]]=\"\",RIGHTB(ТабЧастьНакладной[[#This Row],[                                                   aaaaТовар]])=\".\"),\"\",IFERROR(VLOOKUP(9E+307,A$1:INDEX(A:A,ROW()-1),1),)+1)","v":25},"Вуаль футболка, черный, размер 48, ШК 4650105315101",3,{"$f":"VLOOKUP(ТабЧастьНакладной[[                                                   aaaaТовар]],#REF!,2,0)","v":{"$error":"#REF!"}},{"$f":"C31*D31","v":{"$error":"#REF!"}}]
[{"$f":"IF(OR(ТабЧастьНакладной[[#This Row],[                                                   aaaaТовар]]=\"\",RIGHTB(ТабЧастьНакладной[[#This Row],[                                                   aaaaТовар]])=\".\"),\"\",IFERROR(VLOOKUP(9E+307,A$1:INDEX(A:A,ROW()-1),1),)+1)","v":26},"Вуаль футболка, черный, размер 50, ШК 4650105315118",4,{"$f":"VLOOKUP(ТабЧастьНакладной[[                                                   aaaaТовар]],#REF!,2,0)","v":{"$error":"#REF!"}},{"$f":"C32*D32","v":{"$error":"#REF!"}}]
[{"$f":"IF(OR(ТабЧастьНакладной[[#This Row],[                                                   aaaaТовар]]=\"\",RIGHTB(ТабЧастьНакладной[[#This Row],[                                                   aaaaТовар]])=\".\"),\"\",IFERROR(VLOOKUP(9E+307,A$1:INDEX(A:A,ROW()-1),1),)+1)","v":27},"Вуаль футболка, черный, размер 52, ШК 4650105315125",5,{"$f":"VLOOKUP(ТабЧастьНакладной[[                                                   aaaaТовар]],#REF!,2,0)","v":{"$error":"#REF!"}},{"$f":"C33*D33","v":{"$error":"#REF!"}}]
[{"$f":"IF(OR(ТабЧастьНакладной[[#This Row],[                                                   aaaaТовар]]=\"\",RIGHTB(ТабЧастьНакладной[[#This Row],[                                                   aaaaТовар]])=\".\"),\"\",IFERROR(VLOOKUP(9E+307,A$1:INDEX(A:A,ROW()-1),1),)+1)","v":28},"Вуаль футболка, черный, размер 54, ШК 4650105315132",6,{"$f":"VLOOKUP(ТабЧастьНакладной[[                                                   aaaaТовар]],#REF!,2,0)","v":{"$error":"#REF!"}},{"$f":"C34*D34","v":{"$error":"#REF!"}}]
[{"$f":"IF(OR(ТабЧастьНакладной[[#This Row],[                                                   aaaaТовар]]=\"\",RIGHTB(ТабЧастьНакладной[[#This Row],[                                                   aaaaТовар]])=\".\"),\"\",IFERROR(VLOOKUP(9E+307,A$1:INDEX(A:A,ROW()-1),1),)+1)","v":29},"Вуаль футболка, черный, размер 56, ШК 4650105315149",7,{"$f":"VLOOKUP(ТабЧастьНакладной[[                                                   aaaaТовар]],#REF!,2,0)","v":{"$error":"#REF!"}},{"$f":"C35*D35","v":{"$error":"#REF!"}}]
[{"$f":"IF(OR(ТабЧастьНакладной[[#This Row],[                                                   aaaaТовар]]=\"\",RIGHTB(ТабЧастьНакладной[[#This Row],[                                                   aaaaТовар]])=\".\"),\"\",IFERROR(VLOOKUP(9E+307,A$1:INDEX(A:A,ROW()-1),1),)+1)","v":30},"Вуаль футболка, черный, размер 58, ШК 4650105315156",8,{"$f":"VLOOKUP(ТабЧастьНакладной[[                                                   aaaaТовар]],#REF!,2,0)","v":{"$error":"#REF!"}},{"$f":"C36*D36","v":{"$error":"#REF!"}}]
[{"$f":"IF(OR(ТабЧастьНакладной[[#This Row],[                                                   aaaaТовар]]=\"\",RIGHTB(ТабЧастьНакладной[[#This Row],[                                                   aaaaТовар]])=\".\"),\"\",IFERROR(VLOOKUP(9E+307,A$1:INDEX(A:A,ROW()-1),1),)+1)","v":""},"Вуаль футболка, черный.",36,{"$f":"VLOOKUP(ТабЧастьНакладной[[                                                   aaaaТовар]],#REF!,2,0)","v":{"$error":"#REF!"}},{"$f":"C37*D37","v":{"$error":"#REF!"}}]
[{"$f":"IF(OR(ТабЧастьНакладной[[#This Row],[                                                   aaaaТовар]]=\"\",RIGHTB(ТабЧастьНакладной[[#This Row],[                                                   aaaaТовар]])=\".\"),\"\",IFERROR(VLOOKUP(9E+307,A$1:INDEX(A:A,ROW()-1),1),)+1)","v":31},"Вэст футболка, бордовый, размер 46, ШК 4650105293003",1,{"$f":"VLOOKUP(ТабЧастьНакладной[[                                                   aaaaТовар]],#REF!,2,0)","v":{"$error":"#REF!"}},{"$f":"C38*D38","v":{"$error":"#REF!"}}]
[{"$f":"IF(OR(ТабЧастьНакладной[[#This Row],[                                                   aaaaТовар]]=\"\",RIGHTB(ТабЧастьНакладной[[#This Row],[                                                   aaaaТовар]])=\".\"),\"\",IFERROR(VLOOKUP(9E+307,A$1:INDEX(A:A,ROW()-1),1),)+1)","v":32},"Вэст футболка, бордовый, размер 48, ШК 4650105293010",2,{"$f":"VLOOKUP(ТабЧастьНакладной[[                                                   aaaaТовар]],#REF!,2,0)","v":{"$error":"#REF!"}},{"$f":"C39*D39","v":{"$error":"#REF!"}}]
[{"$f":"IF(OR(ТабЧастьНакладной[[#This Row],[                                                   aaaaТовар]]=\"\",RIGHTB(ТабЧастьНакладной[[#This Row],[                                                   aaaaТовар]])=\".\"),\"\",IFERROR(VLOOKUP(9E+307,A$1:INDEX(A:A,ROW()-1),1),)+1)","v":33},"Вэст футболка, бордовый, размер 50, ШК 4650105293027",3,{"$f":"VLOOKUP(ТабЧастьНакладной[[                                                   aaaaТовар]],#REF!,2,0)","v":{"$error":"#REF!"}},{"$f":"C40*D40","v":{"$error":"#REF!"}}]
{"$rows_left_out":91}
{"sheet":"Модель","index":1,"n_rows":201,"n_cols":8,"rows_kept":201,"cut":false,"hidden":false,"merged":[]}
["Модель ","Цвет","Размер","Штрих-код","Товар","Цена",null,"Магазин"]
["Абсолют футболка","графит",46,4650105007600,"Абсолют футболка, графит, размер46, ШК 4650105007600",230]
["Абсолют футболка","индиго",46,4650105007846,"Абсолют футболка, индиго, размер46, ШК 4650105007846",230,null,"Покупатель: ООО \"Натали\", Ивтекмаш"]
["Антрацит трико","светло-серый",42,2000003665655,"Антрацит трико, светло-серый, размер 42, ШК 2000003665655",300,null,"Покупатель: ООО \"Натали\", ТП 69"]
["Антрацит трико","светло-серый",44,2000003665662,"Антрацит трико, светло-серый, размер 44, ШК 2000003665662",300,null,"Покупатель: ООО \"Натали\", РИО 56"]
["Антрацит трико","светло-серый",46,2000003665679,"Антрацит трико, светло-серый, размер 46, ШК 2000003665679",300,null,"Покупатель: ООО \"Натали\", РИО 162"]
["Антрацит трико","светло-серый",48,2000003665686,"Антрацит трико, светло-серый, размер 48, ШК 2000003665686",300,null,"Покупатель: ООО \"Натали\", ТП 84 магазин"]
["Антрацит трико","светло-серый",50,2000003665693,"Антрацит трико, светло-серый, размер 50, ШК 2000003665693",300,null,"Покупатель: ООО \"Натали\", ТП 84 скалад"]
["Антрацит трико","светло-серый",52,2000003665709,"Антрацит трико, светло-серый, размер 52, ШК 2000003665709",300]
["Брейк трико","черный",30,2000003750221,"Брейк трико, черный, размер 30, ШК 2000003750221",250]
["Брейк трико","черный",32,2000003750238,"Брейк трико, черный, размер 32, ШК 2000003750238",250]
["Брейк трико","черный",34,2000003750245,"Брейк трико, черный, размер 34, ШК 2000003750245",250]
["Брейк трико","черный",36,2000003750252,"Брейк трико, черный, размер 36, ШК 2000003750252",250]
["Брейк трико","черный",38,2000003750269,"Брейк трико, черный, размер 38, ШК 2000003750269",250]
["Брейк трико","черный",40,2000003750276,"Брейк трико, черный, размер 40, ШК 2000003750276",250]
["Брейк трико","черный",42,2000003750283,"Брейк трико, черный, размер 42, ШК 2000003750283",250]
["Вуаль футболка","молочный",44,4650105315002,"Вуаль футболка, молочный, размер 44, ШК 4650105315002",270]
["Вуаль футболка","молочный",46,4650105315019,"Вуаль футболка, молочный, размер 46, ШК 4650105315019",270]
["Вуаль футболка","молочный",48,4650105315026,"Вуаль футболка, молочный, размер 48, ШК 4650105315026",270]
["Вуаль футболка","молочный",50,4650105315033,"Вуаль футболка, молочный, размер 50, ШК 4650105315033",270]
["Вуаль футболка","молочный",52,4650105315040,"Вуаль футболка, молочный, размер 52, ШК 4650105315040",270]
["Вуаль футболка","молочный",54,4650105315057,"Вуаль футболка, молочный, размер 54, ШК 4650105315057",270]
["Вуаль футболка","молочный",56,4650105315064,"Вуаль футболка, молочный, размер 56, ШК 4650105315064",270]
["Вуаль футболка","молочный",58,4650105315071,"Вуаль футболка, молочный, размер 58, ШК 4650105315071",270]
["Вуаль футболка","черный",44,4650105315088,"Вуаль футболка, черный, размер 44, ШК 4650105315088",270]
["Вуаль футболка","черный",46,4650105315095,"Вуаль футболка, черный, размер 46, ШК 4650105315095",270]
["Вуаль футболка","черный",48,4650105315101,"Вуаль футболка, черный, размер 48, ШК 4650105315101",270]
["Вуаль футболка","черный",50,4650105315118,"Вуаль футболка, черный, размер 50, ШК 4650105315118",270]
["Вуаль футболка","черный",52,4650105315125,"Вуаль футболка, черный, размер 52, ШК 4650105315125",270]
["Вуаль футболка","черный",54,4650105315132,"Вуаль футболка, черный, размер 54, ШК 4650105315132",270]
["Вуаль футболка","черный",56,4650105315149,"Вуаль футболка, черный, размер 56, ШК 4650105315149",270]
["Вуаль футболка","черный",58,4650105315156,"Вуаль футболка, черный, размер 58, ШК 4650105315156",270]
["Вэст футболка","бордовый",46,4650105293003,"Вэст футболка, бордовый, размер 46, ШК 4650105293003",270]
["Вэст футболка","бордовый",48,4650105293010,"Вэст футболка, бордовый, размер 48, ШК 4650105293010",270]
["Вэст футболка","бордовый",50,4650105293027,"Вэст футболка, бордовый, размер 50, ШК 4650105293027",270]
["Вэст футболка","бордовый",52,4650105293034,"Вэст футболка, бордовый, размер 52, ШК 4650105293034",270]
["Вэст футболка","бордовый",54,4650105293041,"Вэст футболка, бордовый, размер 54, ШК 4650105293041",270]
["Вэст футболка","бордовый",56,4650105293058,"Вэст футболка, бордовый, размер 56, ШК 4650105293058",270]
["Вэст футболка","бордовый",58,4650105293065,"Вэст футболка, бордовый, размер 58, ШК 4650105293065",270]
["Вэст футболка","бордовый",60,4650105293072,"Вэст футболка, бордовый, размер 60, ШК 4650105293072",270]
{"$rows_left_out":161}