{"text_format":"1","workbook":"xlsx","n_sheets":3,"sheets":["Нак1","Пример","Модель"],"not_rendered":{"charts":0,"images":0,"macros":1,"external_links":0,"defined_names":12,"comments":0,"pivot_tables":0},"unopened":[],"bounds":{"document_bytes":16777216,"sheet_cells":100000,"rows_first":2000,"rows_last":500,"rows_between":2000,"halvings":0,"cell_chars":16384,"cell_head_chars":4096},"cells_cut":0,"cells_raw":0,"read":"whole","date_system":"1900"}

{"sheet":"Нак1","index":0,"n_rows":37,"n_cols":5,"rows_kept":37,"cut":false,"hidden":false,"merged":[[1,0,1,1],[0,0,0,1]]}
["Поставщик: "]
["Покупатель:",null,null,"Дата:",{"$f":"TODAY()","v":"2019-09-13"}]
["№ п/п","                                                   aaaaТовар","Кол-во, шт.","Цена, руб.","Сумма, руб."]
[{"$f":"ROW()-3","v":1},"Грин костюм, графит, размер 42. Штрих-код 4650105044629",12,{"$f":"VLOOKUP(ТабЧастьНакладной[[                                                   aaaaТовар]],Модель!$E$3:$F$953,2,0)","v":765},{"$f":"C4*D4","v":9180}]
[{"$f":"ROW()-3","v":2},"Грин костюм, графит, размер 44. Штрих-код 4650105044636",14,{"$f":"VLOOKUP(ТабЧастьНакладной[[                                                   aaaaТовар]],Модель!$E$3:$F$953,2,0)","v":765},{"$f":"C5*D5","v":10710}]
[{"$f":"ROW()-3","v":3},"Грин костюм, графит, размер 46. Штрих-код 4650105044643",23,{"$f":"VLOOKUP(ТабЧастьНакладной[[                                                   aaaaТовар]],Модель!$E$3:$F$953,2,0)","v":765},{"$f":"C6*D6","v":17595}]
[{"$f":"ROW()-3","v":4},"Грин костюм, графит, размер 48. Штрих-код 4650105044650",45,{"$f":"VLOOKUP(ТабЧастьНакладной[[                                                   aaaaТовар]],Модель!$E$3:$F$953,2,0)","v":765},{"$f":"C7*D7","v":34425}]
[{"$f":"ROW()-3","v":5},"Грин костюм, графит, размер 50. Штрих-код 4650105044667",67,{"$f":"VLOOKUP(ТабЧастьНакладной[[                                                   aaaaТовар]],Модель!$E$3:$F$953,2,0)","v":765},{"$f":"C8*D8","v":51255}]
[{"$f":"ROW()-3","v":6},"Грин костюм, графит, размер 52. Штрих-код 4650105044674",65,{"$f":"VLOOKUP(ТабЧастьНакладной[[                                                   aaaaТовар]],Модель!$E$3:$F$953,2,0)","v":765},{"$f":"C9*D9","v":49725}]
[{"$f":"ROW()-3","v":7},"Грин костюм, индиго, размер 42. Штрих-код:4650105044681",78,{"$f":"VLOOKUP(ТабЧастьНакладной[[                                                   aaaaТовар]],Модель!$E$3:$F$953,2,0)","v":765},{"$f":"C10*D10","v":59670}]
[{"$f":"ROW()-3","v":8},"Грин костюм, индиго, размер 44. Штрих-код:4650105044698",23,{"$f":"VLOOKUP(ТабЧастьНакладной[[                                                   aaaaТовар]],Модель!$E$3:$F$953,2,0)","v":765},{"$f":"C11*D11","v":17595}]
[{"$f":"ROW()-3","v":9},"Грин костюм, индиго, размер 46. Штрих-код:4650105044704",12,{"$f":"VLOOKUP(ТабЧастьНакладной[[                                                   aaaaТовар]],Модель!$E$3:$F$953,2,0)","v":765},{"$f":"C12*D12","v":9180}]
[{"$f":"ROW()-3","v":10},"Грин костюм, индиго, размер 48. Штрих-код:4650105044711",34,{"$f":"VLOOKUP(ТабЧастьНакладной[[                                                   aaaaТовар]],Модель!$E$3:$F$953,2,0)","v":765},{"$f":"C13*D13","v":26010}]
[{"$f":"ROW()-3","v":11},"Грин костюм, индиго, размер 50. Штрих-код:4650105044728",45,{"$f":"VLOOKUP(ТабЧастьНакладной[[                                                   aaaaТовар]],Модель!$E$3:$F$953,2,0)","v":765},{"$f":"C14*D14","v":34425}]
[{"$f":"ROW()-3","v":12},"Грин костюм, индиго, размер 52. Штрих-код:4650105044735",32,{"$f":"VLOOKUP(ТабЧастьНакладной[[                                                   aaaaТовар]],Модель!$E$3:$F$953,2,0)","v":765},{"$f":"C15*D15","v":24480}]
[{"$f":"ROW()-3","v":13},"Дерево туника, графит, размер 44, Штрих-код 4650105277355",1,{"$f":"VLOOKUP(ТабЧастьНакладной[[                                                   aaaaТовар]],Модель!$E$3:$F$953,2,0)","v":360},{"$f":"C16*D16","v":360}]
[{"$f":"ROW()-3","v":14},"Дерево туника, графит, размер 46, Штрих-код 4650105277362",2,{"$f":"VLOOKUP(ТабЧастьНакладной[[                                                   aaaaТовар]],Модель!$E$3:$F$953,2,0)","v":360},{"$f":"C17*D17","v":720}]
[{"$f":"ROW()-3","v":15},"Дерево туника, графит, размер 48, Штрих-код 4650105277379",3,{"$f":"VLOOKUP(ТабЧастьНакладной[[                                                   aaaaТовар]],Модель!$E$3:$F$953,2,0)","v":360},{"$f":"C18*D18","v":1080}]
[{"$f":"ROW()-3","v":16},"Дерево туника, графит, размер 50, Штрих-код 4650105277386",4,{"$f":"VLOOKUP(ТабЧастьНакладной[[                                                   aaaaТовар]],Модель!$E$3:$F$953,2,0)","v":360},{"$f":"C19*D19","v":1440}]
[{"$f":"ROW()-3","v":17},"Дерево туника, графит, размер 52, Штрих-код 4650105277393",5,{"$f":"VLOOKUP(ТабЧастьНакладной[[                                                   aaaaТовар]],Модель!$E$3:$F$953,2,0)","v":360},{"$f":"C20*D20","v":1800}]
[{"$f":"ROW()-3","v":18},"Дерево туника, графит, размер 54, Штрих-код 4650105277409",6,{"$f":"VLOOKUP(ТабЧастьНакладной[[                                                   aaaaТовар]],Модель!$E$3:$F$953,2,0)","v":360},{"$f":"C21*D21","v":2160}]
[{"$f":"ROW()-3","v":19},"Дерево туника, графит, размер 56, Штрих-код 4650105277416",7,{"$f":"VLOOKUP(ТабЧастьНакладной[[                                                   aaaaТовар]],Модель!$E$3:$F$953,2,0)","v":360},{"$f":"C22*D22","v":2520}]
[{"$f":"ROW()-3","v":20},"Дерево туника, графит, размер 58, Штрих-код 4650105277423",8,{"$f":"VLOOKUP(ТабЧастьНакладной[[                                                   aaaaТовар]],Модель!$E$3:$F$953,2,0)","v":360},{"$f":"C23*D23","v":2880}]
[{"$f":"ROW()-3","v":21},"Дерево туника, индиго, размер 44, Штрих-код 4650105277270",9,{"$f":"VLOOKUP(ТабЧастьНакладной[[                                                   aaaaТовар]],Модель!$E$3:$F$953,2,0)","v":360},{"$f":"C24*D24","v":3240}]
[{"$f":"ROW()-3","v":22},"Дзен кофта, меланж, размер 48. Штрих-код: 4650105137154",8,{"$f":"VLOOKUP(ТабЧастьНакладной[[                                                   aaaaТовар]],Модель!$E$3:$F$953,2,0)","v":320},{"$f":"C25*D25","v":2560}]
[{"$f":"ROW()-3","v":23},"Дзен кофта, меланж, размер 50. Штрих-код: 4650105137161",7,{"$f":"VLOOKUP(ТабЧастьНакладной[[                                                   aaaaТовар]],Модель!$E$3:$F$953,2,0)","v":320},{"$f":"C26*D26","v":2240}]
[{"$f":"ROW()-3","v":24},"Дзен кофта, меланж, размер 52. Штрих-код: 4650105137178",6,{"$f":"VLOOKUP(ТабЧастьНакладной[[                                                   aaaaТовар]],Модель!$E$3:$F$953,2,0)","v":320},{"$f":"C27*D27","v":1920}]
[{"$f":"ROW()-3","v":25},"Дымка футболка, белый, размер 44, Штрих-код 4650105315484",5,{"$f":"VLOOKUP(ТабЧастьНакладной[[                                                   aaaaТовар]],Модель!$E$3:$F$953,2,0)","v":250},{"$f":"C28*D28","v":1250}]
[{"$f":"ROW()-3","v":26},"Дымка футболка, белый, размер 46, Штрих-код 4650105315491",4,{"$f":"VLOOKUP(ТабЧастьНакладной[[                                                   aaaaТовар]],Модель!$E$3:$F$953,2,0)","v":250},{"$f":"C29*D29","v":1000}]
[{"$f":"ROW()-3","v":27},"Дымка футболка, белый, размер 48, Штрих-код 4650105315507",3,{"$f":"VLOOKUP(ТабЧастьНакладной[[                                                   aaaaТовар]],Модель!$E$3:$F$953,2,0)","v":250},{"$f":"C30*D30","v":750}]
[{"$f":"ROW()-3","v":28},null,null,{"$f":"VLOOKUP(ТабЧастьНакладной[[                                                   aaaaТовар]],Модель!$E$3:$F$953,2,0)","v":{"$error":"#N/A"}},{"$f":"C31*D31","v":{"$error":"#N/A"}}]
["Итог",null,null,null,{"$f":"SUMIF(ТабЧастьНакладной[Сумма, руб.],\"<1E100\")","v":370170}]
[null,null,null,"НДС не облагается"]
[{"$f":"\"Всего наименований:\"&\" \"&MAX(ТабЧастьНакладной[№ п/п])&\",\"&\" \"&\"на сумму\"&\" \"&СП&\" \"&\"руб.\"","v":"Всего наименований: 28, на сумму 370170 руб."}]
[{"$f":"SUBSTITUTE(PROPER(INDEX(n_4,MID(TEXT(СП,n0),1,1)+1)&INDEX(n0x,MID(TEXT(СП,n0),2,1)+1,MID(TEXT(СП,n0),3,1)+1)&IF(-MID(TEXT(СП,n0),1,3),\"миллиард\"&VLOOKUP(MID(TEXT(СП,n0),3,1)*AND(MID(TEXT(СП,n0),2,1)-1),мил,2),\"\")&INDEX(n_4,MID(TEXT(СП,n0),4,1)+1)&INDEX(n0x,MID(TEXT(СП,n0),5,1)+1,MID(TEXT(СП,n0),6,1)+1)&IF(-MID(TEXT(СП,n0),4,3),\"миллион\"&VLOOKUP(MID(TEXT(СП,n0),6,1)*AND(MID(TEXT(СП,n0),5,1)-1),мил,2),\"\")&INDEX(n_4,MID(TEXT(СП,n0),7,1)+1)&INDEX(n1x,MID(TEXT(СП,n0),8,1)+1,MID(TEXT(СП,n0),9,1)+1)&IF(-MID(TEXT(СП,n0),7,3),VLOOKUP(MID(TEXT(СП,n0),9,1)*AND(MID(TEXT(СП,n0),8,1)-1),тыс,2),\"\")&INDEX(n_4,MID(TEXT(СП,n0),10,1)+1)&INDEX(n0x,MID(TEXT(СП,n0),11,1)+1,MID(TEXT(СП,n0),12,1)+1)),\"z\",\" \")&IF(TRUNC(TEXT(СП,n0)),\"\",\"Ноль \")&\"рубл\"&VLOOKUP(MOD(MAX(MOD(MID(TEXT(СП,n0),11,2)-11,100),9),10),{0,\"ь \";1,\"я \";4,\"ей \"},2)&RIGHT(TEXT(СП,n0),2)&\" копе\"&VLOOKUP(MOD(MAX(MOD(RIGHT(TEXT(СП,n0),2)-11,100),9),10),{0,\"йка\";1,\"йки\";4,\"ек\"},2)","v":"Триста семьдесят тысяч сто семьдесят рублей 00 копеек"}]
[]
["Отпустил:__________________________",null,"Получил:_____________________"]

{"sheet":"Пример","index":1,"n_rows":40,"n_cols":5,"rows_kept":40,"cut":false,"hidden":false,"merged":[[0,0,0,1],[1,0,1,1]]}
["Поставщик:"]
["Покупатель:",null,null,"Дата:",{"$f":"TODAY()","v":"2019-09-13"}]
["№ п/п","                                                   aaaaТовар","Кол-во, шт.","Цена, руб.","Сумма, руб."]
[{"$f":"ROW()-3","v":1},"Грин костюм, графит, размер 42. Штрих-код 4650105044629",12,{"$f":"VLOOKUP(ТабЧастьНакладной5[[                                                   aaaaТовар]],Модель!$E$3:$F$953,2,0)","v":765},{"$f":"C4*D4","v":9180}]
[{"$f":"ROW()-3","v":2},"Грин костюм, графит, размер 44. Штрих-код 4650105044636",14,{"$f":"VLOOKUP(ТабЧастьНакладной5[[                                                   aaaaТовар]],Модель!$E$3:$F$953,2,0)","v":765},{"$f":"C5*D5","v":10710}]
[{"$f":"ROW()-3","v":3},"Грин костюм, графит, размер 46. Штрих-код 4650105044643",23,{"$f":"VLOOKUP(ТабЧастьНакладной5[[                                                   aaaaТовар]],Модель!$E$3:$F$953,2,0)","v":765},{"$f":"C6*D6","v":17595}]
[{"$f":"ROW()-3","v":4},"Грин костюм, графит, размер 48. Штрих-код 4650105044650",45,{"$f":"VLOOKUP(ТабЧастьНакладной5[[                                                   aaaaТовар]],Модель!$E$3:$F$953,2,0)","v":765},{"$f":"C7*D7","v":34425}]
[{"$f":"ROW()-3","v":5},"Грин костюм, графит, размер 50. Штрих-код 4650105044667",67,{"$f":"VLOOKUP(ТабЧастьНакладной5[[                                                   aaaaТовар]],Модель!$E$3:$F$953,2,0)","v":765},{"$f":"C8*D8","v":51255}]
[{"$f":"ROW()-3","v":6},"Грин костюм, графит, размер 52. Штрих-код 4650105044674",65,{"$f":"VLOOKUP(ТабЧастьНакладной5[[                                                   aaaaТовар]],Модель!$E$3:$F$953,2,0)","v":765},{"$f":"C9*D9","v":49725}]
[{"$f":"ROW()-3","v":7},"Грин костюм, индиго, размер 42. Штрих-код:4650105044681",78,{"$f":"VLOOKUP(ТабЧастьНакладной5[[                                                   aaaaТовар]],Модель!$E$3:$F$953,2,0)","v":765},{"$f":"C10*D10","v":59670}]
[{"$f":"ROW()-3","v":8},"Грин костюм, индиго, размер 44. Штрих-код:4650105044698",23,{"$f":"VLOOKUP(ТабЧастьНакладной5[[                                                   aaaaТовар]],Модель!$E$3:$F$953,2,0)","v":765},{"$f":"C11*D11","v":17595}]
[{"$f":"ROW()-3","v":9},"Грин костюм, индиго, размер 46. Штрих-код:4650105044704",12,{"$f":"VLOOKUP(ТабЧастьНакладной5[[                                                   aaaaТовар]],Модель!$E$3:$F$953,2,0)","v":765},{"$f":"C12*D12","v":9180}]
[{"$f":"ROW()-3","v":10},"Грин костюм, индиго, размер 48. Штрих-код:4650105044711",34,{"$f":"VLOOKUP(ТабЧастьНакладной5[[                                                   aaaaТовар]],Модель!$E$3:$F$953,2,0)","v":765},{"$f":"C13*D13","v":26010}]
[{"$f":"ROW()-3","v":11},"Грин костюм, индиго, размер 50. Штрих-код:4650105044728",45,{"$f":"VLOOKUP(ТабЧастьНакладной5[[                                                   aaaaТовар]],Модель!$E$3:$F$953,2,0)","v":765},{"$f":"C14*D14","v":34425}]
[{"$f":"ROW()-3","v":12},"Грин костюм, индиго, размер 52. Штрих-код:4650105044735",32,{"$f":"VLOOKUP(ТабЧастьНакладной5[[                                                   aaaaТовар]],Модель!$E$3:$F$953,2,0)","v":765},{"$f":"C15*D15","v":24480}]
[null,null,{"$f":"SUBTOTAL(109,C4:C15)","v":450},{"$f":"VLOOKUP(ТабЧастьНакладной5[[                                                   aaaaТовар]],Модель!$E$3:$F$953,2,0)","v":{"$error":"#N/A"}},{"$f":"C16*D16","v":{"$error":"#N/A"}}]
[{"$f":"ROW()-3","v":14},"Дерево туника, графит, размер 44, Штрих-код 4650105277355",1,{"$f":"VLOOKUP(ТабЧастьНакладной5[[                                                   aaaaТовар]],Модель!$E$3:$F$953,2,0)","v":360},{"$f":"C17*D17","v":360}]
[{"$f":"ROW()-3","v":15},"Дерево туника, графит, размер 46, Штрих-код 4650105277362",2,{"$f":"VLOOKUP(ТабЧастьНакладной5[[                                                   aaaaТовар]],Модель!$E$3:$F$953,2,0)","v":360},{"$f":"C18*D18","v":720}]
[{"$f":"ROW()-3","v":16},"Дерево туника, графит, размер 48, Штрих-код 4650105277379",3,{"$f":"VLOOKUP(ТабЧастьНакладной5[[                                                   aaaaТовар]],Модель!$E$3:$F$953,2,0)","v":360},{"$f":"C19*D19","v":1080}]
[{"$f":"ROW()-3","v":17},"Дерево туника, графит, размер 50, Штрих-код 4650105277386",4,{"$f":"VLOOKUP(ТабЧастьНакладной5[[                                                   aaaaТовар]],Модель!$E$3:$F$953,2,0)","v":360},{"$f":"C20*D20","v":1440}]
[{"$f":"ROW()-3","v":18},"Дерево туника, графит, размер 52, Штрих-код 4650105277393",5,{"$f":"VLOOKUP(ТабЧастьНакладной5[[                                                   aaaaТовар]],Модель!$E$3:$F$953,2,0)","v":360},{"$f":"C21*D21","v":1800}]
[{"$f":"ROW()-3","v":19},"Дерево туника, графит, размер 54, Штрих-код 4650105277409",6,{"$f":"VLOOKUP(ТабЧастьНакладной5[[                                                   aaaaТовар]],Модель!$E$3:$F$953,2,0)","v":360},{"$f":"C22*D22","v":2160}]
[{"$f":"ROW()-3","v":20},"Дерево туника, графит, размер 56, Штрих-код 4650105277416",7,{"$f":"VLOOKUP(ТабЧастьНакладной5[[                                                   aaaaТовар]],Модель!$E$3:$F$953,2,0)","v":360},{"$f":"C23*D23","v":2520}]
[{"$f":"ROW()-3","v":21},"Дерево туника, графит, размер 58, Штрих-код 4650105277423",8,{"$f":"VLOOKUP(ТабЧастьНакладной5[[                                                   aaaaТовар]],Модель!$E$3:$F$953,2,0)","v":360},{"$f":"C24*D24","v":2880}]
[{"$f":"ROW()-3","v":22},"Дерево туника, индиго, размер 44, Штрих-код 4650105277270",9,{"$f":"VLOOKUP(ТабЧастьНакладной5[[                                                   aaaaТовар]],Модель!$E$3:$F$953,2,0)","v":360},{"$f":"C25*D25","v":3240}]
[null,null,{"$f":"SUBTOTAL(109,C17:C25)","v":45}]
[{"$f":"ROW()-3","v":24},"Дзен кофта, меланж, размер 48. Штрих-код: 4650105137154",8,{"$f":"VLOOKUP(ТабЧастьНакладной5[[                                                   aaaaТовар]],Модель!$E$3:$F$953,2,0)","v":320},{"$f":"C27*D27","v":2560}]
[{"$f":"ROW()-3","v":25},"Дзен кофта, меланж, размер 50. Штрих-код: 4650105137161",7,{"$f":"VLOOKUP(ТабЧастьНакладной5[[                                                   aaaaТовар]],Модель!$E$3:$F$953,2,0)","v":320},{"$f":"C28*D28","v":2240}]
[{"$f":"ROW()-3","v":26},"Дзен кофта, меланж, размер 52. Штрих-код: 4650105137178",6,{"$f":"VLOOKUP(ТабЧастьНакладной5[[                                                   aaaaТовар]],Модель!$E$3:$F$953,2,0)","v":320},{"$f":"C29*D29","v":1920}]
[null,null,{"$f":"SUBTOTAL(109,C27:C29)","v":21},{"$f":"VLOOKUP(ТабЧастьНакладной5[[                                                   aaaaТовар]],Модель!$E$3:$F$953,2,0)","v":{"$error":"#N/A"}},{"$f":"C30*D30","v":{"$error":"#N/A"}}]
[{"$f":"ROW()-3","v":28},"Дымка футболка, белый, размер 44, Штрих-код 4650105315484",5,{"$f":"VLOOKUP(ТабЧастьНакладной5[[                                                   aaaaТовар]],Модель!$E$3:$F$953,2,0)","v":250},{"$f":"C31*D31","v":1250}]
[{"$f":"ROW()-3","v":29},"Дымка футболка, белый, размер 46, Штрих-код 4650105315491",4,{"$f":"VLOOKUP(ТабЧастьНакладной5[[                                                   aaaaТовар]],Модель!$E$3:$F$953,2,0)","v":250},{"$f":"C32*D32","v":1000}]
[{"$f":"ROW()-3","v":30},"Дымка футболка, белый, размер 48, Штрих-код 4650105315507",3,{"$f":"VLOOKUP(ТабЧастьНакладной5[[                                                   aaaaТовар]],Модель!$E$3:$F$953,2,0)","v":250},{"$f":"C33*D33","v":750}]
[null,null,{"$f":"SUBTOTAL(109,C31:C33)","v":12}]
["Итог",null,null,null,{"$f":"SUMIF(ТабЧастьНакладной5[Сумма, руб.],\"<1E100\")","v":370170}]
[null,null,null,"НДС не облагается"]
[{"$f":"\"Всего наименований:\"&\" \"&MAX(ТабЧастьНакладной5[№ п/п])&\",\"&\" \"&\"на сумму\"&\" \"&СП&\" \"&\"руб.\"","v":"Всего наименований: 30, на сумму 370170 руб."}]
[{"$f":"SUBSTITUTE(PROPER(INDEX(n_4,MID(TEXT(СП,n0),1,1)+1)&INDEX(n0x,MID(TEXT(СП,n0),2,1)+1,MID(TEXT(СП,n0),3,1)+1)&IF(-MID(TEXT(СП,n0),1,3),\"миллиард\"&VLOOKUP(MID(TEXT(СП,n0),3,1)*AND(MID(TEXT(СП,n0),2,1)-1),мил,2),\"\")&INDEX(n_4,MID(TEXT(СП,n0),4,1)+1)&INDEX(n0x,MID(TEXT(СП,n0),5,1)+1,MID(TEXT(СП,n0),6,1)+1)&IF(-MID(TEXT(СП,n0),4,3),\"миллион\"&VLOOKUP(MID(TEXT(СП,n0),6,1)*AND(MID(TEXT(СП,n0),5,1)-1),мил,2),\"\")&INDEX(n_4,MID(TEXT(СП,n0),7,1)+1)&INDEX(n1x,MID(TEXT(СП,n0),8,1)+1,MID(TEXT(СП,n0),9,1)+1)&IF(-MID(TEXT(СП,n0),7,3),VLOOKUP(MID(TEXT(СП,n0),9,1)*AND(MID(TEXT(СП,n0),8,1)-1),тыс,2),\"\")&INDEX(n_4,MID(TEXT(СП,n0),10,1)+1)&INDEX(n0x,MID(TEXT(СП,n0),11,1)+1,MID(TEXT(СП,n0),12,1)+1)),\"z\",\" \")&IF(TRUNC(TEXT(СП,n0)),\"\",\"Ноль \")&\"рубл\"&VLOOKUP(MOD(MAX(MOD(MID(TEXT(СП,n0),11,2)-11,100),9),10),{0,\"ь \";1,\"я \";4,\"ей \"},2)&RIGHT(TEXT(СП,n0),2)&\" копе\"&VLOOKUP(MOD(MAX(MOD(RIGHT(TEXT(СП,n0),2)-11,100),9),10),{0,\"йка\";1,\"йки\";4,\"ек\"},2)","v":"Триста семьдесят тысяч сто семьдесят рублей 00 копеек"}]
[]
["Отпустил:__________________________",null,"Получил:_____________________"]

{"sheet":"Модель","index":2,"n_rows":135,"n_cols":8,"rows_kept":135,"cut":false,"hidden":false,"merged":[]}
["Модель ","Цвет","Размер","Штрих-код","Товар","Цена",null,"Магазин"]
[]
["Брейк трико","черный",30,2000003750221,"Брейк трико, черный, размер 30, Штрих-код 2000003750221",250,null,"Покупатель:"]
["Брейк трико","черный",32,2000003750238,"Брейк трико, черный, размер 32, Штрих-код 2000003750238",250,null,"Покупатель:"]
["Брейк трико","черный",34,2000003750245,"Брейк трико, черный, размер 34, Штрих-код 2000003750245",250,null,"Покупатель:"]
["Брейк трико","черный",36,2000003750252,"Брейк трико, черный, размер 36, Штрих-код 2000003750252",250,null,"Покупатель:"]
["Брейк трико","черный",38,2000003750269,"Брейк трико, черный, размер 38, Штрих-код 2000003750269",250,null,"Покупатель:"]
["Брейк трико","черный",40,2000003750276,"Брейк трико, черный, размер 40, Штрих-код 2000003750276",250,null,"Покупатель:"]
["Брейк трико","черный",42,2000003750283,"Брейк трико, черный, размер 42, Штрих-код 2000003750283",250]
["Вуаль футболка","молочный",44,4650105315002,"Вуаль футболка, молочный, размер 44, Штрих-код 4650105315002",270]
["Вуаль футболка","молочный",46,4650105315019,"Вуаль футболка, молочный, размер 46, Штрих-код 4650105315019",270]
["Вуаль футболка","молочный",48,4650105315026,"Вуаль футболка, молочный, размер 48, Штрих-код 4650105315026",270]
["Вуаль футболка","молочный",50,4650105315033,"Вуаль футболка, молочный, размер 50, Штрих-код 4650105315033",270]
["Вуаль футболка","молочный",52,4650105315040,"Вуаль футболка, молочный, размер 52, Штрих-код 4650105315040",270]
["Вуаль футболка","молочный",54,4650105315057,"Вуаль футболка, молочный, размер 54, Штрих-код 4650105315057",270]
["Вуаль футболка","молочный",56,4650105315064,"Вуаль футболка, молочный, размер 56, Штрих-код 4650105315064",270]
["Вуаль футболка","молочный",58,4650105315071,"Вуаль футболка, молочный, размер 58, Штрих-код 4650105315071",270]
["Вуаль футболка","черный",44,4650105315088,"Вуаль футболка, черный, размер 44, Штрих-код 4650105315088",270]
["Вуаль футболка","черный",46,4650105315095,"Вуаль футболка, черный, размер 46, Штрих-код 4650105315095",270]
["Вуаль футболка","черный",48,4650105315101,"Вуаль футболка, черный, размер 48, Штрих-код 4650105315101",270]
["Вуаль футболка","черный",50,4650105315118,"Вуаль футболка, черный, размер 50, Штрих-код 4650105315118",270]
["Вуаль футболка","черный",52,4650105315125,"Вуаль футболка, черный, размер 52, Штрих-код 4650105315125",270]
["Вуаль футболка","черный",54,4650105315132,"Вуаль футболка, черный, размер 54, Штрих-код 4650105315132",270]
["Вуаль футболка","черный",56,4650105315149,"Вуаль футболка, черный, размер 56, Штрих-код 4650105315149",270]
["Вуаль футболка","черный",58,4650105315156,"Вуаль футболка, черный, размер 58, Штрих-код 4650105315156",270]
["Вэст футболка","бордовый",46,4650105293003,"Вэст футболка, бордовый, размер 46, Штрих-код 4650105293003",270]
["Вэст футболка","бордовый",48,4650105293010,"Вэст футболка, бордовый, размер 48, Штрих-код 4650105293010",270]
["Вэст футболка","бордовый",50,4650105293027,"Вэст футболка, бордовый, размер 50, Штрих-код 4650105293027",270]
["Вэст футболка","бордовый",52,4650105293034,"Вэст футболка, бордовый, размер 52, Штрих-код 4650105293034",270]
["Вэст футболка","бордовый",54,4650105293041,"Вэст футболка, бордовый, размер 54, Штрих-код 4650105293041",270]
["Вэст футболка","бордовый",56,4650105293058,"Вэст футболка, бордовый, размер 56, Штрих-код 4650105293058",270]
["Вэст футболка","бордовый",58,4650105293065,"Вэст футболка, бордовый, размер 58, Штрих-код 4650105293065",270]
["Вэст футболка","бордовый",60,4650105293072,"Вэст футболка, бордовый, размер 60, Штрих-код 4650105293072",270]
["Вэст футболка","бордовый",62,4650105293089,"Вэст футболка, бордовый, размер 62, Штрих-код 4650105293089",270]
["Вэст футболка","бордовый",64,4650105293096,"Вэст футболка, бордовый, размер 64, Штрих-код 4650105293096",270]
["Вэст футболка","темно-синий",46,4650105293102,"Вэст футболка, темно-синий, размер 46, Штрих-код 4650105293102",270]
["Вэст футболка","темно-синий",48,4650105293119,"Вэст футболка, темно-синий, размер 48, Штрих-код 4650105293119",270]
["Вэст футболка","темно-синий",50,4650105293126,"Вэст футболка, темно-синий, размер 50, Штрих-код 4650105293126",270]
["Вэст футболка","темно-синий",52,4650105293133,"Вэст футболка, темно-синий, размер 52, Штрих-код 4650105293133",270]
["Вэст футболка","темно-синий",54,4650105293140,"Вэст футболка, темно-синий, размер 54, Штрих-код 4650105293140",270]
["Вэст футболка","темно-синий",56,4650105293157,"Вэст футболка, темно-синий, размер 56, Штрих-код 4650105293157",270]
["Вэст футболка","темно-синий",58,4650105293164,"Вэст футболка, темно-синий, размер 58, Штрих-код 4650105293164",270]
["Вэст футболка","темно-синий",60,4650105293171,"Вэст футболка, темно-синий, размер 60, Штрих-код 4650105293171",270]
["Вэст футболка","темно-синий",62,4650105293188,"Вэст футболка, темно-синий, размер 62, Штрих-код 4650105293188",270]
["Вэст футболка","темно-синий",64,4650105293195,"Вэст футболка, темно-синий, размер 64, Штрих-код 4650105293195",270]
["Грин костюм","графит",42,4650105044629,"Грин костюм, графит, размер 42. Штрих-код 4650105044629",765]
["Грин костюм","графит",44,4650105044636,"Грин костюм, графит, размер 44. Штрих-код 4650105044636",765]
["Грин костюм","графит",46,4650105044643,"Грин костюм, графит, размер 46. Штрих-код 4650105044643",765]
["Грин костюм","графит",48,4650105044650,"Грин костюм, графит, размер 48. Штрих-код 4650105044650",765]
["Грин костюм","графит",50,4650105044667,"Грин костюм, графит, размер 50. Штрих-код 4650105044667",765]
["Грин костюм","графит",52,4650105044674,"Грин костюм, графит, размер 52. Штрих-код 4650105044674",765]
["Грин костюм","индиго",42,4650105044681,"Грин костюм, индиго, размер 42. Штрих-код:4650105044681",765]
["Грин костюм","индиго",44,4650105044698,"Грин костюм, индиго, размер 44. Штрих-код:4650105044698",765]
["Грин костюм","индиго",46,4650105044704,"Грин костюм, индиго, размер 46. Штрих-код:4650105044704",765]
["Грин костюм","индиго",48,4650105044711,"Грин костюм, индиго, размер 48. Штрих-код:4650105044711",765]
["Грин костюм","индиго",50,4650105044728,"Грин костюм, индиго, размер 50. Штрих-код:4650105044728",765]
["Грин костюм","индиго",52,4650105044735,"Грин костюм, индиго, размер 52. Штрих-код:4650105044735",765]
["Дерево туника","графит",44,4650105277355,"Дерево туника, графит, размер 44, Штрих-код 4650105277355",360]
["Дерево туника","графит",46,4650105277362,"Дерево туника, графит, размер 46, Штрих-код 4650105277362",360]
["Дерево туника","графит",48,4650105277379,"Дерево туника, графит, размер 48, Штрих-код 4650105277379",360]
{"$rows_left_out":75}