{"text_format":"1","workbook":"xlsx","n_sheets":4,"sheets":["БАЗА","Кондитерка","Меню групп","МЕНЮ  ВЕГА"],"not_rendered":{"charts":0,"images":0,"macros":1,"external_links":0,"defined_names":9,"comments":0,"pivot_tables":0},"unopened":[],"bounds":{"document_bytes":16777216,"sheet_cells":100000,"rows_first":2000,"rows_last":500,"rows_between":2000,"halvings":0,"cell_chars":16384,"cell_head_chars":4096},"cells_cut":0,"cells_raw":0,"read":"whole","date_system":"1900"}

{"sheet":"БАЗА","index":0,"n_rows":887,"n_cols":3,"rows_kept":887,"cut":false,"hidden":false,"merged":[]}
["БЛЮДА ИЗ ЯИЦ (РЕСТ)"," "," "]
[" Омлет из 2-х яиц",110,100]
[" Омлет с  зелёным  горошком","110/55",100]
[" Омлет с ветчиной(Рест)","110/55",110]
[" Омлет с колбасой ","110/55",110]
[" Омлет с колбасой и зел .горошком","110/55",110]
[" Омлет с макаронами","110/55",100]
[" Омлет с сосисками(Рест)","110/55",120]
[" Омлет фаршированый фасолью","110/55",100]
[" Рулет из омлета с овощами.",110,140]
[" Яйцо вареное.",40,40]
[" Яйцо перепелиное ",40,30]
[" Яйцо под майонезом(Рест)","40/20",40]
[" Яичница из 2-х яиц на крутоне",114,100]
[" Яичница из 2-х яиц(Рест)",114,100]
[" Яичница из 3-х яиц с помидорами и беконом",150,170]
[" Яичница из 3-х яиц с помидорами(Рест)",150,150]
[]
[]
[]
[]
[]
[]
[]
[]
[]
[]
[]
[]
[]
[]
[]
[]
[]
[]
[]
[]
[]
[]
[]
[]
[]
[]
[]
[]
[]
[]
[]
[]
[]
[]
[]
[]
[]
[]
[]
[]
[]
[]
[]
[]
[]
[]
[]
[]
[]
[]
[]
[]
[]
[]
[]
[]
[]
[]
[]
[]
[]
[]
[]
[]
[]
[]
[]
[]
[]
[]
[]
[]
[]
[]
[]
[]
[]
[]
[]
[]
[]
[]
[]
[]
[]
[]
[]
[]
[]
[]
[]
[]
[]
[]
[]
[]
[]
[]
[]
[]
[]
[]
[]
[]
[]
[]
[]
[]
[]
[]
[]
[]
[]
[]
[]
[]
[]
[]
[]
[]
[]
[]
[]
[]
[]
[]
[]
[]
[]
[]
[]
[]
[]
[]
[]
[]
[]
[]
[]
[]
[]
[]
[]
[]
[]
[]
[]
[]
[]
[]
[]
[]
[]
[]
[]
[]
[]
[]
[]
[]
[]
[]
[]
[]
[]
[]
[]
[]
[]
[]
[]
[]
[]
[]
[]
[]
[]
[]
[]
[]
[]
[]
[]
[]
[]
[]
[]
[]
[]
[]
[]
[]
[]
[]
[]
[]
[]
[]
[]
[]
[]
[]
[]
[]
[]
[]
[]
[]
[]
[]
[]
[]
[]
[]
[]
[]
[]
[]
[]
[]
[]
[]
[]
[]
[]
[]
[]
[]
[]
[]
[]
[]
[]
[]
[]
[]
[]
[]
[]
[]
[]
[]
[]
[]
[]
[]
[]
[]
[]
[]
[]
[]
[]
[]
[]
[]
[]
[]
[]
[]
[]
[]
[]
[]
[]
[]
[]
[]
[]
[]
[]
[]
[]
[]
[]
[]
[]
[]
[]
[]
[]
[]
[]
[]
[]
[]
[]
[]
[]
[]
[]
[]
[]
[]
[]
[]
[]
[]
[]
[]
[]
[]
[]
[]
[]
[]
[]
[]
[]
[]
[]
[]
[]
[]
[]
[]
[]
[]
[]
[]
[]
[]
[]
[]
[]
[]
[]
[]
[]
[]
[]
[]
[]
[]
[]
[]
[]
[]
[]
[]
[]
[]
[]
[]
[]
[]
[]
[]
[]
[]
[]
[]
[]
[]
[]
[]
[]
[]
[]
[]
[]
[]
[]
[]
[]
[]
[]
[]
[]
[]
[]
[]
[]
[]
[]
[]
[]
[]
[]
[]
[]
[]
[]
{"$rows_left_out":488}
{"sheet":"Кондитерка","index":1,"n_rows":66,"n_cols":3,"rows_kept":66,"cut":false,"hidden":true,"merged":[]}
["КОНДИТЕРСКИЕ И КУЛИНАРНЫЕ ИЗДЕЛИЯ"]
["ПИРОЖКИ С КУХНИ"]
["Булочка   \"Домашняя\".",50,25]
["Булочка  КОРОВКА",50,35]
["Булочка с изюмом",50,25]
["Булочка с марципаном.",50,45]
["Ватрушка \"Венгерская\"",60,40]
["Ватрушка с повидлом",75,25]
["Ватрушка с творогом...",75,35]
["Пирожки  с капустой и яйцом.",50,25]
["Пирожки  с рисом и яйцом.",50,25]
["Пирожки  с яйцом и з/луком.",50,25]
["Пирожок с вишней.",50,40]
["Пирожок с грибами.",50,40]
["Пирожок с капустой.",50,25]
["Пирожок с картошкой и грибами ",50,35]
["Пирожок с картошкой.",50,25]
["Пирожок с курагой.",50,25]
["Пирожок с маком.",50,25]
["Пирожок с мясом.",50,40]
["Пирожок с повидлом.",50,25]
["Пирожок с яблоками.",50,25]
["Плюшка с грушей",100,30]
["Плюшка с корицей",100,25]
["Плюшка с маком",100,25]
["Пончики из творога",50,40]
["Рулет с апельсиново-кокосовой начинкой ",50,30]
["Рулет с изюмом",50,30]
["Слойка с капустой и грибами",60,40]
["Слойка с картошкой",60,30]
["Слойка с творогом(Кухня)",60,35]
["Слойка с яблоком (Кухня)",60,30]
["ПИРОЖНЫЕ С КУХНИ"]
["\"Подмосковные  вечера\"к",50,30]
["\"Рафаэлло\".",70,40]
["Бантики   слоеные.",50,30]
["Безе",30,30]
["воздушное с кремом..",50,45]
["Десерт с кокосом .",80,35]
["Десерт с шоколадом .",80,35]
["картошка .",50,25]
["кекс столичный.",50,30]
["кекс творожный с кокосовой стружкой.",50,30]
["кекс творожный.",50,35]
["Кольцо песочное.",48,30]
["Корж   молочный.",90,30]
["корзинка с белковым кремом.",54,40]
["корзинка фруктовая..",80,40]
["Лакомка слоёная .",35,30]
["орешек заварной.",50,45]
["полоска песочная..",75,45]
["Розан с ананасом",100,55]
["Розан с вишней",50,55]
["Розан с персиком",100,55]
["Розан с яблоком",100,50]
["БУТЕРБРОДЫ"]
["Бутерброд с  колбасой докторской.","50/25/1","50,00 р."]
["Бутерброд с бужениной","30/25","90,00 р."]
["Бутерброд с икрой.","30/25","190,00 р."]
["Бутерброд с маслом.","30/15","35,00 р."]
["Бутерброд с семгой.","30/20/10","120,00 р."]
["Бутерброд с сыром и маслом.","30/25/10","60,00 р."]
["Бутерброд с сыром.","30/25","45,00 р."]
["Бутерброды с ветчиной.","30/25/1","55,00 р."]
["Бутерброды с п/к колбасой.","30/25/1","60,00 р."]
["Бутерброды с шейкой в/к","30/25/1","60,00 р."]

{"sheet":"Меню групп","index":2,"n_rows":12,"n_cols":5,"rows_kept":12,"cut":false,"hidden":false,"merged":[]}
[null,"МЕНЮ","2019-11-01"]
["Завтрак",null,null,12,"чел"]
["Наименование","Вес / гр.","Цена / руб.","Кол-во порций","Итого"]
[" Омлет с сосисками(Рест)",{"$f":"IFERROR(VLOOKUP($A4,БАЗА!A:C,2,0),)","v":"110/55"},{"$f":"IFERROR(VLOOKUP($A4,БАЗА!A:C,3,0),)","v":120},{"$f":"D2","v":12},{"$f":"C4*D4","v":1440}]
[" Омлет из 2-х яиц",{"$f":"IFERROR(VLOOKUP($A5,БАЗА!A:C,2,0),)","v":110},{"$f":"IFERROR(VLOOKUP($A5,БАЗА!A:C,3,0),)","v":100},{"$f":"D2","v":12},{"$f":"D5*C5","v":1200}]
[null,{"$f":"IFERROR(VLOOKUP($A6,БАЗА!A:C,2,0),)","v":0},{"$f":"IFERROR(VLOOKUP($A6,БАЗА!A:C,3,0),)","v":0},{"$f":"D2","v":12},0]
[null,{"$f":"IFERROR(VLOOKUP($A7,БАЗА!A:C,2,0),)","v":0},{"$f":"IFERROR(VLOOKUP($A7,БАЗА!A:C,3,0),)","v":0},{"$f":"D2","v":12},0]
[null,{"$f":"IFERROR(VLOOKUP($A8,БАЗА!A:C,2,0),)","v":0},{"$f":"IFERROR(VLOOKUP($A8,БАЗА!A:C,3,0),)","v":0},{"$f":"D2","v":12},{"$f":"D8*C8","v":0}]
[null,{"$f":"IFERROR(VLOOKUP($A9,БАЗА!A:C,2,0),)","v":0},{"$f":"IFERROR(VLOOKUP($A9,БАЗА!A:C,3,0),)","v":0},{"$f":"D2","v":12},0]
[null,{"$f":"IFERROR(VLOOKUP($A10,БАЗА!A:C,2,0),)","v":0},{"$f":"IFERROR(VLOOKUP($A10,БАЗА!A:C,3,0),)","v":0},{"$f":"D2","v":12},0]
["ИТОГО",null,null,null,{"$f":"SUM(E4:E10)","v":2640}]
["Сумма на 1 человека",null,null,null,{"$f":"E11/D2","v":220}]

{"sheet":"МЕНЮ  ВЕГА","index":3,"n_rows":550,"n_cols":5,"rows_kept":550,"cut":false,"hidden":true,"merged":[]}
[null,"Столбец1","Столбец2","Столбец3","Столбец4"]
[null,null,"БЛЮДА ИЗ ЯИЦ (РЕСТ)"]
[null,null,"Макароны с сыром запеченые(Дети)",200,100]
[null,null,"Омлет из 2-х яиц запеченый с сыром (Дети)",110,100]
[null,2002,"Омлет из 2-х яиц",110,100]
[null,2003,"Омлет с  зелёным  горошком","110/55",100]
[null,2007,"Омлет с макаронами","110/55",100]
[null,2009,"Омлет фаршированый фасолью","110/55",100]
[null,2010,"Рулет из омлета с овощами.",110,140]
[null,2015,"Яйцо вареное.",40,40]
[null,2016,"Яйцо перепелиное ",40,30]
[null,2017,"Яйцо под майонезом(Рест)","40/20",40]
[null,2011,"Яичница из 2-х яиц на крутоне",114,100]
[null,2012,"Яичница из 2-х яиц(Рест)",114,100]
[null,2014,"Яичница из 3-х яиц с помидорами(Рест)",150,150]
[null,null,"ГОРЯЧИЕ ЗАКУСКИ (РЕСТ)"]
[null,null,"Блины  без наполнителя (К)","150/50",80]
[null,null,"Блины  с творогом","150/50",95]
[null,null,"Блины с ветчиной и сыром","150/50",100]
[null,null,"Блины с джемом(Р)","150/50",100]
[null,null,"Блины с капустой","100/50",100]
[null,null,"Блины с медом(Р)","150/50",110]
[null,null,"Блины с мясом","100/50",150]
[null,null,"Блины со сгущ. молоком","150/50",100]
[null,null,"Блины со сметаной (РЕСТ)","150/50",100]
[null,null,"Горячий бутерброд с помидором и сыром","2/100",110]
[null,null,"Горячий бутерброд с сыром (Рест)",100,100]
[null,null,"Запеканка творожная  б/наполнителя",120,85]
[null,null,"Запеканка творожная с джемом","120/50",110]
[null,null,"Запеканка творожная со сгущенкой","120/50",110]
[null,7027,"Запеканка творожная со сметаной","120/50",110]
[null,null,"Оладьи со сгущ. молоком","120/50",100]
[null,null,"Сырники без наполнителя","150/5",110]
[null,null,"Сырники с джемом(р)","150/50",130]
[null,null,"Сырники с медом (Р)","150/50",150]
[null,null,"Сырники со сгущ. молоком","150/50",130]
[null,null,"Сырники со сметаной (РЕСТ)","150/50",130]
[null,null,"Блины  на воде с джемом без яиц","120/50",100]
[null,null,"Оладьи из кабачков",120,100]
[null,null,"Оладьи из овсянки с  бананами  и джемом ","120/50",100]
[null,null,"Оладьи из овсяной каши с яблоком с джемом ","120/50",90]
[null,null,"Оладьи на кефире с джемом без яиц","120/50",100]
[]
[]
[]
[]
[]
[]
[null,null,"ВЕГЕТАРИАНЦЫ группа"]
[null,null,"Имбирный напиток",200,35]
[null,null,"Чай йоговский.",150,10]
[null,null,"ВТОРЫЕ ГОРЯЧИЕ БЛЮДА (РЕСТ)"]
[null,null,"БЛЮДА ИЗ РЫБЫ (РЕСТ)"]
[null,null,"Биточки Рыбные из кеты",120,140]
[null,null,"Бризоль из  судака(Рест)",120,200]
[null,null,"Бризоль из трески (рест)",120,200]
[null,null,"Горбуша запеченая с луком и сыром",120,165]
[null,null,"Картофельная запеканка фаршированная сёмгой",250,220]
[null,null,"Кета запеченая с луком и сыром",120,170]
[null,null,"Кольца кальмаров фри",120,140]
[null,null,"Рыба  в  кляре.(Треска)(Рест)","150/1",190]
[null,null,"Рыба \"По-Фермерски\" (Треска)(рест)","140/1",250]
[null,null,"Рыба в омлете (горбуша)из филе ","1/125",150]
[null,null,"Рыба жареная (треска)из филе ","1/125",160]
[null,null,"Рыба под маринадом (Треска )",150,170]
[null,null,"Рыбные тефтели (филе трески)","115/75",150]
[null,null,"Семга жаренная с лимоном(рест)","125/6/1",430]
[null,null,"Судак в собственном соку","125/100/100",310]
[null,null,"Судак припущеный",75,170]
[null,null,"Судак, запеч. с майонезом(Рест)","130/2",280]
[null,null,"Треска  запеченая с луком и сыром",120,165]
[null,null,"Филе горбуши под белым соусом",120,165]
[null,null,"Филе кеты  под белым соусом",120,165]
[null,null,"Филе пикши под белым соусом",120,160]
[null,null,"Филе трески под белым соусом",120,170]
[null,null,"Шашлык из семги(Рест)","150/135/2",490]
[null,null,"Шницель рыбный из горбуши",125,150]
[null,null,"Шницель рыбный из пикши",125,160]
[null,null,"Шницель рыбный из трески (Филе)",125,160]
[null,null,"БЛЮДА ОВОЩНЫЕ"]
[null,null,"Баклажаны  запеченые с помидорами и сыром",150,100]
[null,null,"Баклажаны жареные со св. перцем",150,130]
[null,null,"Баклажаны жареные со св. помидорами ",150,130]
[null,null,"Баклажаны с рисом.",170,130]
[null,null,"Баклажаны, запеч. со сметаной","300/2",260]
[null,null,"Гречка с луком и грибами.(Р)",250,170]
[null,null,"Гречка с луком и морковью",285,70]
[null,null,"Гречка с луком и морковью и кабачками ",400,110]
[null,null,"Гречка с луком и морковью помид. перцем со специям",400,140]
[null,null,"Запеченые овощи",150,70]
[null,null,"Икра овощная",200,90]
[null,null,"Котлеты капустные","150/25",100]
[null,null,"Лечо",150,90]
[null,null,"Лобио из стрючковой фасоли (в)",150,100]
[null,null,"Обжареная свекла с адыгейским сыром ",200,160]
[null,null,"Овощи -микс",150,120]
[null,null,"Овощи на пару",200,120]
[null,null,"Овощное  рагу с баклажаном",200,110]
[null,null,"Овощное рагу *",200,120]
[null,null,"Овощной бульон ","400/3",80]
[null,null,"Плов c изюмом",300,100]
[null,null,"Плов вегетарианский",300,140]
[null,null,"ПЛОВ с грибами.",300,145]
[null,null,"Плов с картошкой и петрушкой",250,90]
[null,null,"Плов с овощами",300,75]
[null,null,"Тушенные овощи.",150,100]
[null,null,"Тыква ЗАПЕЧЕНАЯ (200 ГР)",200,110]
[null,null,"Фасоль отварная с луком и томатом.",200,80]
[null,null,"Фасоль тушеная с морковью.",170,95]
[null,null,"Фасоль тушеная с перцем и овощами",150,100]
[]
[]
[null,null,"ГАРНИРЫ (РЕСТ)"]
[null,null,"Гречка отварная","150/5",70]
[null,null,"Гречка с луком и грибами",250,170]
[null,null,"Капуста тушенная.",200,90]
[null,null,"Капуста цветная обжаренная в сухарях фри",200,140]
[null,null,"Картофель \"Пикантный\"",200,90]
[null,null,"Картофель \"По-Деревенски",130,130]
[null,null,"Картофель жареный с овощами","180/40",100]
[null,null,"Картофель жареный","200/40",100]
[null,null,"Картофель оварной  с луком фри","180/30",100]
[null,null,"Картофель отварной с маслом ","180/5",90]
[null,null,"Картофель отварной с овощами","180/5/40/1",100]
[null,null,"Картофель фри",135,130]
[null,null,"Картофель,жаренный с грибами",300,190]
[null,null,"Картофельное пюре","180/2",90]
[null,null,"Картофельное пюре с овощами","180/5/40",100]
[null,null,"Картофельные шарики ",130,130]
[null,null,"Луковые кольца",100,100]
[null,6018,"Макароны отварные",150,70]
[null,null,"Макароны с сыром",200,100]
[null,null,"ОВОЩИ ГРИЛЬ",150,250]
[null,null,"Овощной сборный",250,120]
[null,null,"Пальчики картофельные фри с сыром",120,100]
[null,null,"Рис-ризотто","150/1",90]
[null,6023,"Рис отварной",150,70]
[null,null,"Стрючковая фасоль жареная","200/40",70]
[null,null,"Бурый отварной рис  130 гр.",130,80]
[null,null,"Горох отварной  130 гр",130,50]
[null,null,"Кабачки жареные",150,80]
[null,null,"Кабачки жареные  с помидорами",150,100]
[null,null,"Картофель,жаренный с грибами.(Р)",300,190]
[null,null,"Кабачки запеченые с помидорами и сыром",150,100]
[null,null,"Кабачки и цветная капуста запечёные в сметне",150,110]
[null,null,"Кабачково-манные драники со сметаной ",120,90]
[null,null,"Капуста брокколи запеченая с сыром",150,100]
[null,null,"Капуста брокколи припущеная",150,90]
[null,null,"Капуста тушеная с грибами",200,120]
[null,null,"Картофель запеченый в кожуре",194,70]
[null,null,"Рис с овощами",300,100]
[null,null,"Рис со специями 150 гр",300,70]
[null,null,"Рис со специями 300 гр",300,95]
[null,null,"Фасоль отварная с луком и томатом.",200,80]
[null,null,"Фасоль тушеная с морковью.",170,95]
[null,null,"Фасоль тушеная с перцем и овощами",150,100]
[]
[]
[null,null,"ГОТОВЫЕ ЗАВТРАКИ"]
[null,null,"Кукурузные хлопья.",50,"50,00 р."]
[null,null,"Мюсли фруктовые.",100,"55,00 р."]
[null,null,"ДЕСЕРТЫ"]
[null,null,"Абрикосы",1,"0,36 р."]
[null,null,"Апельсины.",1,"0,21 р."]
[null,null,"Бананы.",1,"0,20 р."]
[null,null,"Груши.",1,"0,40 р."]
[null,null,"Киви","1 гр","0,30 р."]
[null,null,"Лимоны.",1,"0,38 р."]
[null,null,"Мандарины",1,"0,30 р."]
[null,null,"Персики.",1,"0,34 р."]
[null,null,"Слива.",1,"0,30 р."]
[null,null,"Чернослив.",1,"0,50 р."]
[null,null,"Яблоки",1,"0,25 р."]
[null,null,"Яблоки резаные(Шведка).",50,"15,00 р."]
[null,null,"Яблоки с сахаром и корицей",1,"0,45 р."]
[null,null,"Грецкий орех 10 гр",10,25]
[null,null,"Изюм 15 гр.",15,8]
[null,null,"Курага  15 гр",1,2]
[null,null,"Чернослив 15 гр.",15,5]
[]
[]
[null,null,"ДЕТСКОЕ МЕНЮ"]
[null,null," Рассольник \"Петербургский\".(дет.пит.)","300\\2","100,00 р."]
[null,null,"Азу из мяса отварного",100,"170,00 р."]
[null,null,"Беф-строганов   из мяса отварного","100/50","150,00 р."]
[null,null,"Биточки рубленые куриные","100/1","120,00 р."]
[null,null,"Ватрушка с повидлом (Дет.пит).",100,"30,00 р."]
[null,null,"Вермишель  молочная",210,"70,00 р."]
[null,null,"Винегрет овощной с раст. маслом",200,"70,00 р."]
[null,11008,"Запеканка  картофельная с  мясом",320,"160,00 р."]
[null,null,"Запеканка творожная с изюмом(Дети)","120/50","110,00 р."]
[null,null,"Какао с молоком (Дет. меню)",200,"25,00 р."]
[null,null,"Капуста цветная отварная(Д.М.)",150,"100,00 р."]
[null,null,"Картофель отварной с маслом(Дет.пит.)","265/5","70,00 р."]
[null,null,"Картофельное пюре  (Дет.меню)",200,"60,00 р."]
[null,null,"Компот из сухофруктов",200,"25,00 р."]
[null,null,"Котлета мясная рубленая",100,"140,00 р."]
[null,null,"Куры отварные(дет.пит.)",120,"100,00 р."]
[null,null,"Макароны отварные(Дет.пит.)",175,"50,00 р."]
[null,null,"Макароны с сыром запеченые(Дети)",200,"100,00 р."]
[null,null,"Мясо отварное(д.м.)",100,"130,00 р."]
[null,null,"Мясо тушеное(д.м.)","100/100","150,00 р."]
[null,null,"Овощное  рагу с баклажаном(ДЕТИ)",200,"100,00 р."]
[null,null,"Овощное рагу (Дет.пит.)",200,"110,00 р."]
[null,null,"Омлет из 2-х яиц запеченый с сыром (Дети)",110,"100,00 р."]
[null,null,"Птица отварная ",130,"120,00 р."]
[null,null,"Рагу овощное(Дети)",200,"100,00 р."]
[null,null,"Рыба (треска) филе припущеная ",110,"150,00 р."]
[null,null,"Рыба (треска) филе тушеная с овощами",110,"150,00 р."]
[null,null,"Салат зелёный с помид.и огурцом на рст.масле",100,"70,00 р."]
[null,null,"Салат из помидоров с перцем свежим",100,"80,00 р."]
[null,null,"Салат из св. моркови с изюмом",100,"50,00 р."]
[null,null,"Салат из св. овощей с маслом(Дет)","150/1","70,00 р."]
[null,null,"Салат из св. помидор с растит. маслом",100,"80,00 р."]
[null,null,"Салат из свеклы с черносливом с маслом (Дет.меню)",100,"70,00 р."]
[null,null,"Салат со св.огурцом и раст.маслом",100,"70,00 р."]
[null,null,"Суп -пюре из разных овощей(Дет. меню)",300,"100,00 р."]
[null,null,"Суп гороховый (Дет.пит.)","300/2","110,00 р."]
[null,null,"Тефтели мясные",100,"170,00 р."]
[null,null,"Шницель рыбный  натуральный",120,"160,00 р."]
[null,null,"Щи из свежей капусты со сметаной(Дет.пит.)","300/30/2","120,00 р."]
[null,null,"ДИЕТА БЕССОЛЕВАЯ"]
[null,null,"Горячее овощное"]
[null,null,"Кабачки фаршированные",250,"130,00 р."]
[null,null,"Капуста тушенная б/соли",200,"50,00 р."]
[null,null,"Капуста цветная отварная","250/5","130,00 р."]
[null,null,"Рагу овощное",200,"80,00 р."]
[null,null,"Рыба  припущеная",50,"65,00 р."]
[null,null,"Каши"]
[]
[]
[]
[]
[null,null,"Напитки."]
[null,null,"Напиток из клюквы.к",200,"30,00 р."]
[null,null,"Чай зеленый пак.к",1,"17,00 р."]
[null,null,"Наполнители к кашам"]
[null,null,"Изюм .к",1,"0,80 р."]
[null,null,"Курага .",1,"0,90 р."]
[null,null,"Чернослив .",1,"0,77 р."]
[null,null,"Салаты вегетарианские"]
[null,null,"Отварная  морковь  c раст маслом.",165,"50,00 р."]
[null,null,"Салат \"Витаминный\"",200,"70,00 р."]
[null,null,"Салат из моркови с черносливом",200,"55,00 р."]
[null,null,"Салат из моркови с яблоками.",200,"40,00 р."]
[null,null,"Салат из св. овощей",200,"110,00 р."]
[null,null,"Салат из свеклы с черносливом .",200,"70,00 р."]
[null,null,"Супы вегетарианские"]
[null,null,"Борщ",200,"25,00 р."]
[null,null,"Суп овощной",200,"50,00 р."]
[null,null,"Щи из свежей капусты",200,"30,00 р."]
[null,null,"КАШИ (РЕСТ)"]
[null,14001,"Каша \"Боярская\"",190,70]
[null,14002,"Каша \"Дружба\"",190,70]
[null,14003,"Каша гречневая вязкая ",190,70]
[null,14004,"Каша гречневая вязкая на воде",190,70]
[null,14005,"Каша гречневая молочная",190,70]
[null,14006,"Каша из овсяных хлопьев \"Геркулес\"",190,70]
[null,14007,"Каша манная вязкая ",190,70]
[null,14008,"Каша пшенная вязкая ",190,70]
[null,14009,"Каша рисовая вязкая ",190,70]
[null,null,"Кукурузные хлопья.",50,50]
[null,null,"Каша овсяная +4 злака  180 гр.",200,80]
[null,null,"Каша овсяная с корицей и изюмом",400,90]
[null,null,"Каша пшенная с тыквой,изюмом",400,90]
[null,null,"Каша рисовая по-крестьянски",300,90]
[null,null,"Каша рисовая с тыквой ",200,90]
[null,null,"Каша ячневая вязкая.",200,70]
[null,null,"Овсянка с болгарским перцем и брынзой",250,120]
[null,null,"Гречка рассыпчатая.",200,"35,00 р."]
[null,null,"Гречневая вязкая",200,"25,00 р."]
[null,null,"Овсяная вязкая",200,"25,00 р."]
[null,null,"Пшенная вязкая с тыквой (ВЕГА)",300,"90,00 р."]
[]
[]
[]
[]
[]
[null,null,"КОНДИТЕРСКИЕ И КУЛИНАРНЫЕ ИЗДЕЛИЯ"]
[null,null,"ПИРОЖКИ С КУХНИ"]
[null,15006,"Булочка   \"Домашняя\".",75,25]
[null,15007,"Булочка  КОРОВКА","1970-01-01",35]
[null,15008,"Булочка с изюмом",50,25]
[null,null,"Булочка с марципаном.","1970-01-01",45]
[null,null,"Ватрушка \"Венгерская\"",60,40]
[null,15011,"Ватрушка с повидлом",75,25]
[null,null,"Ватрушка с творогом...",75,35]
[null,null,"Пирожки  с капустой и яйцом.",50,25]
[null,null,"Пирожки  с рисом и яйцом.",50,25]
[null,null,"Пирожки  с яйцом и з/луком.",50,25]
[null,null,"Пирожок с вишней.",50,40]
[null,null,"Пирожок с грибами.",50,40]
[null,null,"Пирожок с капустой.",50,25]
[null,null,"Пирожок с картошкой и грибами ",50,35]
[null,null,"Пирожок с картошкой.",50,25]
[null,15022,"Пирожок с курагой.",50,25]
[null,null,"Пирожок с маком.",50,25]
[null,null,"Пирожок с мясом.",50,40]
[null,15025,"Пирожок с повидлом.",50,25]
[null,null,"Пирожок с яблоками.",50,25]
[null,null,"Плюшка с грушей",100,30]
[null,null,"Плюшка с корицей",100,25]
[null,null,"Плюшка с маком",100,25]
[null,null,"Пончики из творога",50,40]
[null,null,"Розочки из слоёного теста(Кухня)",60,35]
[null,null,"Рулет с апельсиново-кокосовой начинкой ",50,30]
[null,null,"Рулет с изюмом(Кухня)",50,30]
[null,null,"Слойка с капустой и грибами",60,40]
[null,null,"Слойка с картошкой",60,30]
[null,null,"Слойка с творогом(Кухня)",60,35]
[null,null,"Слойка с яблоком (Кухня)",60,30]
[null,null,"ПИРОЖНЫЕ С КУХНИ"]
[null,null,"\"Подмосковные  вечера\"к",50,30]
[null,null,"\"Рафаэлло\".",70,40]
[null,null,"Бантики   слоеные.",50,30]
[null,null,"Безе",30,30]
[null,null,"воздушное с кремом..",50,45]
[null,null,"Десерт с кокосом .",80,35]
[null,null,"Десерт с шоколадом .",80,35]
[null,null,"картошка .",50,25]
[null,null,"кекс столичный.",50,30]
[null,null,"кекс творожный с кокосовой стружкой.",50,30]
[null,null,"кекс творожный.",50,35]
[null,null,"Кольцо песочное.",48,30]
[null,null,"Корж   молочный.",90,30]
[null,null,"корзинка с белковым кремом.",54,40]
[null,null,"корзинка фруктовая..",80,40]
[null,null,"Лакомка слоёная .",35,30]
[null,null,"орешек заварной.",50,45]
[null,null,"полоска песочная..",75,45]
[null,null,"Розан с ананасом(Кухня)",100,55]
[null,null,"Розан с вишней(Кухня)",50,55]
[null,null,"Розан с вишней(Кухня)ДЕТИ",50,25]
[null,null,"Розан с персиком(Кухня)",100,55]
[null,null,"Розан с яблоком(Кухня)",100,50]
[null,15093,"Хлеб белый",24,5]
[null,15094,"Хлеб белый/черный ","30/30",10]
[null,15095,"Хлеб черный",24,5]
[null,null,"ШОКОЛАД"]
[null,null,"Батончик Яшкино",1,"30,00 р."]
[null,null,"Вафли Гулливер.",1,"25,00 р."]
[null,null,"Вафли Коровка (150 г.)",1,"50,00 р."]
[null,null,"Круассан.",1,"50,00 р."]
[null,null,"Русский бисквит.",1,"25,00 р."]
[null,null,"Торт Боярушка.",1,"25,00 р."]
[null,null,"Чоко-пай../к",1,"25,00 р."]
[null,null,"МЕНЮ ДЛЯ ФУРШЕТА"]
[null,16001,"Блинчики фаршированные мясом","40/20","50,00 р."]
[null,null,"Блинчики фаршированные с  говядиной","40/20","50,00 р."]
[null,null,"Блинчики фаршированные сыром и ветчиной","40/20","50,00 р."]
[null,null,"Блинчики фаршированные творогом","40/20","50,00 р."]
[null,null,"Блинчики фаршированныекурин. фаршем","40/20","50,00 р."]
[null,null,"МОЛОЧНЫЕ ПРОДУКТЫ"]
[null,null,"Колбаса п/к..к","50/1",60]
[null,17003,"Йогурт.","1/125",50]
[null,null,"Кефир.",1,0.2]
[null,17005,"Масло сливочное(Рест)",15,40]
[null,null,"Молоко.",200,40]
[null,null,"Сливки порционные.",1,10]
[null,17013,"Сыр(Рест)",50,100]
[null,null,"Сырок глазированый.",40,30]
[null,null,"Творог с сахаром и сметаной.",170,100]
[null,null,"Творог со сметаной.",150,80]
[null,null,"НАПИТКИ (РЕСТ)"]
[null,null,"НАПИТКИ"]
[null,null,"Какао с молоком",150,30]
[null,28010,"Чай черный с сахаром и лимоном","150/15/9",40]
[null,null,"Кофе растворимый с сахаром ","150/15","45,00 р."]
[null,null,"Кофе растворимый с сахаром и лимоном","150/15/9","45,00 р."]
[null,null,"Кофе растворимый.к",1,"6,17 р."]
[null,null,"Кофе черный 1 пак.",1,"15,00 р."]
[null,null,"Напиток вишнёво-грушевый",200,25]
[null,null,"Напиток вишневый.",200,25]
[null,null,"Напиток грушевый",200,25]
[null,null,"Напиток из клюквы",200,50]
[null,null,"Напиток из кураги.",200,30]
[null,null,"Напиток из слив.",200,25]
[null,null,"Напиток из яблока с изюмом",200,25]
[null,null,"Напиток персиковый",200,25]
[null,null,"Напиток яблочно-апельсиновый",200,25]
[null,null,"Напиток яблочно-вишнёвый",200,25]
[null,null,"Напиток яблочно-ежевичный",200,25]
[null,null,"Напиток яблочно-клубничный",200,25]
[null,null,"Напиток яблочно-клюквенный",200,35]
[null,18021,"Напиток яблочно-лимонный",200,25]
[null,18022,"Напиток яблочно-смородиновый",200,25]
[null,null,"Чай зеленый пакет.",1,"15,00 р."]
[null,null,"Чай черный пакет.",1,"15,00 р."]
[null,null,"Молоко с куркумой.",150,40]
[]
[]
[]
[]
[]
[]
[]
[]
[]
[]
[]
{"$rows_left_out":150}