{"text_format":"1","workbook":"xlsx","n_sheets":3,"sheets":["2019","Ремонты","Стоимость Ремонтов"],"not_rendered":{"charts":0,"images":0,"macros":0,"external_links":0,"defined_names":2,"comments":0,"pivot_tables":0},"unopened":[],"bounds":{"document_bytes":16777216,"sheet_cells":100000,"rows_first":2000,"rows_last":500,"rows_between":2000,"halvings":0,"cell_chars":16384,"cell_head_chars":4096},"cells_cut":0,"cells_raw":0,"read":"whole","date_system":"1900"}

{"sheet":"2019","index":0,"n_rows":51,"n_cols":2,"rows_kept":51,"cut":false,"hidden":false,"merged":[]}
["дата ремонта","Стоимость Ремонта"]
[{"$f":"Ремонты!B2","v":"2021-06-25"}]
[{"$f":"Ремонты!B3","v":"2021-04-02"}]
[{"$f":"Ремонты!B4","v":"2019-11-30"}]
[{"$f":"Ремонты!B5","v":"2021-05-31"}]
[{"$f":"Ремонты!B6","v":"2021-03-11"}]
[{"$f":"Ремонты!B7","v":"2021-05-08"}]
[{"$f":"Ремонты!B8","v":"2022-03-22"}]
[{"$f":"Ремонты!B9","v":"2021-04-10"}]
[{"$f":"Ремонты!B10","v":"2021-05-16"}]
[{"$f":"Ремонты!B11","v":"2024-04-25"}]
[{"$f":"Ремонты!B12","v":"2021-03-30"}]
[{"$f":"Ремонты!B13","v":"2021-05-27"}]
[{"$f":"Ремонты!B14","v":"2021-03-31"}]
[{"$f":"Ремонты!B15","v":"2021-03-18"}]
[{"$f":"Ремонты!B16","v":"2021-06-13"}]
[{"$f":"Ремонты!B17","v":"2021-03-28"}]
[{"$f":"Ремонты!B18","v":"2025-02-18"}]
[{"$f":"Ремонты!B19","v":"2021-03-27"}]
[{"$f":"Ремонты!B20","v":"2021-04-20"}]
[{"$f":"Ремонты!B21","v":"2021-06-07"}]
[{"$f":"Ремонты!B22","v":"2026-08-05"}]
[{"$f":"Ремонты!B23","v":"2021-04-28"}]
[{"$f":"Ремонты!B24","v":"2021-04-15"}]
[{"$f":"Ремонты!B25","v":"2021-06-17"}]
[{"$f":"Ремонты!B26","v":"2020-08-17"}]
[{"$f":"Ремонты!B27","v":"2021-04-22"}]
[{"$f":"Ремонты!B28","v":"2021-08-24"}]
[{"$f":"Ремонты!B29","v":"2021-03-05"}]
[{"$f":"Ремонты!B30","v":"2027-05-25"}]
[{"$f":"Ремонты!B31","v":"2021-05-23"}]
[{"$f":"Ремонты!B32","v":"2021-05-31"}]
[{"$f":"Ремонты!B33","v":"2021-05-25"}]
[{"$f":"Ремонты!B34","v":"2021-05-27"}]
[{"$f":"Ремонты!B35","v":"2025-05-18"}]
[{"$f":"Ремонты!B36","v":"2021-04-22"}]
[{"$f":"Ремонты!B37","v":"2021-04-04"}]
[{"$f":"Ремонты!B38","v":"2021-01-27"}]
[{"$f":"Ремонты!B39","v":"2021-07-03"}]
[{"$f":"Ремонты!B40","v":"2021-04-28"}]
[{"$f":"Ремонты!B41","v":"2027-08-20"}]
[{"$f":"Ремонты!B42","v":"2020-07-04"}]
[{"$f":"Ремонты!B43","v":"2021-05-25"}]
[{"$f":"Ремонты!B44","v":"2021-04-27"}]
[{"$f":"Ремонты!B45","v":"2021-05-27"}]
[{"$f":"Ремонты!B46","v":"2025-06-16"}]
[{"$f":"Ремонты!B47","v":"2021-04-23"}]
[{"$f":"Ремонты!B48","v":"2021-08-13"}]
[{"$f":"Ремонты!B49","v":"2021-06-27"}]
[{"$f":"Ремонты!B50","v":"2021-05-03"}]
[{"$f":"Ремонты!B51","v":"2021-03-26"}]

{"sheet":"Ремонты","index":1,"n_rows":51,"n_cols":3,"rows_kept":51,"cut":false,"hidden":false,"merged":[]}
["Срок Службы","Дата предполагаемого Ремонта"]
["2044-05-08","2021-06-25",{"$f":"INDEX('Стоимость Ремонтов'!C:C,MATCH(YEAR(B2),'Стоимость Ремонтов'!$A$1:$A$65,0)+(getFColor<>1))","v":110000}]
["2044-05-08","2021-04-02",{"$f":"INDEX('Стоимость Ремонтов'!C:C,MATCH(YEAR(B3),'Стоимость Ремонтов'!$A$1:$A$65,0)+(getFColor<>1))","v":110000}]
["2044-05-08","2019-11-30",{"$f":"INDEX('Стоимость Ремонтов'!C:C,MATCH(YEAR(B4),'Стоимость Ремонтов'!$A$1:$A$65,0)+(getFColor<>1))","v":100000}]
["2044-05-16","2021-05-31",{"$f":"INDEX('Стоимость Ремонтов'!C:C,MATCH(YEAR(B5),'Стоимость Ремонтов'!$A$1:$A$65,0)+(getFColor<>1))","v":110000}]
["2044-05-17","2021-03-11",{"$f":"INDEX('Стоимость Ремонтов'!C:C,MATCH(YEAR(B6),'Стоимость Ремонтов'!$A$1:$A$65,0)+(getFColor<>1))","v":110000}]
["2044-05-17","2021-05-08",{"$f":"INDEX('Стоимость Ремонтов'!C:C,MATCH(YEAR(B7),'Стоимость Ремонтов'!$A$1:$A$65,0)+(getFColor<>1))","v":110000}]
["2044-05-18","2022-03-22",{"$f":"INDEX('Стоимость Ремонтов'!C:C,MATCH(YEAR(B8),'Стоимость Ремонтов'!$A$1:$A$65,0)+(getFColor<>1))","v":115000}]
["2044-05-18","2021-04-10",{"$f":"INDEX('Стоимость Ремонтов'!C:C,MATCH(YEAR(B9),'Стоимость Ремонтов'!$A$1:$A$65,0)+(getFColor<>1))","v":110000}]
["2044-05-18","2021-05-16",{"$f":"INDEX('Стоимость Ремонтов'!C:C,MATCH(YEAR(B10),'Стоимость Ремонтов'!$A$1:$A$65,0)+(getFColor<>1))","v":110000}]
["2044-05-18","2024-04-25",{"$f":"INDEX('Стоимость Ремонтов'!C:C,MATCH(YEAR(B11),'Стоимость Ремонтов'!$A$1:$A$65,0)+(getFColor<>1))","v":125000}]
["2044-05-19","2021-03-30",{"$f":"INDEX('Стоимость Ремонтов'!C:C,MATCH(YEAR(B12),'Стоимость Ремонтов'!$A$1:$A$65,0)+(getFColor<>1))","v":110000}]
["2044-05-19","2021-05-27",{"$f":"INDEX('Стоимость Ремонтов'!C:C,MATCH(YEAR(B13),'Стоимость Ремонтов'!$A$1:$A$65,0)+(getFColor<>1))","v":110000}]
["2044-05-19","2021-03-31",{"$f":"INDEX('Стоимость Ремонтов'!C:C,MATCH(YEAR(B14),'Стоимость Ремонтов'!$A$1:$A$65,0)+(getFColor<>1))","v":110000}]
["2044-05-19","2021-03-18",{"$f":"INDEX('Стоимость Ремонтов'!C:C,MATCH(YEAR(B15),'Стоимость Ремонтов'!$A$1:$A$65,0)+(getFColor<>1))","v":110000}]
["2044-05-21","2021-06-13",{"$f":"INDEX('Стоимость Ремонтов'!C:C,MATCH(YEAR(B16),'Стоимость Ремонтов'!$A$1:$A$65,0)+(getFColor<>1))","v":110000}]
["2044-05-21","2021-03-28",{"$f":"INDEX('Стоимость Ремонтов'!C:C,MATCH(YEAR(B17),'Стоимость Ремонтов'!$A$1:$A$65,0)+(getFColor<>1))","v":110000}]
["2044-05-22","2025-02-18",{"$f":"INDEX('Стоимость Ремонтов'!C:C,MATCH(YEAR(B18),'Стоимость Ремонтов'!$A$1:$A$65,0)+(getFColor<>1))","v":240000}]
["2044-05-22","2021-03-27",{"$f":"INDEX('Стоимость Ремонтов'!C:C,MATCH(YEAR(B19),'Стоимость Ремонтов'!$A$1:$A$65,0)+(getFColor<>1))","v":110000}]
["2044-05-22","2021-04-20",{"$f":"INDEX('Стоимость Ремонтов'!C:C,MATCH(YEAR(B20),'Стоимость Ремонтов'!$A$1:$A$65,0)+(getFColor<>1))","v":110000}]
["2044-05-23","2021-06-07",{"$f":"INDEX('Стоимость Ремонтов'!C:C,MATCH(YEAR(B21),'Стоимость Ремонтов'!$A$1:$A$65,0)+(getFColor<>1))","v":110000}]
["2044-05-23","2026-08-05",{"$f":"INDEX('Стоимость Ремонтов'!C:C,MATCH(YEAR(B22),'Стоимость Ремонтов'!$A$1:$A$65,0)+(getFColor<>1))","v":135000}]
["2044-05-23","2021-04-28",{"$f":"INDEX('Стоимость Ремонтов'!C:C,MATCH(YEAR(B23),'Стоимость Ремонтов'!$A$1:$A$65,0)+(getFColor<>1))","v":110000}]
["2044-05-23","2021-04-15",{"$f":"INDEX('Стоимость Ремонтов'!C:C,MATCH(YEAR(B24),'Стоимость Ремонтов'!$A$1:$A$65,0)+(getFColor<>1))","v":110000}]
["2044-05-23","2021-06-17",{"$f":"INDEX('Стоимость Ремонтов'!C:C,MATCH(YEAR(B25),'Стоимость Ремонтов'!$A$1:$A$65,0)+(getFColor<>1))","v":110000}]
["2044-05-23","2020-08-17",{"$f":"INDEX('Стоимость Ремонтов'!C:C,MATCH(YEAR(B26),'Стоимость Ремонтов'!$A$1:$A$65,0)+(getFColor<>1))","v":105000}]
["2044-05-24","2021-04-22",{"$f":"INDEX('Стоимость Ремонтов'!C:C,MATCH(YEAR(B27),'Стоимость Ремонтов'!$A$1:$A$65,0)+(getFColor<>1))","v":110000}]
["2044-05-24","2021-08-24",{"$f":"INDEX('Стоимость Ремонтов'!C:C,MATCH(YEAR(B28),'Стоимость Ремонтов'!$A$1:$A$65,0)+(getFColor<>1))","v":110000}]
["2044-05-24","2021-03-05",{"$f":"INDEX('Стоимость Ремонтов'!C:C,MATCH(YEAR(B29),'Стоимость Ремонтов'!$A$1:$A$65,0)+(getFColor<>1))","v":110000}]
["2044-05-25","2027-05-25",{"$f":"INDEX('Стоимость Ремонтов'!C:C,MATCH(YEAR(B30),'Стоимость Ремонтов'!$A$1:$A$65,0)+(getFColor<>1))","v":260000}]
["2044-05-25","2021-05-23",{"$f":"INDEX('Стоимость Ремонтов'!C:C,MATCH(YEAR(B31),'Стоимость Ремонтов'!$A$1:$A$65,0)+(getFColor<>1))","v":110000}]
["2044-05-25","2021-05-31",{"$f":"INDEX('Стоимость Ремонтов'!C:C,MATCH(YEAR(B32),'Стоимость Ремонтов'!$A$1:$A$65,0)+(getFColor<>1))","v":110000}]
["2044-05-25","2021-05-25",{"$f":"INDEX('Стоимость Ремонтов'!C:C,MATCH(YEAR(B33),'Стоимость Ремонтов'!$A$1:$A$65,0)+(getFColor<>1))","v":110000}]
["2044-06-05","2021-05-27",{"$f":"INDEX('Стоимость Ремонтов'!C:C,MATCH(YEAR(B34),'Стоимость Ремонтов'!$A$1:$A$65,0)+(getFColor<>1))","v":110000}]
["2044-06-05","2025-05-18",{"$f":"INDEX('Стоимость Ремонтов'!C:C,MATCH(YEAR(B35),'Стоимость Ремонтов'!$A$1:$A$65,0)+(getFColor<>1))","v":240000}]
["2044-06-08","2021-04-22",{"$f":"INDEX('Стоимость Ремонтов'!C:C,MATCH(YEAR(B36),'Стоимость Ремонтов'!$A$1:$A$65,0)+(getFColor<>1))","v":110000}]
["2044-06-08","2021-04-04",{"$f":"INDEX('Стоимость Ремонтов'!C:C,MATCH(YEAR(B37),'Стоимость Ремонтов'!$A$1:$A$65,0)+(getFColor<>1))","v":110000}]
["2044-06-08","2021-01-27",{"$f":"INDEX('Стоимость Ремонтов'!C:C,MATCH(YEAR(B38),'Стоимость Ремонтов'!$A$1:$A$65,0)+(getFColor<>1))","v":110000}]
["2044-06-11","2021-07-03",{"$f":"INDEX('Стоимость Ремонтов'!C:C,MATCH(YEAR(B39),'Стоимость Ремонтов'!$A$1:$A$65,0)+(getFColor<>1))","v":110000}]
["2044-06-11","2021-04-28",{"$f":"INDEX('Стоимость Ремонтов'!C:C,MATCH(YEAR(B40),'Стоимость Ремонтов'!$A$1:$A$65,0)+(getFColor<>1))","v":110000}]
["2044-06-11","2027-08-20",{"$f":"INDEX('Стоимость Ремонтов'!C:C,MATCH(YEAR(B41),'Стоимость Ремонтов'!$A$1:$A$65,0)+(getFColor<>1))","v":140000}]
["2044-06-11","2020-07-04",{"$f":"INDEX('Стоимость Ремонтов'!C:C,MATCH(YEAR(B42),'Стоимость Ремонтов'!$A$1:$A$65,0)+(getFColor<>1))","v":105000}]
["2044-06-11","2021-05-25",{"$f":"INDEX('Стоимость Ремонтов'!C:C,MATCH(YEAR(B43),'Стоимость Ремонтов'!$A$1:$A$65,0)+(getFColor<>1))","v":110000}]
["2044-06-11","2021-04-27",{"$f":"INDEX('Стоимость Ремонтов'!C:C,MATCH(YEAR(B44),'Стоимость Ремонтов'!$A$1:$A$65,0)+(getFColor<>1))","v":110000}]
["2044-06-11","2021-05-27",{"$f":"INDEX('Стоимость Ремонтов'!C:C,MATCH(YEAR(B45),'Стоимость Ремонтов'!$A$1:$A$65,0)+(getFColor<>1))","v":110000}]
["2044-06-11","2025-06-16",{"$f":"INDEX('Стоимость Ремонтов'!C:C,MATCH(YEAR(B46),'Стоимость Ремонтов'!$A$1:$A$65,0)+(getFColor<>1))","v":240000}]
["2044-06-11","2021-04-23",{"$f":"INDEX('Стоимость Ремонтов'!C:C,MATCH(YEAR(B47),'Стоимость Ремонтов'!$A$1:$A$65,0)+(getFColor<>1))","v":110000}]
["2044-06-11","2021-08-13",{"$f":"INDEX('Стоимость Ремонтов'!C:C,MATCH(YEAR(B48),'Стоимость Ремонтов'!$A$1:$A$65,0)+(getFColor<>1))","v":110000}]
["2044-06-12","2021-06-27",{"$f":"INDEX('Стоимость Ремонтов'!C:C,MATCH(YEAR(B49),'Стоимость Ремонтов'!$A$1:$A$65,0)+(getFColor<>1))","v":110000}]
["2044-06-12","2021-05-03",{"$f":"INDEX('Стоимость Ремонтов'!C:C,MATCH(YEAR(B50),'Стоимость Ремонтов'!$A$1:$A$65,0)+(getFColor<>1))","v":110000}]
["2044-06-12","2021-03-26",{"$f":"INDEX('Стоимость Ремонтов'!C:C,MATCH(YEAR(B51),'Стоимость Ремонтов'!$A$1:$A$65,0)+(getFColor<>1))","v":110000}]

{"sheet":"Стоимость Ремонтов","index":2,"n_rows":65,"n_cols":3,"rows_kept":65,"cut":false,"hidden":false,"merged":[]}
["ГОД","Вид Ремонта","Стоимость"]
[2019,"Плановый",100000]
[null,"Капитальный",180000]
[2020,"Плановый",105000]
[null,"Капитальный",190000]
[2021,"Плановый",110000]
[null,"Капитальный",200000]
[2022,"Плановый",115000]
[null,"Капитальный",210000]
[2023,"Плановый",120000]
[null,"Капитальный",220000]
[2024,"Плановый",125000]
[null,"Капитальный",230000]
[2025,"Плановый",130000]
[null,"Капитальный",240000]
[2026,"Плановый",135000]
[null,"Капитальный",250000]
[2027,"Плановый",140000]
[null,"Капитальный",260000]
[2028,"Плановый",145000]
[null,"Капитальный",270000]
[2029,"Плановый",150000]
[null,"Капитальный",280000]
[2030,"Плановый",150000]
[null,"Капитальный",290000]
[2031,"Плановый",150000]
[null,"Капитальный",290000]
[2032,"Плановый",150000]
[null,"Капитальный",290000]
[2033,"Плановый",150000]
[null,"Капитальный",290000]
[2034,"Плановый",150000]
[null,"Капитальный",290000]
[2035,"Плановый",150000]
[null,"Капитальный",300000]
[2036,"Плановый",150000]
[null,"Капитальный",300000]
[2037,"Плановый",150000]
[null,"Капитальный",300000]
[2038,"Плановый",150000]
[null,"Капитальный",300000]
[2039,"Плановый",150000]
[null,"Капитальный",300000]
[2040,"Плановый",150000]
[null,"Капитальный",300000]
[2041,"Плановый",150000]
[null,"Капитальный",300000]
[2042,"Плановый",150000]
[null,"Капитальный",300000]
[2043,"Плановый",150000]
[null,"Капитальный",300000]
[2044,"Плановый",150000]
[null,"Капитальный",300000]
[2045,"Плановый",150000]
[null,"Капитальный",300000]
[2046,"Плановый",150000]
[null,"Капитальный",300000]
[2047,"Плановый",150000]
[null,"Капитальный",300000]
[2048,"Плановый",150000]
[null,"Капитальный",300000]
[2049,"Плановый",150000]
[null,"Капитальный",300000]
[2050,"Плановый",150000]
[null,"Капитальный",300000]