{"text_format":"1","workbook":"xlsx","n_sheets":3,"sheets":["Лист1","Лист2","Лист3"],"not_rendered":{"charts":0,"images":0,"macros":1,"external_links":0,"defined_names":19,"comments":0,"pivot_tables":0},"unopened":[],"bounds":{"document_bytes":16777216,"sheet_cells":100000,"rows_first":2000,"rows_last":500,"rows_between":2000,"halvings":0,"cell_chars":16384,"cell_head_chars":4096},"cells_cut":0,"cells_raw":0,"read":"whole","date_system":"1900"}

{"sheet":"Лист1","index":0,"n_rows":31,"n_cols":106,"rows_kept":31,"cut":false,"hidden":false,"merged":[[0,4,0,8],[0,20,0,21],[0,22,0,24],[0,25,0,27],[0,29,0,30]]}
[]
[null,null,null,null,null,null,"=Лист1!W3",null,null,null,{"$f":"#REF!","v":{"$error":"#REF!"}},null,null,null,null,null,null,null,null,null,null,null,null,null,null,null,null,null,{"$f":"CONCATENATE(#REF!,\"  м\")","v":{"$error":"#REF!"}},null,null,null,null,null,null,null,null,null,null,{"$f":"#REF!","v":{"$error":"#REF!"}},null,null,null,null,null,null,null,{"$f":"#REF!","v":{"$error":"#REF!"}},{"$f":"#REF!","v":{"$error":"#REF!"}},{"$f":"#REF!","v":{"$error":"#REF!"}},{"$f":"#REF!","v":{"$error":"#REF!"}},{"$f":"#REF!","v":{"$error":"#REF!"}},{"$f":"#REF!","v":{"$error":"#REF!"}},{"$f":"#REF!","v":{"$error":"#REF!"}},{"$f":"#REF!","v":{"$error":"#REF!"}},{"$f":"#REF!","v":{"$error":"#REF!"}},{"$f":"#REF!","v":{"$error":"#REF!"}},{"$f":"#REF!","v":{"$error":"#REF!"}},{"$f":"#REF!","v":{"$error":"#REF!"}},{"$f":"#REF!","v":{"$error":"#REF!"}},{"$f":"#REF!","v":{"$error":"#REF!"}},{"$f":"#REF!","v":{"$error":"#REF!"}},{"$f":"#REF!","v":{"$error":"#REF!"}},{"$f":"#REF!","v":{"$error":"#REF!"}},{"$f":"#REF!","v":{"$error":"#REF!"}},{"$f":"#REF!","v":{"$error":"#REF!"}},{"$f":"#REF!","v":{"$error":"#REF!"}},{"$f":"#REF!","v":{"$error":"#REF!"}},{"$f":"#REF!","v":{"$error":"#REF!"}},{"$f":"#REF!","v":{"$error":"#REF!"}},{"$f":"#REF!","v":{"$error":"#REF!"}},{"$f":"#REF!","v":{"$error":"#REF!"}},{"$f":"#REF!","v":{"$error":"#REF!"}},{"$f":"#REF!","v":{"$error":"#REF!"}},{"$f":"#REF!","v":{"$error":"#REF!"}},{"$f":"#REF!","v":{"$error":"#REF!"}},{"$f":"#REF!","v":{"$error":"#REF!"}},{"$f":"#REF!","v":{"$error":"#REF!"}},{"$f":"#REF!","v":{"$error":"#REF!"}},null,{"$f":"#REF!","v":{"$error":"#REF!"}},{"$f":"#REF!","v":{"$error":"#REF!"}},{"$f":"#REF!","v":{"$error":"#REF!"}},{"$f":"#REF!","v":{"$error":"#REF!"}},{"$f":"#REF!","v":{"$error":"#REF!"}},{"$f":"#REF!","v":{"$error":"#REF!"}},{"$f":"#REF!","v":{"$error":"#REF!"}},{"$f":"#REF!","v":{"$error":"#REF!"}},{"$f":"#REF!","v":{"$error":"#REF!"}},{"$f":"#REF!","v":{"$error":"#REF!"}},{"$f":"#REF!","v":{"$error":"#REF!"}},null,null,null,null,null,null,null,null,null,{"$f":"#REF!","v":{"$error":"#REF!"}},{"$f":"#REF!","v":{"$error":"#REF!"}},{"$f":"#REF!","v":{"$error":"#REF!"}},{"$f":"#REF!","v":{"$error":"#REF!"}},{"$f":"#REF!","v":{"$error":"#REF!"}},{"$f":"#REF!","v":{"$error":"#REF!"}}]
[null,null,null,null,"Н77",null,null,null,null,null,null,null,null,null,null,null,null,null,null,null,"2К","1","2КМ",{"$f":"IF(V3=\"\",IF(#REF!=\"\",#REF!,#REF!),V3)","v":"1"},"a",null,null,null,null,1,null,null,{"$f":"IF(Z3=\"BSX\",ROUNDUP(AA3*3.1*AC3/1000,2),)","v":0},{"$f":"ROUNDUP(AC3/1000*IF(Z3=\"HTSX\",IF(AA3=3,9.2-1.7*(S3-10)/20,IF(AA3=6,18.4-4.4*(S3-10)/30,IF(AA3=9,27.9-8.3*(S3-10)/40,IF(AA3=12,37.5-12.7*(S3-10)/50,IF(AA3=15,47.5-14*(S3-10)/50,IF(AA3=20,64.5-20.3*(S3-10)/70,\"Ошибка!!!\")))))),),2)","v":0},null,null,null,null,{"$f":"SUM(AG3:AK3)","v":0},0.81,null,null,null,null,null,4.6999999999999993,4.6999999999999993]
[null,null,null,null,"Г9",null,null,null,null,null,null,1,null,null,null,null,null,null,null,null,"3К","1","3КМ",{"$f":"IF(V4=\"\",IF(#REF!=\"\",#REF!,#REF!),V4)","v":"1"},"a",null,null,null,null,1,null,null,0,0,null,null,null,null,{"$f":"SUM(AG4:AK4)","v":0},0.81,null,null,null,null,null,4.6999999999999993,4.6999999999999993]
[null,null,null,null,"Г9",null,null,null,null,null,null,1,null,null,null,null,null,null,null,null,null,null,null,{"$f":"IF(V5=\"\",IF(V4=\"\",#REF!,V4),V5)","v":"1"},"в",null,null,null,null,1,null,null,0,0,null,null,null,null,0,5.3999999999999995,null,null,null,null,null,29.1,29.1]
[null,null,null,null,"Г9",null,null,null,null,null,null,1,null,null,null,null,null,null,null,null,null,null,null,{"$f":"IF(V6=\"\",IF(V5=\"\",V4,V5),V6)","v":"1"},"с",null,null,null,null,1,null,null,0,0,null,null,null,null,0,0.81,null,null,null,null,null,4.6999999999999993,4.6999999999999993]
[null,null,null,null,"Н77",null,null,null,null,null,null,1,null,null,null,null,null,null,null,null,"3К","2","3КМ",{"$f":"IF(V7=\"\",IF(V6=\"\",V5,V6),V7)","v":"2"},{"$f":"IF(X7=\"\",\"\",IF(AND(X7=X6,X6<>X5),\"в\",IF(AND(X6=X5,X7=X6,X5<>X4),\"с\",IF(AND(X7=X6,X6=X5,X5=X4),\"Ошибка\",\"а\"))))","v":"а"},null,null,null,null,1,null,null,0,0,null,null,null,null,0,0.81,null,null,null,null,null,5.1999999999999993,5.1999999999999993]
[null,null,null,null,"Н77",null,null,null,null,null,null,1,null,null,null,null,null,null,null,null,null,null,null,{"$f":"IF(V8=\"\",IF(V7=\"\",V6,V7),V8)","v":"2"},{"$f":"IF(X8=\"\",\"\",IF(AND(X8=X7,X7<>X6),\"в\",IF(AND(X7=X6,X8=X7,X6<>X5),\"с\",IF(AND(X8=X7,X7=X6,X6=X5),\"Ошибка\",\"а\"))))","v":"в"},null,null,null,null,1,null,null,0,0,null,null,null,null,0,0.42,null,null,null,null,null,2.7,2.7]
[null,null,null,null,"Н77",null,null,null,null,null,null,null,null,null,null,null,null,null,null,null,null,null,null,{"$f":"IF(V9=\"\",IF(V8=\"\",V7,V8),V9)","v":"2"},{"$f":"IF(X9=\"\",\"\",IF(AND(X9=X8,X8<>X7),\"в\",IF(AND(X8=X7,X9=X8,X7<>X6),\"с\",IF(AND(X9=X8,X8=X7,X7=X6),\"Ошибка\",\"а\"))))","v":"с"},null,null,null,null,1,null,null,0,0,null,null,null,null,0,0.27,null,null,null,null,null,1.8,1.8]
[null,null,null,null,"Г18",null,null,null,null,null,null,3,null,null,null,null,null,null,null,null,"4К","1","3КМ",{"$f":"IF(V10=\"\",IF(#REF!=\"\",#REF!,#REF!),V10)","v":"1"},"а",null,null,null,null,2,null,null,0,0,null,null,null,null,{"$f":"SUM(AG10:AK10)","v":0},3.9699999999999998,null,null,null,null,null,23.1,23.1]
[null,null,null,null,"Г18",null,null,null,null,null,null,1,null,null,null,null,null,null,null,null,null,null,null,{"$f":"IF(V11=\"\",IF(V10=\"\",#REF!,V10),V11)","v":"1"},"в",null,null,null,null,2,null,null,0,0,null,null,null,null,0,2.73,null,null,null,null,null,15.9,15.9]
[null,null,null,null,"Г18",null,null,null,null,null,null,null,null,null,null,null,null,null,null,null,null,null,null,{"$f":"IF(V12=\"\",IF(V11=\"\",V10,V11),V12)","v":"1"},"с",null,null,null,null,2,null,null,0,0,null,null,null,null,0,1.33,null,null,null,null,null,7.6999999999999993,7.6999999999999993]
[null,null,null,null,"Г19",null,null,null,null,null,null,2,null,null,null,null,null,null,null,null,"4К","1.1",null,"1.1",{"$f":"IF(X13=\"\",\"\",IF(AND(X13=X12,X12<>X11),\"в\",IF(AND(X12=X11,X13=X12,X11<>X10),\"с\",IF(AND(X13=X12,X12=X11,X11=X10),\"Ошибка\",\"а\"))))","v":"а"},null,null,null,null,1,null,null,0,0,null,null,null,null,0,0.28000000000000003,null,null,null,null,null,2.1,2.1]
[null,null,null,null,"Г20",null,null,null,null,null,null,2,null,null,null,null,null,null,null,null,"4К","1.2",null,"1.2","а",null,null,null,null,1,null,null,0,0,null,null,null,null,0,0.28000000000000003,null,null,null,null,null,2.1,2.1]
[null,null,null,null,"Г20",null,null,null,null,null,null,1,null,null,null,null,null,null,null,null,"4К","1.3",null,"1.3","а",null,null,null,null,1,null,null,0,0,null,null,null,null,0,0.14000000000000001,null,null,null,null,null,1.1000000000000001,1.1000000000000001]
[null,null,null,null,"Г20",null,null,null,null,null,null,2,null,null,null,null,null,null,null,null,"4К","1.4",null,"1.4","а",null,null,null,null,1,null,null,0,0,null,null,null,null,0,2.3699999999999997,null,null,null,null,null,14.299999999999999,14.299999999999999]
[null,null,null,null,"Г21",null,null,null,null,null,null,2,null,null,null,null,null,null,null,null,"4К","1.5",null,"1.5","а",null,null,null,null,1,null,null,0,0,null,null,null,null,{"$f":"SUM(AG17:AK17)","v":0},2.1199999999999997,null,null,null,null,null,12.799999999999999,12.799999999999999]
[null,null,null,null,"Н77",null,null,null,null,null,null,1,null,null,null,null,null,null,null,null,"4К","2",null,"2","а",null,null,null,null,1,null,null,0,0,null,null,null,null,{"$f":"SUM(AG18:AK18)","v":0},0.18000000000000002,null,null,null,null,null,1.4000000000000001,1.4000000000000001]
[null,null,null,null,"Н77",null,null,null,null,null,null,null,null,null,null,null,null,null,null,null,null,null,null,"2","в",null,null,null,null,1,null,null,0,0,null,null,null,null,{"$f":"SUM(AG19:AK19)","v":0},0.36,null,null,null,null,null,2.7,2.7]
[null,null,null,null,"Н77",null,null,null,null,null,null,1,null,null,null,null,null,null,null,null,null,null,null,"2","с",null,null,null,null,1,null,null,0,0,null,null,null,null,{"$f":"SUM(AG20:AK20)","v":0},0.26,null,null,null,null,null,2,2]
{"$rows_left_out":12}
{"sheet":"Лист2","index":1,"n_rows":39,"n_cols":21,"rows_kept":39,"cut":false,"hidden":false,"merged":[[0,1,0,2],[0,4,0,7],[0,11,0,12]]}
[]
[{"$f":"Лист1!E:E","v":0},null,{"$f":"Лист1!X:X","v":0},{"$f":"IF(A:A=0,\"\",A:A)","v":""},{"$f":"IF(B:B=0,\"\",B:B)","v":""},{"$f":"IF(C:C=0,\"\",C:C)","v":""},null,{"$f":"Лист1!Y:Y","v":0},null,null,null,null,null,null,null,null,null,null,{"$f":"MATCH(ROW(S1),Лист2!R:R,)","v":3}]
[{"$f":"Лист1!E:E","v":"Н77"},{"$f":"Лист1!U:U","v":"2К"},{"$f":"Лист1!X:X","v":"1"},{"$f":"IF(A:A=0,\"\",A:A)","v":"Н77"},{"$f":"IF(B:B=0,\"\",B:B)","v":"2К"},{"$f":"IF(C:C=0,\"\",C:C)","v":"1"},null,{"$f":"Лист1!Y:Y","v":"a"},null,null,null,null,null,null,null,null,{"$f":"IF(H3<>\"С\",IF((TRIM(LEFT(SUBSTITUTE(F3,\".\",REPT(\" \",15)),15))=(TRIM(LEFT(SUBSTITUTE(F2,\".\",REPT(\" \",15)),15))))*ISNUMBER(FIND(\".\",F3)),\"\",D3),D3&\nIF((TRIM(LEFT(SUBSTITUTE(F4,\".\",REPT(\" \",15)),15))=F3)*(COUNTIF(D3:D4,D4)<2)*(COUNTIF(H3:H4,\"с\")=1),\",\"&D4,\"\")&\nIF((TRIM(LEFT(SUBSTITUTE(F5,\".\",REPT(\" \",15)),15))=F3)*(COUNTIF(D3:D5,D5)<2)*(COUNTIF(H3:H5,\"с\")=1),\",\"&D5,\"\")&\nIF((TRIM(LEFT(SUBSTITUTE(F6,\".\",REPT(\" \",15)),15))=F3)*(COUNTIF(D3:D6,D6)<2)*(COUNTIF(H3:H6,\"с\")=1),\",\"&D6,\"\")&\nIF((TRIM(LEFT(SUBSTITUTE(F7,\".\",REPT(\" \",15)),15))=F3)*(COUNTIF(D3:D7,D7)<2)*(COUNTIF(H3:H7,\"с\")=1),\",\"&D7,\"\")&\nIF((TRIM(LEFT(SUBSTITUTE(F8,\".\",REPT(\" \",15)),15))=F3)*(COUNTIF(D3:D8,D8)<2)*(COUNTIF(H3:H8,\"с\")=1),\",\"&D8,\"\")&\nIF((TRIM(LEFT(SUBSTITUTE(F9,\".\",REPT(\" \",15)),15))=F3)*(COUNTIF(D3:D9,D9)<2)*(COUNTIF(H3:H9,\"с\")=1),\",\"&D9,\"\")&\nIF((TRIM(LEFT(SUBSTITUTE(F10,\".\",REPT(\" \",15)),15))=F3)*(COUNTIF(D3:D10,D10)<2)*(COUNTIF(H3:H10,\"с\")=1),\",\"&D10,\"\"))","v":"Н77"},{"$f":"IF(Q3<>\"\",R2+1,R2)","v":1},{"$f":"MATCH(ROW(S2),Лист2!R:R,)","v":4},null,"Н77"]
[{"$f":"Лист1!E:E","v":"Г9"},{"$f":"Лист1!U:U","v":"3К"},{"$f":"Лист1!X:X","v":"1"},"Г9","3К","1",null,{"$f":"Лист1!Y:Y","v":"a"},null,null,null,null,null,null,null,null,{"$f":"IF(H4<>\"С\",IF((TRIM(LEFT(SUBSTITUTE(F4,\".\",REPT(\" \",15)),15))=(TRIM(LEFT(SUBSTITUTE(F3,\".\",REPT(\" \",15)),15))))*ISNUMBER(FIND(\".\",F4)),\"\",D4),D4&\nIF((TRIM(LEFT(SUBSTITUTE(F5,\".\",REPT(\" \",15)),15))=F4)*(COUNTIF(D4:D5,D5)<2)*(COUNTIF(H4:H5,\"с\")=1),\",\"&D5,\"\")&\nIF((TRIM(LEFT(SUBSTITUTE(F6,\".\",REPT(\" \",15)),15))=F4)*(COUNTIF(D4:D6,D6)<2)*(COUNTIF(H4:H6,\"с\")=1),\",\"&D6,\"\")&\nIF((TRIM(LEFT(SUBSTITUTE(F7,\".\",REPT(\" \",15)),15))=F4)*(COUNTIF(D4:D7,D7)<2)*(COUNTIF(H4:H7,\"с\")=1),\",\"&D7,\"\")&\nIF((TRIM(LEFT(SUBSTITUTE(F8,\".\",REPT(\" \",15)),15))=F4)*(COUNTIF(D4:D8,D8)<2)*(COUNTIF(H4:H8,\"с\")=1),\",\"&D8,\"\")&\nIF((TRIM(LEFT(SUBSTITUTE(F9,\".\",REPT(\" \",15)),15))=F4)*(COUNTIF(D4:D9,D9)<2)*(COUNTIF(H4:H9,\"с\")=1),\",\"&D9,\"\")&\nIF((TRIM(LEFT(SUBSTITUTE(F10,\".\",REPT(\" \",15)),15))=F4)*(COUNTIF(D4:D10,D10)<2)*(COUNTIF(H4:H10,\"с\")=1),\",\"&D10,\"\")&\nIF((TRIM(LEFT(SUBSTITUTE(F11,\".\",REPT(\" \",15)),15))=F4)*(COUNTIF(D4:D11,D11)<2)*(COUNTIF(H4:H11,\"с\")=1),\",\"&D11,\"\"))","v":"Г9"},{"$f":"IF(Q4<>\"\",R3+1,R3)","v":2},{"$f":"MATCH(ROW(S3),Лист2!R:R,)","v":5},null,"Г9"]
[{"$f":"Лист1!E:E","v":"Г9"},{"$f":"Лист1!U:U","v":0},{"$f":"Лист1!X:X","v":"1"},"Г9","","1",null,{"$f":"Лист1!Y:Y","v":"в"},null,null,null,null,null,null,null,null,"Г9",3,{"$f":"MATCH(ROW(S4),Лист2!R:R,)","v":6},null,"Г9"]
[{"$f":"Лист1!E:E","v":"Г9"},{"$f":"Лист1!U:U","v":0},{"$f":"Лист1!X:X","v":"1"},"Г9","","1",null,{"$f":"Лист1!Y:Y","v":"с"},null,null,null,null,null,null,null,null,"Г9",4,{"$f":"MATCH(ROW(S5),Лист2!R:R,)","v":7},null,"Г9"]
[{"$f":"Лист1!E:E","v":"Н77"},{"$f":"Лист1!U:U","v":"3К"},{"$f":"Лист1!X:X","v":"2"},"Н77","3К","2",null,{"$f":"Лист1!Y:Y","v":"а"},null,null,null,null,null,null,null,null,"Н77",5,{"$f":"MATCH(ROW(S6),Лист2!R:R,)","v":8},null,"Н77"]
[{"$f":"Лист1!E:E","v":"Н77"},{"$f":"Лист1!U:U","v":0},{"$f":"Лист1!X:X","v":"2"},"Н77","","2",null,{"$f":"Лист1!Y:Y","v":"в"},null,null,null,null,null,null,null,null,"Н77",6,{"$f":"MATCH(ROW(S7),Лист2!R:R,)","v":9},null,"Н77"]
[{"$f":"Лист1!E:E","v":"Н77"},{"$f":"Лист1!U:U","v":0},{"$f":"Лист1!X:X","v":"2"},"Н77","","2",null,{"$f":"Лист1!Y:Y","v":"с"},null,null,null,null,null,null,null,null,"Н77",7,{"$f":"MATCH(ROW(S8),Лист2!R:R,)","v":10},null,"Н77"]
[{"$f":"Лист1!E:E","v":"Г18"},{"$f":"Лист1!U:U","v":"4К"},{"$f":"Лист1!X:X","v":"1"},"Г18","4К","1",null,{"$f":"Лист1!Y:Y","v":"а"},null,null,null,null,null,null,null,null,"Г18",8,{"$f":"MATCH(ROW(S9),Лист2!R:R,)","v":11},null,"Г18"]
[{"$f":"Лист1!E:E","v":"Г18"},{"$f":"Лист1!U:U","v":0},{"$f":"Лист1!X:X","v":"1"},"Г18","","1",null,{"$f":"Лист1!Y:Y","v":"в"},null,null,null,null,null,null,null,null,"Г18",9,{"$f":"MATCH(ROW(S10),Лист2!R:R,)","v":12},null,"Г18"]
[{"$f":"Лист1!E:E","v":"Г18"},{"$f":"Лист1!U:U","v":0},{"$f":"Лист1!X:X","v":"1"},"Г18","","1",null,{"$f":"Лист1!Y:Y","v":"с"},null,null,null,null,null,null,null,null,"Г18,Г19,Г20,Г21",10,{"$f":"MATCH(ROW(S11),Лист2!R:R,)","v":18},null,"Г18,Г19,Г20,Г21"]
[{"$f":"Лист1!E:E","v":"Г19"},{"$f":"Лист1!U:U","v":"4К"},{"$f":"Лист1!X:X","v":"1.1"},"Г19","4К","1.1",null,{"$f":"Лист1!Y:Y","v":"а"},null,null,null,null,null,null,null,null,"",10,{"$f":"MATCH(ROW(S12),Лист2!R:R,)","v":19},null,{"$f":"IF(AND(B13<>0,COUNTIF($B$3:B13,B13)=1),ConcUnic(B13,$B$3:$D$30,3),\"\")","v":""}]
[{"$f":"Лист1!E:E","v":"Г20"},{"$f":"Лист1!U:U","v":"4К"},{"$f":"Лист1!X:X","v":"1.2"},"Г20","4К","1.2",null,{"$f":"Лист1!Y:Y","v":"а"},null,null,null,null,null,null,null,null,"",10,{"$f":"MATCH(ROW(S13),Лист2!R:R,)","v":20},null,{"$f":"IF(AND(B14<>0,COUNTIF($B$3:B14,B14)=1),ConcUnic(B14,$B$3:$D$30,3),\"\")","v":""}]
[{"$f":"Лист1!E:E","v":"Г20"},{"$f":"Лист1!U:U","v":"4К"},{"$f":"Лист1!X:X","v":"1.3"},"Г20","4К","1.3",null,{"$f":"Лист1!Y:Y","v":"а"},null,null,null,null,null,null,null,null,"",10,{"$f":"MATCH(ROW(S14),Лист2!R:R,)","v":21},null,{"$f":"IF(AND(B15<>0,COUNTIF($B$3:B15,B15)=1),ConcUnic(B15,$B$3:$D$30,3),\"\")","v":""}]
[{"$f":"Лист1!E:E","v":"Г20"},{"$f":"Лист1!U:U","v":"4К"},{"$f":"Лист1!X:X","v":"1.4"},"Г20","4К","1.4",null,{"$f":"Лист1!Y:Y","v":"а"},null,null,null,null,null,null,null,null,"",10,{"$f":"MATCH(ROW(S15),Лист2!R:R,)","v":22},null,{"$f":"IF(AND(B16<>0,COUNTIF($B$3:B16,B16)=1),ConcUnic(B16,$B$3:$D$30,3),\"\")","v":""}]
[{"$f":"Лист1!E:E","v":"Г21"},{"$f":"Лист1!U:U","v":"4К"},{"$f":"Лист1!X:X","v":"1.5"},"Г21","4К","1.5",null,{"$f":"Лист1!Y:Y","v":"а"},null,null,null,null,null,null,null,null,"",10,{"$f":"MATCH(ROW(S16),Лист2!R:R,)","v":23},null,{"$f":"IF(AND(B17<>0,COUNTIF($B$3:B17,B17)=1),ConcUnic(B17,$B$3:$D$30,3),\"\")","v":""}]
[{"$f":"Лист1!E:E","v":"Н77"},{"$f":"Лист1!U:U","v":"4К"},{"$f":"Лист1!X:X","v":"2"},"Н77","4К","2",null,{"$f":"Лист1!Y:Y","v":"а"},null,null,null,null,null,null,null,null,"Н77",11,{"$f":"MATCH(ROW(S17),Лист2!R:R,)","v":24}]
[{"$f":"Лист1!E:E","v":"Н77"},{"$f":"Лист1!U:U","v":0},{"$f":"Лист1!X:X","v":"2"},"Н77","","2",null,{"$f":"Лист1!Y:Y","v":"в"},null,null,null,null,null,null,null,null,"Н77",12,{"$f":"MATCH(ROW(S18),Лист2!R:R,)","v":25}]
[{"$f":"Лист1!E:E","v":"Н77"},{"$f":"Лист1!U:U","v":0},{"$f":"Лист1!X:X","v":"2"},"Н77","","2",null,{"$f":"Лист1!Y:Y","v":"с"},null,null,null,null,null,null,null,null,"Н77",13,{"$f":"MATCH(ROW(S19),Лист2!R:R,)","v":26}]
{"$rows_left_out":20}
{"sheet":"Лист3","index":2,"n_rows":29,"n_cols":4,"rows_kept":29,"cut":false,"hidden":false,"merged":[]}
["лист2Q","лист2E","лист2F","лист2H"]
[{"$f":"IF(ISNUMBER(Лист2!$S2),INDEX(Лист2!Q:Q,Лист2!$S2),\"\")","v":"Н77"},{"$f":"IF(ISNUMBER(Лист2!$S2),INDEX(Лист2!E:E,Лист2!$S2),\"\")","v":"2К"},{"$f":"IF(ISNUMBER(Лист2!$S2),INDEX(Лист2!F:F,Лист2!$S2),\"\")","v":"1"},{"$f":"IF(ISNUMBER(Лист2!$S2),INDEX(Лист2!H:H,Лист2!$S2),\"\")","v":"a"}]
[{"$f":"IF(ISNUMBER(Лист2!$S3),INDEX(Лист2!Q:Q,Лист2!$S3),\"\")","v":"Г9"},{"$f":"IF(ISNUMBER(Лист2!$S3),INDEX(Лист2!E:E,Лист2!$S3),\"\")","v":"3К"},{"$f":"IF(ISNUMBER(Лист2!$S3),INDEX(Лист2!F:F,Лист2!$S3),\"\")","v":"1"},{"$f":"IF(ISNUMBER(Лист2!$S3),INDEX(Лист2!H:H,Лист2!$S3),\"\")","v":"a"}]
[{"$f":"IF(ISNUMBER(Лист2!$S4),INDEX(Лист2!Q:Q,Лист2!$S4),\"\")","v":"Г9"},{"$f":"IF(ISNUMBER(Лист2!$S4),INDEX(Лист2!E:E,Лист2!$S4),\"\")","v":""},{"$f":"IF(ISNUMBER(Лист2!$S4),INDEX(Лист2!F:F,Лист2!$S4),\"\")","v":"1"},{"$f":"IF(ISNUMBER(Лист2!$S4),INDEX(Лист2!H:H,Лист2!$S4),\"\")","v":"в"}]
[{"$f":"IF(ISNUMBER(Лист2!$S5),INDEX(Лист2!Q:Q,Лист2!$S5),\"\")","v":"Г9"},{"$f":"IF(ISNUMBER(Лист2!$S5),INDEX(Лист2!E:E,Лист2!$S5),\"\")","v":""},{"$f":"IF(ISNUMBER(Лист2!$S5),INDEX(Лист2!F:F,Лист2!$S5),\"\")","v":"1"},{"$f":"IF(ISNUMBER(Лист2!$S5),INDEX(Лист2!H:H,Лист2!$S5),\"\")","v":"с"}]
[{"$f":"IF(ISNUMBER(Лист2!$S6),INDEX(Лист2!Q:Q,Лист2!$S6),\"\")","v":"Н77"},{"$f":"IF(ISNUMBER(Лист2!$S6),INDEX(Лист2!E:E,Лист2!$S6),\"\")","v":"3К"},{"$f":"IF(ISNUMBER(Лист2!$S6),INDEX(Лист2!F:F,Лист2!$S6),\"\")","v":"2"},{"$f":"IF(ISNUMBER(Лист2!$S6),INDEX(Лист2!H:H,Лист2!$S6),\"\")","v":"а"}]
[{"$f":"IF(ISNUMBER(Лист2!$S7),INDEX(Лист2!Q:Q,Лист2!$S7),\"\")","v":"Н77"},{"$f":"IF(ISNUMBER(Лист2!$S7),INDEX(Лист2!E:E,Лист2!$S7),\"\")","v":""},{"$f":"IF(ISNUMBER(Лист2!$S7),INDEX(Лист2!F:F,Лист2!$S7),\"\")","v":"2"},{"$f":"IF(ISNUMBER(Лист2!$S7),INDEX(Лист2!H:H,Лист2!$S7),\"\")","v":"в"}]
[{"$f":"IF(ISNUMBER(Лист2!$S8),INDEX(Лист2!Q:Q,Лист2!$S8),\"\")","v":"Н77"},{"$f":"IF(ISNUMBER(Лист2!$S8),INDEX(Лист2!E:E,Лист2!$S8),\"\")","v":""},{"$f":"IF(ISNUMBER(Лист2!$S8),INDEX(Лист2!F:F,Лист2!$S8),\"\")","v":"2"},{"$f":"IF(ISNUMBER(Лист2!$S8),INDEX(Лист2!H:H,Лист2!$S8),\"\")","v":"с"}]
[{"$f":"IF(ISNUMBER(Лист2!$S9),INDEX(Лист2!Q:Q,Лист2!$S9),\"\")","v":"Г18"},{"$f":"IF(ISNUMBER(Лист2!$S9),INDEX(Лист2!E:E,Лист2!$S9),\"\")","v":"4К"},{"$f":"IF(ISNUMBER(Лист2!$S9),INDEX(Лист2!F:F,Лист2!$S9),\"\")","v":"1"},{"$f":"IF(ISNUMBER(Лист2!$S9),INDEX(Лист2!H:H,Лист2!$S9),\"\")","v":"а"}]
[{"$f":"IF(ISNUMBER(Лист2!$S10),INDEX(Лист2!Q:Q,Лист2!$S10),\"\")","v":"Г18"},{"$f":"IF(ISNUMBER(Лист2!$S10),INDEX(Лист2!E:E,Лист2!$S10),\"\")","v":""},{"$f":"IF(ISNUMBER(Лист2!$S10),INDEX(Лист2!F:F,Лист2!$S10),\"\")","v":"1"},{"$f":"IF(ISNUMBER(Лист2!$S10),INDEX(Лист2!H:H,Лист2!$S10),\"\")","v":"в"}]
[{"$f":"IF(ISNUMBER(Лист2!$S11),INDEX(Лист2!Q:Q,Лист2!$S11),\"\")","v":"Г18,Г19,Г20,Г21"},{"$f":"IF(ISNUMBER(Лист2!$S11),INDEX(Лист2!E:E,Лист2!$S11),\"\")","v":""},{"$f":"IF(ISNUMBER(Лист2!$S11),INDEX(Лист2!F:F,Лист2!$S11),\"\")","v":"1"},{"$f":"IF(ISNUMBER(Лист2!$S11),INDEX(Лист2!H:H,Лист2!$S11),\"\")","v":"с"}]
[{"$f":"IF(ISNUMBER(Лист2!$S12),INDEX(Лист2!Q:Q,Лист2!$S12),\"\")","v":"Н77"},{"$f":"IF(ISNUMBER(Лист2!$S12),INDEX(Лист2!E:E,Лист2!$S12),\"\")","v":"4К"},{"$f":"IF(ISNUMBER(Лист2!$S12),INDEX(Лист2!F:F,Лист2!$S12),\"\")","v":"2"},{"$f":"IF(ISNUMBER(Лист2!$S12),INDEX(Лист2!H:H,Лист2!$S12),\"\")","v":"а"}]
[{"$f":"IF(ISNUMBER(Лист2!$S13),INDEX(Лист2!Q:Q,Лист2!$S13),\"\")","v":"Н77"},{"$f":"IF(ISNUMBER(Лист2!$S13),INDEX(Лист2!E:E,Лист2!$S13),\"\")","v":""},{"$f":"IF(ISNUMBER(Лист2!$S13),INDEX(Лист2!F:F,Лист2!$S13),\"\")","v":"2"},{"$f":"IF(ISNUMBER(Лист2!$S13),INDEX(Лист2!H:H,Лист2!$S13),\"\")","v":"в"}]
[{"$f":"IF(ISNUMBER(Лист2!$S14),INDEX(Лист2!Q:Q,Лист2!$S14),\"\")","v":"Н77"},{"$f":"IF(ISNUMBER(Лист2!$S14),INDEX(Лист2!E:E,Лист2!$S14),\"\")","v":""},{"$f":"IF(ISNUMBER(Лист2!$S14),INDEX(Лист2!F:F,Лист2!$S14),\"\")","v":"2"},{"$f":"IF(ISNUMBER(Лист2!$S14),INDEX(Лист2!H:H,Лист2!$S14),\"\")","v":"с"}]
[{"$f":"IF(ISNUMBER(Лист2!$S15),INDEX(Лист2!Q:Q,Лист2!$S15),\"\")","v":"Г18"},{"$f":"IF(ISNUMBER(Лист2!$S15),INDEX(Лист2!E:E,Лист2!$S15),\"\")","v":"4К"},{"$f":"IF(ISNUMBER(Лист2!$S15),INDEX(Лист2!F:F,Лист2!$S15),\"\")","v":"3"},{"$f":"IF(ISNUMBER(Лист2!$S15),INDEX(Лист2!H:H,Лист2!$S15),\"\")","v":"а"}]
[{"$f":"IF(ISNUMBER(Лист2!$S16),INDEX(Лист2!Q:Q,Лист2!$S16),\"\")","v":"Г18"},{"$f":"IF(ISNUMBER(Лист2!$S16),INDEX(Лист2!E:E,Лист2!$S16),\"\")","v":""},{"$f":"IF(ISNUMBER(Лист2!$S16),INDEX(Лист2!F:F,Лист2!$S16),\"\")","v":"3"},{"$f":"IF(ISNUMBER(Лист2!$S16),INDEX(Лист2!H:H,Лист2!$S16),\"\")","v":"в"}]
[{"$f":"IF(ISNUMBER(Лист2!$S17),INDEX(Лист2!Q:Q,Лист2!$S17),\"\")","v":"Г18"},{"$f":"IF(ISNUMBER(Лист2!$S17),INDEX(Лист2!E:E,Лист2!$S17),\"\")","v":""},{"$f":"IF(ISNUMBER(Лист2!$S17),INDEX(Лист2!F:F,Лист2!$S17),\"\")","v":"3"},{"$f":"IF(ISNUMBER(Лист2!$S17),INDEX(Лист2!H:H,Лист2!$S17),\"\")","v":"с"}]
[{"$f":"IF(ISNUMBER(Лист2!$S18),INDEX(Лист2!Q:Q,Лист2!$S18),\"\")","v":"Н77"},{"$f":"IF(ISNUMBER(Лист2!$S18),INDEX(Лист2!E:E,Лист2!$S18),\"\")","v":"4К"},{"$f":"IF(ISNUMBER(Лист2!$S18),INDEX(Лист2!F:F,Лист2!$S18),\"\")","v":"4"},{"$f":"IF(ISNUMBER(Лист2!$S18),INDEX(Лист2!H:H,Лист2!$S18),\"\")","v":"а"}]
[{"$f":"IF(ISNUMBER(Лист2!$S19),INDEX(Лист2!Q:Q,Лист2!$S19),\"\")","v":"Н77"},{"$f":"IF(ISNUMBER(Лист2!$S19),INDEX(Лист2!E:E,Лист2!$S19),\"\")","v":""},{"$f":"IF(ISNUMBER(Лист2!$S19),INDEX(Лист2!F:F,Лист2!$S19),\"\")","v":"4"},{"$f":"IF(ISNUMBER(Лист2!$S19),INDEX(Лист2!H:H,Лист2!$S19),\"\")","v":"в"}]
[{"$f":"IF(ISNUMBER(Лист2!$S20),INDEX(Лист2!Q:Q,Лист2!$S20),\"\")","v":"Н77,Н76"},{"$f":"IF(ISNUMBER(Лист2!$S20),INDEX(Лист2!E:E,Лист2!$S20),\"\")","v":""},{"$f":"IF(ISNUMBER(Лист2!$S20),INDEX(Лист2!F:F,Лист2!$S20),\"\")","v":"4"},{"$f":"IF(ISNUMBER(Лист2!$S20),INDEX(Лист2!H:H,Лист2!$S20),\"\")","v":"с"}]
{"$rows_left_out":9}