{"text_format":"1","workbook":"xlsx","n_sheets":2,"sheets":["Лист1","Лист2"],"not_rendered":{"charts":0,"images":0,"macros":0,"external_links":0,"defined_names":1,"comments":0,"pivot_tables":0},"unopened":[],"bounds":{"document_bytes":16777216,"sheet_cells":100000,"rows_first":2000,"rows_last":500,"rows_between":2000,"halvings":0,"cell_chars":16384,"cell_head_chars":4096},"cells_cut":0,"cells_raw":0,"read":"whole","date_system":"1900"}

{"sheet":"Лист1","index":0,"n_rows":37,"n_cols":6,"rows_kept":37,"cut":false,"hidden":false,"merged":[]}
["№","Код","Модель","Кол-во, шт.","Цена за шт., ДОЛЛАРЫ США","Стоимость, ДОЛЛАРЫ США"]
["№","Code","Model","Quantity,\nin units","Price per unit, in US DOLLARS","Total price,\nin US DOLLARS"]
[{"$f":"IF(OR(B3=\"\",B3=\"*\"),\"\",\"1\")","v":"1"},4013,{"$f":"IFERROR(VLOOKUP(B3,Лист2!$A$1:$B$300,2,FALSE),\"\")","v":0},6,{"$f":"VLOOKUP(B3,Лист2!$A$1:$E$300,5,FALSE)","v":0},{"$f":"D3*E3","v":0}]
[{"$f":"IF(OR(B4=\"\",B4=\"*\"),\"\",\"2\")","v":"2"},4012,{"$f":"IFERROR(VLOOKUP(B4,Лист2!$A$1:$B$300,2,FALSE),\"\")","v":0},33,null,{"$f":"D4*E4","v":0}]
[{"$f":"IF(OR(B5=\"\",B5=\"*\"),\"\",\"3\")","v":""},null,{"$f":"IFERROR(VLOOKUP(B5,Лист2!$A$1:$B$300,2,FALSE),\"\")","v":""},null,null,{"$f":"D5*E5","v":0}]
[{"$f":"IF(OR(B6=\"\",B6=\"*\"),\"\",\"4\")","v":""},null,{"$f":"IFERROR(VLOOKUP(B6,Лист2!$A$1:$B$300,2,FALSE),\"\")","v":""},null,null,0]
[{"$f":"IF(OR(B7=\"\",B7=\"*\"),\"\",\"5\")","v":""},null,{"$f":"IFERROR(VLOOKUP(B7,Лист2!$A$1:$B$300,2,FALSE),\"\")","v":""},null,null,0]
[{"$f":"IF(OR(B8=\"\",B8=\"*\"),\"\",\"6\")","v":""},null,{"$f":"IFERROR(VLOOKUP(B8,Лист2!$A$1:$B$300,2,FALSE),\"\")","v":""},null,null,0]
[{"$f":"IF(OR(B9=\"\",B9=\"*\"),\"\",\"7\")","v":""},null,{"$f":"IFERROR(VLOOKUP(B9,Лист2!$A$1:$B$320,2,FALSE),\"\")","v":""},null,null,0]
[{"$f":"IF(OR(B10=\"\",B10=\"*\"),\"\",\"8\")","v":""},null,{"$f":"IFERROR(VLOOKUP(B10,Лист2!$A$1:$B$320,2,FALSE),\"\")","v":""},null,null,0]
[{"$f":"IF(OR(B11=\"\",B11=\"*\"),\"\",\"9\")","v":""},null,{"$f":"IFERROR(VLOOKUP(B11,Лист2!$A$1:$B$320,2,FALSE),\"\")","v":""},null,null,0]
[{"$f":"IF(OR(B12=\"\",B12=\"*\"),\"\",\"10\")","v":""},null,{"$f":"IFERROR(VLOOKUP(B12,Лист2!$A$1:$B$320,2,FALSE),\"\")","v":""},null,null,0]
[{"$f":"IF(OR(B13=\"\",B13=\"*\"),\"\",\"11\")","v":""},null,{"$f":"IFERROR(VLOOKUP(B13,Лист2!$A$1:$B$320,2,FALSE),\"\")","v":""},null,null,0]
[{"$f":"IF(OR(B14=\"\",B14=\"*\"),\"\",\"12\")","v":""},null,{"$f":"IFERROR(VLOOKUP(B14,Лист2!$A$1:$B$320,2,FALSE),\"\")","v":""},null,null,0]
[{"$f":"IF(OR(B15=\"\",B15=\"*\"),\"\",\"13\")","v":""},null,{"$f":"IFERROR(VLOOKUP(B15,Лист2!$A$1:$B$320,2,FALSE),\"\")","v":""},null,null,0]
[{"$f":"IF(OR(B16=\"\",B16=\"*\"),\"\",\"14\")","v":""},null,{"$f":"IFERROR(VLOOKUP(B16,Лист2!$A$1:$B$320,2,FALSE),\"\")","v":""},null,null,0]
[{"$f":"IF(OR(B17=\"\",B17=\"*\"),\"\",\"15\")","v":""},null,{"$f":"IFERROR(VLOOKUP(B17,Лист2!$A$1:$B$320,2,FALSE),\"\")","v":""},null,null,0]
[{"$f":"IF(OR(B18=\"\",B18=\"*\"),\"\",\"16\")","v":""},null,{"$f":"IFERROR(VLOOKUP(B18,Лист2!$A$1:$B$320,2,FALSE),\"\")","v":""},null,null,0]
[{"$f":"IF(OR(B19=\"\",B19=\"*\"),\"\",\"17\")","v":""},null,{"$f":"IFERROR(VLOOKUP(B19,Лист2!$A$1:$B$320,2,FALSE),\"\")","v":""},null,null,0]
[{"$f":"IF(OR(B20=\"\",B20=\"*\"),\"\",\"18\")","v":""},null,{"$f":"IFERROR(VLOOKUP(B20,Лист2!$A$1:$B$320,2,FALSE),\"\")","v":""},null,null,0]
[{"$f":"IF(OR(B21=\"\",B21=\"*\"),\"\",\"19\")","v":""},null,{"$f":"IFERROR(VLOOKUP(B21,Лист2!$A$1:$B$320,2,FALSE),\"\")","v":""},null,null,0]
[{"$f":"IF(OR(B22=\"\",B22=\"*\"),\"\",\"20\")","v":""},null,{"$f":"IFERROR(VLOOKUP(B22,Лист2!$A$1:$B$320,2,FALSE),\"\")","v":""},null,null,0]
[{"$f":"IF(OR(B23=\"\",B23=\"*\"),\"\",\"21\")","v":""},null,{"$f":"IFERROR(VLOOKUP(B23,Лист2!$A$1:$B$320,2,FALSE),\"\")","v":""},null,null,0]
[{"$f":"IF(OR(B24=\"\",B24=\"*\"),\"\",\"22\")","v":""},null,{"$f":"IFERROR(VLOOKUP(B24,Лист2!$A$1:$B$320,2,FALSE),\"\")","v":""},null,null,0]
[{"$f":"IF(OR(B25=\"\",B25=\"*\"),\"\",\"23\")","v":""},null,{"$f":"IFERROR(VLOOKUP(B25,Лист2!$A$1:$B$320,2,FALSE),\"\")","v":""},null,null,0]
[{"$f":"IF(OR(B26=\"\",B26=\"*\"),\"\",\"24\")","v":""},null,{"$f":"IFERROR(VLOOKUP(B26,Лист2!$A$1:$B$320,2,FALSE),\"\")","v":""},null,null,0]
[{"$f":"IF(OR(B27=\"\",B27=\"*\"),\"\",\"25\")","v":""},null,{"$f":"IFERROR(VLOOKUP(B27,Лист2!$A$1:$B$320,2,FALSE),\"\")","v":""},null,null,0]
[{"$f":"IF(OR(B28=\"\",B28=\"*\"),\"\",\"26\")","v":""},null,{"$f":"IFERROR(VLOOKUP(B28,Лист2!$A$1:$B$320,2,FALSE),\"\")","v":""},null,null,0]
[{"$f":"IF(OR(B29=\"\",B29=\"*\"),\"\",\"27\")","v":""},null,{"$f":"IFERROR(VLOOKUP(B29,Лист2!$A$1:$B$320,2,FALSE),\"\")","v":""},null,null,0]
[{"$f":"IF(OR(B30=\"\",B30=\"*\"),\"\",\"28\")","v":""},null,{"$f":"IFERROR(VLOOKUP(B30,Лист2!$A$1:$B$320,2,FALSE),\"\")","v":""},null,null,0]
[{"$f":"IF(OR(B31=\"\",B31=\"*\"),\"\",\"29\")","v":""},null,{"$f":"IFERROR(VLOOKUP(B31,Лист2!$A$1:$B$320,2,FALSE),\"\")","v":""},null,null,0]
[{"$f":"IF(OR(B32=\"\",B32=\"*\"),\"\",\"30\")","v":""},null,{"$f":"IFERROR(VLOOKUP(B32,Лист2!$A$1:$B$320,2,FALSE),\"\")","v":""},null,null,0]
[{"$f":"IF(OR(B33=\"\",B33=\"*\"),\"\",\"31\")","v":""},null,{"$f":"IFERROR(VLOOKUP(B33,Лист2!$A$1:$B$320,2,FALSE),\"\")","v":""},null,null,0]
[{"$f":"IF(OR(B34=\"\",B34=\"*\"),\"\",\"32\")","v":""},null,{"$f":"IFERROR(VLOOKUP(B34,Лист2!$A$1:$B$320,2,FALSE),\"\")","v":""},null,null,0]
[{"$f":"IF(OR(B35=\"\",B35=\"*\"),\"\",\"33\")","v":""},null,{"$f":"IFERROR(VLOOKUP(B35,Лист2!$A$1:$B$320,2,FALSE),\"\")","v":""},null,null,0]
[{"$f":"IF(OR(B36=\"\",B36=\"*\"),\"\",\"34\")","v":""},null,{"$f":"IFERROR(VLOOKUP(B36,Лист2!$A$1:$B$320,2,FALSE),\"\")","v":""},null,null,0]
[{"$f":"IF(OR(B37=\"\",B37=\"*\"),\"\",\"35\")","v":""},null,{"$f":"IFERROR(VLOOKUP(B37,Лист2!$A$1:$B$320,2,FALSE),\"\")","v":""},null,null,0]

{"sheet":"Лист2","index":1,"n_rows":182,"n_cols":5,"rows_kept":182,"cut":false,"hidden":false,"merged":[]}
[4001,null,"Знач1","Знач2","Знач3"]
[4002,null,"Знач1","Знач2","Знач3"]
[4003,null,"Знач1","Знач2","Знач3"]
[4004,null,"Знач1","Знач2","Знач3"]
[4005]
[4006]
[4007]
[4008]
[4009]
[4012]
[4013]
[4015]
[4016]
[4017]
[4018]
[4019]
[4020]
[4021]
[4022]
[4023]
[4024]
[4025]
[4026]
[4027]
[4028]
[4029]
[4030]
[4031]
[4032]
[4033]
[4034]
[4035]
[4036]
[4037]
[4039]
[4041]
[4042]
[4043]
[4045]
[4047]
[4054]
[4055]
[4057]
[4058]
[4059]
[4060]
[4061]
[4062]
[4063]
[4064]
[4065]
[4066]
[4067]
[4072]
[4073]
[4082]
[4083]
[4084]
[4085]
[4086]
[4087]
[4088]
[4089]
[4090]
[4091]
[4092]
[4093]
[4094]
[4095]
[4096]
[4097]
[4098]
[4099]
[4100]
[4101]
[4102]
[4103]
[4104]
[4107]
[4109]
[4110]
[4111]
[4112]
[4113]
[4114]
[4115]
[4116]
[4117]
[4118]
[4119]
[4120]
[4121]
[4122]
[4123]
[4124]
[4125]
[4126]
[4129]
[4130]
[4131]
[4134]
[4145]
[4146]
[4147]
[4148]
[4150]
[4151]
[4152]
[4153]
[4154]
[4155]
[4156]
[4157]
[4158]
[4159]
[4180]
[4181]
[4182]
[4183]
[4189]
[4190]
[4191]
[4192]
[4197]
[4198]
[4199]
[4200]
[4201]
[4202]
[4203]
[4204]
[4205]
[4206]
[4226]
[4227]
[4231]
[4232]
[4233]
[4234]
[4238]
[4239]
[4240]
[4241]
[4243]
[4244]
[4245]
[4246]
[4251]
[4252]
[4253]
[4254]
[4255]
[4256]
[4259]
[4260]
[4261]
[4262]
[4263]
[4264]
[4265]
[4266]
[4267]
[4292]
[4293]
[4296]
[4297]
[4298]
[4299]
[4300]
[4301]
[4302]
[4303]
[4304]
[4305]
[4306]
[4307]
[4308]
[4363]
[4364]
[4365]
[4467]
[4468]