{"text_format":"1","workbook":"xlsx","n_sheets":2,"sheets":["Чистый_Бланк","Лист1"],"not_rendered":{"charts":0,"images":2,"macros":1,"external_links":0,"defined_names":2,"comments":0,"pivot_tables":0},"unopened":[],"bounds":{"document_bytes":16777216,"sheet_cells":100000,"rows_first":2000,"rows_last":500,"rows_between":2000,"halvings":0,"cell_chars":16384,"cell_head_chars":4096},"cells_cut":0,"cells_raw":0,"read":"whole","date_system":"1900"}

{"sheet":"Чистый_Бланк","index":0,"n_rows":64,"n_cols":117,"rows_kept":64,"cut":false,"hidden":false,"merged":[[0,28,0,56],[1,28,1,56],[2,28,2,56],[2,58,2,114],[3,28,3,30],[3,31,3,41],[3,43,3,44],[3,45,3,55],[3,59,3,113],[8,27,10,33],[8,34,10,56],[8,59,8,113],[9,59,9,113],[10,59,10,113],[11,0,11,56],[4,0,4,27],[4,28,4,56],[4,59,4,113],[5,27,7,33],[5,34,7,56],[5,59,7,113],[15,59,15,113],[16,0,16,4],[16,5,16,42],[16,43,16,56],[12,0,12,4],[12,5,12,42],[12,43,12,56],[12,59,14,113],[13,0,13,4],[13,5,13,42],[13,43,13,56],[14,0,14,4],[14,5,14,42],[14,43,14,56],[17,0,17,4],[17,5,17,42],[17,43,17,56],[18,0,18,4],[18,5,18,42],[18,43,18,56],[15,0,15,4],[15,5,15,42],[15,43,15,56],[24,0,24,56],[24,59,24,92],[24,95,24,113],[25,0,25,56],[26,0,26,56],[26,58,26,114],[19,0,19,56],[19,58,19,114],[20,0,20,56],[21,0,21,56],[21,59,23,92],[21,95,23,113],[22,0,22,56],[23,0,23,56],[30,0,30,56],[30,59,30,84],[30,87,30,113],[31,0,31,27],[31,28,31,56],[31,58,31,114],[27,0,27,56],[28,0,28,56],[28,59,28,84],[28,87,28,113],[29,0,29,56],[29,59,29,84],[29,87,29,113],[35,28,37,56],[35,58,35,114],[36,58,36,114],[37,1,37,26],[37,59,37,84],[37,87,37,113],[32,0,33,27],[32,28,33,56],[32,58,32,114],[33,58,33,114],[34,1,34,26],[34,28,34,56],[34,58,34,114],[38,1,38,26],[38,59,38,84],[38,87,38,113],[39,1,39,13],[39,15,39,26],[39,28,40,31],[39,32,40,45],[39,59,39,84],[39,87,39,113],[40,1,40,13],[40,15,40,26],[40,59,40,84],[40,87,40,113],[41,1,41,26],[41,28,42,31],[41,32,42,45],[41,58,41,114],[42,1,42,26],[42,59,42,80],[42,83,42,113],[43,1,43,13],[43,15,43,26],[43,59,43,80],[43,83,43,113],[44,1,44,13],[44,15,44,26],[44,28,47,32],[44,59,44,80],[44,83,44,113],[45,59,45,80],[49,59,49,113],[50,19,50,26],[50,48,50,55],[50,59,50,114],[51,0,51,56],[51,59,52,85],[51,88,52,113],[52,0,52,56],[45,83,45,113],[46,59,46,80],[46,83,46,113],[47,19,47,26],[47,83,47,113],[48,59,48,113],[58,58,58,114],[59,0,59,56],[59,59,60,86],[59,87,60,101],[59,102,60,113],[60,0,60,56],[53,0,53,56],[54,0,54,56],[55,0,55,56],[56,0,56,56],[57,0,57,56],[58,0,58,56],[63,0,63,8],[63,10,63,47],[63,49,63,56],[63,59,63,86],[63,87,63,101],[63,102,63,113],[61,59,61,86],[61,87,61,101],[61,102,61,113],[62,0,62,8],[62,10,62,47],[62,49,62,56],[62,59,62,86],[62,87,62,101],[62,102,62,113]]}
[null,null,null,null,null,null,null,null,null,null,null,null,null,null,null,null,null,null,null,null,null,null,null,null,null,null,null,null,"Приложение № 4",null,null,null,null,null,null,null,null,null,null,null,null,null,null,null,null,null,null,null,null,null,null,null,null,null,null,null,null,null,null,null,null,null,null,null,null,null,null,null,null,null,null,null,null,null,null,null,null,null,null,null,null,null,null,null,null,null,null,null,null,null,null,null,null,null,null,null,null,null,null,null,null,null,null,null,null,null,null,null,null,null,null,null,null,null,"Продолжение приложения № 4"]
[null,null,null,null,null,null,null,null,null,null,null,null,null,null,null,null,null,null,null,null,null,null,null,null,null,null,null,null,"к Правилам перевозок грузов автомобильным транспортом",null,null,null,null,null,null,null,null,null,null,null,null,null,null,null,null,null,null,null,null,null,null,null,null,null,null,null,null,null,null,null,null,null,null,null,null,null,null,null,null,null,null,null,null,null,null,null,null,null,null,null,null,null,null,null,null,null,null,null,null,null,null,null,null,null,null,null,null,null,null,null,null,null,null,null,null,null,null,null,null,null,null,null,null,null,"Оборотная сторона"]
[null,null,null,null,null,null,null,null,null,null,null,null,null,null,null,null,null,null,null,null,null,null,null,null,null,null,null,null,"ТРАНСПОРТНАЯ НАКЛАДНАЯ",null,null,null,null,null,null,null,null,null,null,null,null,null,null,null,null,null,null,null,null,null,null,null,null,null,null,null,null,null,"10. Перевозчик"]
[null,null,null,null,null,null,null,null,null,null,null,null,null,null,null,null,null,null,null,null,null,null,null,null,null,null,null,null,"Дата",null,null,{"$f":"VLOOKUP($DM$4,Лист1!$A$2:$K$20,3,FALSE)","v":"ИН14374"},null,null,null,null,null,null,null,null,null,null,null,"№",null,{"$f":"VLOOKUP($DM$4,Лист1!$A$2:$K$20,2,FALSE)","v":"2019-12-20"},null,null,null,null,null,null,null,null,null,null,null,null,null,null,null,null,null,null,null,null,null,null,null,null,null,null,null,null,null,null,null,null,null,null,null,null,null,null,null,null,null,null,null,null,null,null,null,null,null,null,null,null,null,null,null,null,null,null,null,null,null,null,null,null,null,null,null,null,null,"№  в б/д",7]
["1. Грузоотправитель (грузовладелец)",null,null,null,null,null,null,null,null,null,null,null,null,null,null,null,null,null,null,null,null,null,null,null,null,null,null,null,"2. Грузополучатель",null,null,null,null,null,null,null,null,null,null,null,null,null,null,null,null,null,null,null,null,null,null,null,null,null,null,null,null,null,null,"(фамилия, имя, отчество, адрес места жительства, номер телефона – для физического лица (уполномоченного лица))"]
[null,null,null,null,null,null,null,null,null,null,null,null,null,null,null,null,null,null,null,null,null,null,null,null,null,null,null,"Плательщик",null,null,null,null,null,null,"ООО \"ВБД"]
[null,null,"ООО \"АБВ\""]
[]
[null,null,null,null,null,null,null,null,null,null,null,null,null,null,null,null,null,null,null,null,null,null,null,null,null,null,null,"Грузополучатель",null,null,null,null,null,null,null,null,null,null,null,null,null,null,null,null,null,null,null,null,null,null,null,null,null,null,null,null,null,null,null,"(наименование и адрес места нахождения, номер телефона – для юридического лица)"]
[]
[]
["3. Наименование груза"]
["№",null,null,null,null,"Наименование",null,null,null,null,null,null,null,null,null,null,null,null,null,null,null,null,null,null,null,null,null,null,null,null,null,null,null,null,null,null,null,null,null,null,null,null,null,"Кол-во",null,null,null,null,null,null,null,null,null,null,null,null,null,null,null,{"$f":"VLOOKUP($DM$4,Лист1!$A$2:$K$20,6,FALSE)","v":"Попов"}]
[1,null,null,null,null,{"$f":"VLOOKUP($DM$4,Лист1!$A$2:$K$20,4,FALSE)","v":"Карьерный (Горный)  песок 1 сорт"},null,null,null,null,null,null,null,null,null,null,null,null,null,null,null,null,null,null,null,null,null,null,null,null,null,null,null,null,null,null,null,null,null,null,null,null,null,{"$f":"VLOOKUP($DM$4,Лист1!$A$2:$K$20,5,FALSE)","v":22}]
[]
[null,null,null,null,null,null,null,null,null,null,null,null,null,null,null,null,null,null,null,null,null,null,null,null,null,null,null,null,null,null,null,null,null,null,null,null,null,null,null,null,null,null,null,null,null,null,null,null,null,null,null,null,null,null,null,null,null,null,null,"(фамилия, имя, отчество,водителя "]
[]
[]
[]
["4. Сопроводительные документы на груз",null,null,null,null,null,null,null,null,null,null,null,null,null,null,null,null,null,null,null,null,null,null,null,null,null,null,null,null,null,null,null,null,null,null,null,null,null,null,null,null,null,null,null,null,null,null,null,null,null,null,null,null,null,null,null,null,null,"11. Транспортное средство"]
[]
[null,null,null,null,null,null,null,null,null,null,null,null,null,null,null,null,null,null,null,null,null,null,null,null,null,null,null,null,null,null,null,null,null,null,null,null,null,null,null,null,null,null,null,null,null,null,null,null,null,null,null,null,null,null,null,null,null,null,null,{"$f":"VLOOKUP($DM$4,Лист1!$A$2:$K$20,8,FALSE)","v":"Шакман"},null,null,null,null,null,null,null,null,null,null,null,null,null,null,null,null,null,null,null,null,null,null,null,null,null,null,null,null,null,null,null,null,null,null,null,{"$f":"VLOOKUP($DM$4,Лист1!$A$2:$K$20,7,FALSE)","v":"У398ВР178"}]
[]
[]
["5. Указания грузоотправителя",null,null,null,null,null,null,null,null,null,null,null,null,null,null,null,null,null,null,null,null,null,null,null,null,null,null,null,null,null,null,null,null,null,null,null,null,null,null,null,null,null,null,null,null,null,null,null,null,null,null,null,null,null,null,null,null,null,null,"(тип, марка, грузоподъемность (в тоннах), вместимость (в кубических метрах))",null,null,null,null,null,null,null,null,null,null,null,null,null,null,null,null,null,null,null,null,null,null,null,null,null,null,null,null,null,null,null,null,null,null,null,"(регистрационные номера)"]
[]
[null,null,null,null,null,null,null,null,null,null,null,null,null,null,null,null,null,null,null,null,null,null,null,null,null,null,null,null,null,null,null,null,null,null,null,null,null,null,null,null,null,null,null,null,null,null,null,null,null,null,null,null,null,null,null,null,null,null,"12. Оговорки и замечания перевозчика"]
[]
[null,null,null,null,null,null,null,null,null,null,null,null,null,null,null,null,null,null,null,null,null,null,null,null,null,null,null,null,null,null,null,null,null,null,null,null,null,null,null,null,null,null,null,null,null,null,null,null,null,null,null,null,null,null,null,null,null,null,null,"(фактическое состояние груза, тары, упаковки, маркировки и опломбирования при приеме груза)",null,null,null,null,null,null,null,null,null,null,null,null,null,null,null,null,null,null,null,null,null,null,null,null,null,null,null,"(фактическое состояние груза, тары, упаковки, маркировки и опломбирования при сдаче груза)"]
[]
[null,null,null,null,null,null,null,null,null,null,null,null,null,null,null,null,null,null,null,null,null,null,null,null,null,null,null,null,null,null,null,null,null,null,null,null,null,null,null,null,null,null,null,null,null,null,null,null,null,null,null,null,null,null,null,null,null,null,null,"(изменение условий перевозки при движении)",null,null,null,null,null,null,null,null,null,null,null,null,null,null,null,null,null,null,null,null,null,null,null,null,null,null,null,"(изменение условий перевозки при выгрузке)"]
["6. Прием груза",null,null,null,null,null,null,null,null,null,null,null,null,null,null,null,null,null,null,null,null,null,null,null,null,null,null,null,"7. Сдача груза",null,null,null,null,null,null,null,null,null,null,null,null,null,null,null,null,null,null,null,null,null,null,null,null,null,null,null,null,null,"13. Прочие условия"]
[{"$f":"VLOOKUP($DM$4,Лист1!$A$2:$K$20,11,FALSE)","v":"Самарка "}]
[null,null,null,null,null,null,null,null,null,null,null,null,null,null,null,null,null,null,null,null,null,null,null,null,null,null,null,null,null,null,null,null,null,null,null,null,null,null,null,null,null,null,null,null,null,null,null,null,null,null,null,null,null,null,null,null,null,null,"(номер, дата и срок действия специального разрешения, установленный маршрут перевозки опасного, тяжеловесного или крупногабаритного груза)"]
[null,"(адрес места погрузки)",null,null,null,null,null,null,null,null,null,null,null,null,null,null,null,null,null,null,null,null,null,null,null,null,null,null,"(адрес места выгрузки)"]
[null,null,null,null,null,null,null,null,null,null,null,null,null,null,null,null,null,null,null,null,null,null,null,null,null,null,null,null,null,null,null,null,null,null,null,null,null,null,null,null,null,null,null,null,null,null,null,null,null,null,null,null,null,null,null,null,null,null,"(режим труда и отдыха водителя в пути следования, сведения о коммерческих и иных актах)"]
[null,null,null,null,null,null,null,null,null,null,null,null,null,null,null,null,null,null,null,null,null,null,null,null,null,null,null,null,null,null,null,null,null,null,null,null,null,null,null,null,null,null,null,null,null,null,null,null,null,null,null,null,null,null,null,null,null,null,"14. Переадресовка"]
[]
[null,"(дата и время подачи транспортного средства под погрузку)",null,null,null,null,null,null,null,null,null,null,null,null,null,null,null,null,null,null,null,null,null,null,null,null,null,null,null,null,null,null,null,null,null,null,null,null,null,null,null,null,null,null,null,null,null,null,null,null,null,null,null,null,null,null,null,null,null,"(дата, форма переадресовки (устно или письменно))",null,null,null,null,null,null,null,null,null,null,null,null,null,null,null,null,null,null,null,null,null,null,null,null,null,null,null,"(адрес нового пункта выгрузки, дата и время подачи транспортного средства под выгрузку)"]
[null,null,null,null,null,null,null,null,null,null,null,null,null,null,null,null,null,null,null,null,null,null,null,null,null,null,null,null,"время прибытия"]
[null,"(фактические дата и время прибытия)",null,null,null,null,null,null,null,null,null,null,null,null,null,"(фактические дата и время убытия)",null,null,null,null,null,null,null,null,null,null,null,null,null,null,null,null,null,null,null,null,null,null,null,null,null,null,null,null,null,null,null,null,null,null,"подпись",null,null,null,null,null,null,null,null,"(сведения о лице, от которого получено указание на переадресовку (наименование, фамилия, имя, отчество и др.))",null,null,null,null,null,null,null,null,null,null,null,null,null,null,null,null,null,null,null,null,null,null,null,null,null,null,null,"(при изменении получателя груза – новое наименование грузополучателя и место его нахождения)"]
[null,null,null,null,null,null,null,null,null,null,null,null,null,null,null,null,null,null,null,null,null,null,null,null,null,null,null,null,"время убытия",null,null,null,null,null,null,null,null,null,null,null,null,null,null,null,null,null,null,null,null,null,null,null,null,null,null,null,null,null,"15. Стоимость услуг перевозчика и порядок расчета провозной платы"]
[null,"(фактическое состояние груза, тары, упаковки, маркировки и опломбирования)",null,null,null,null,null,null,null,null,null,null,null,null,null,null,null,null,null,null,null,null,null,null,null,null,null,null,null,null,null,null,null,null,null,null,null,null,null,null,null,null,null,null,null,null,null,null,null,null,"подпись"]
[null,null,null,null,null,null,null,null,null,null,null,null,null,null,null,null,null,null,null,null,null,null,null,null,null,null,null,null,null,null,null,null,null,null,null,null,null,null,null,null,null,null,null,null,null,null,null,null,null,null,null,null,null,null,null,null,null,null,null,"(стоимость услуги в рублях, порядок (механизм) расчета (исчислений) платы)",null,null,null,null,null,null,null,null,null,null,null,null,null,null,null,null,null,null,null,null,null,null,null,"(расходы перевозчика и предъявляемые грузоотправителю платежи за проезд по платным автомобильным дорогам,"]
[null,"(масса груза)",null,null,null,null,null,null,null,null,null,null,null,null,null,"(количество грузовых мест)",null,null,null,null,null,null,null,null,null,null,null,null,"Отметка о сдече груза"]
[null,null,null,null,null,null,null,null,null,null,null,null,null,null,null,null,null,null,null,null,null,null,null,null,null,null,null,null,null,null,null,null,null,null,null,null,null,null,null,null,null,null,null,null,null,null,null,null,null,null,null,null,null,null,null,null,null,null,null,"(размер провозной платы (заполняется после окончания перевозки) в рублях)",null,null,null,null,null,null,null,null,null,null,null,null,null,null,null,null,null,null,null,null,null,null,null,"за перевозку опасных, тяжеловесных и крупногабаритных грузов, уплату таможенных пошлин и сборов,"]
[null,"Грузоотправитель:",null,null,null,null,null,null,null,null,null,null,null,null,null,null,null,null,null,"Красненков И.А."]
[null,null,null,null,null,null,null,null,null,null,null,null,null,null,null,null,null,null,null,null,null,null,null,null,null,null,null,null,null,null,null,null,null,null,null,null,null,null,null,null,"подпись",null,null,null,null,null,null,null,"печать",null,null,null,null,null,null,null,null,null,null,null,null,null,null,null,null,null,null,null,null,null,null,null,null,null,null,null,null,null,null,null,null,null,null,"выполнение погрузо-разгрузочных работ, а также работ по промывке и дезинфекции транспортных средств)"]
[]
[null,"Водитель:",null,null,null,null,null,null,null,null,null,null,null,null,null,null,null,null,null,null,null,null,null,null,null,null,null,null,null,null,"Водитель:",null,null,null,null,null,null,null,null,null,null,null,null,null,null,null,null,null,null,null,null,null,null,null,null,null,null,null,null,"(полное наименование организации плательщика (грузоотправителя), адрес, банковские реквизиты организации плательщика (грузоотправителя))"]
[null,null,null,null,null,null,null,null,null,null,null,null,null,null,null,null,null,null,null,"/ФИО/",null,null,null,null,null,null,null,null,null,null,null,null,null,null,null,null,null,null,null,null,null,null,null,null,null,null,null,null,"/ФИО/",null,null,null,null,null,null,null,null,null,null,"16. Дата составления, подписи сторон"]
["8. Условия перевозки",null,null,null,null,null,null,null,null,null,null,null,null,null,null,null,null,null,null,null,null,null,null,null,null,null,null,null,null,null,null,null,null,null,null,null,null,null,null,null,null,null,null,null,null,null,null,null,null,null,null,null,null,null,null,null,null,null,null,"ООО \"МПС-МАТЕРИАЛЫ\""]
[]
[null,null,null,null,null,null,null,null,null,null,null,null,null,null,null,null,null,null,null,null,null,null,null,null,null,null,null,null,null,null,null,null,null,null,null,null,null,null,null,null,null,null,null,null,null,null,null,null,null,null,null,null,null,null,null,null,null,null,null,null,null,"м.п.",null,null,null,null,null,null,null,null,null,null,null,null,null,null,null,null,null,null,null,null,null,null,null,null,null,null,null,null,"м.п."]
[]
[null,null,null,null,null,null,null,null,null,null,null,null,null,null,null,null,null,null,null,null,null,null,null,null,null,null,null,null,null,null,null,null,null,null,null,null,null,null,null,null,null,null,null,null,null,null,null,null,null,null,null,null,null,null,null,null,null,null,null,"Грузоотправитель:",null,null,null,null,null,null,null,null,null,null,null,null,null,null,null,null,null,null,"Красненков И.А.",null,null,null,null,null,null,null,null,null,"Водитель:"]
[]
[]
[null,null,null,null,null,null,null,null,null,null,null,null,null,null,null,null,null,null,null,null,null,null,null,null,null,null,null,null,null,null,null,null,null,null,null,null,null,null,null,null,null,null,null,null,null,null,null,null,null,null,null,null,null,null,null,null,null,null,"17. Отметки грузоотправителей, грузополучателей, перевозчиков"]
[null,null,null,null,null,null,null,null,null,null,null,null,null,null,null,null,null,null,null,null,null,null,null,null,null,null,null,null,null,null,null,null,null,null,null,null,null,null,null,null,null,null,null,null,null,null,null,null,null,null,null,null,null,null,null,null,null,null,null,"Краткое описание обстоятельств, послуживших основанием для отметки",null,null,null,null,null,null,null,null,null,null,null,null,null,null,null,null,null,null,null,null,null,null,null,null,null,null,null,"Расчет и размер штрафа",null,null,null,null,null,null,null,null,null,null,null,null,null,null,"Подпись, дата"]
["9. Информация о принятии заказа (заявки) к исполнению"]
[]
[]
["(дата принятия заказа\n(заявки) к исполнению)",null,null,null,null,null,null,null,null,null,"(фамилия, имя, отчество, должность лица, принявшего заказ (заявку) к исполнению)",null,null,null,null,null,null,null,null,null,null,null,null,null,null,null,null,null,null,null,null,null,null,null,null,null,null,null,null,null,null,null,null,null,null,null,null,null,null,"(подпись)"]

{"sheet":"Лист1","index":1,"n_rows":20,"n_cols":11,"rows_kept":20,"cut":false,"hidden":false,"merged":[]}
["№ п/п","Дата ТН","№ ТН","Наименование товара","кол-во, м3","Водитель","ГРЗ","Автомобиль","Проект","Перевозчик","Карьер"]
[1,"2019-12-19","ИН14136","Карьерный (Горный)  песок 1 сорт",21.8,"Головин ","Х737КС47","ИВЕКО","К4","Идеал-Неруд","Самарка "]
[2,"2019-12-19","ИН14144","Карьерный (Горный)  песок 1 сорт",22,"Головин ","Х737КС47","ИВЕКО","К4","Идеал-Неруд","Самарка "]
[3,"2019-12-19","ИН14368","Карьерный (Горный)  песок 1 сорт",21.2,"Попов","У398ВР178","Шакман","К4","Идеал-Неруд","Самарка "]
[4,"2019-12-19","ИН14367","Карьерный (Горный)  песок 1 сорт",20.6,"Попов","У398ВР178","Шакман","К4","Идеал-Неруд","Самарка "]
[5,"2019-12-19","ИН14411","Карьерный (Горный)  песок 1 сорт",19.8,"Челак ","А472АВ198","СКАНИЯ","К4","Идеал-Неруд","Самарка "]
[6,"2019-12-20","ИН14371","Карьерный (Горный)  песок 1 сорт",22.2,"Попов","У398ВР178","Шакман","К4","Идеал-Неруд","Самарка "]
[7,"2019-12-20","ИН14374","Карьерный (Горный)  песок 1 сорт",22,"Попов","У398ВР178","Шакман","К4","Идеал-Неруд","Самарка "]
[8,"2019-12-20","ИН14372","Карьерный (Горный)  песок 1 сорт",22.9,"Попов","У398ВР178","Шакман","К4","Идеал-Неруд","Самарка "]
[9,"2019-12-20","ИН12896","Карьерный (Горный)  песок 1 сорт",19.5,"Топол","В204ТМ47","ИВЕКО","К4","Идеал-Неруд","Самарка "]
[10,"2019-12-20","ИН14370","Карьерный (Горный)  песок 1 сорт",21.1,"Попов","У398ВР178","Шакман","К4","Идеал-Неруд","Самарка "]
[11,"2019-12-20","ИН14893","Карьерный (Горный)  песок 1 сорт",17.600000000000001,"Самси ","В989ЕВ198","ИВЕКО","К4","Идеал-Неруд","Самарка "]
[12,"2019-12-20","ИН14891","Карьерный (Горный)  песок 1 сорт",16.899999999999999,"Самси ","В989ЕВ198","ИВЕКО","К4","Идеал-Неруд","Самарка "]
[13,"2019-12-20","ИН14798","Карьерный (Горный)  песок 1 сорт",18.7,"Машогло","У419НМ178","ИВЕКО","К4","Идеал-Неруд","Самарка "]
[14,"2019-12-20","ИН14960","Карьерный (Горный)  песок 1 сорт",17.399999999999999,"Осипов","В208ТМ47","ИВЕКО","К4","Идеал-Неруд","Самарка "]
[15,"2019-12-20","ИН12856","Карьерный (Горный)  песок 1 сорт",18.600000000000001,"Зайцев ","Т343АО178","ИВЕКО","К4","Идеал-Неруд","Самарка "]
[16,"2019-12-20","ИН14454","Карьерный (Горный)  песок 1 сорт",21.3,"Капсамун П ","Р849ВР47","ИВЕКО","К4","Идеал-Неруд","Самарка "]
[17,"2019-12-20","ИН14461","Карьерный (Горный)  песок 1 сорт",20.399999999999999,"Капсамун П ","Р849ВР47","ИВЕКО","К4","Идеал-Неруд","Самарка "]
[18,"2019-12-20","ИН12855","Карьерный (Горный)  песок 1 сорт",18.399999999999999,"Зайцев ","Т343АО178","ИВЕКО","К4","Идеал-Неруд","Самарка "]
[19,"2019-12-20","ИН12029","Карьерный (Горный)  песок 1 сорт",19.100000000000001,"Трошков ","К730ХХ178","ИВЕКО","К4","Идеал-Неруд","Самарка "]