{"text_format":"1","workbook":"xlsx","n_sheets":3,"sheets":["Лист1","Расчётная","Сводная таблица"],"not_rendered":{"charts":0,"images":0,"macros":1,"external_links":0,"defined_names":2,"comments":0,"pivot_tables":1},"unopened":[],"bounds":{"document_bytes":16777216,"sheet_cells":100000,"rows_first":2000,"rows_last":500,"rows_between":2000,"halvings":0,"cell_chars":16384,"cell_head_chars":4096},"cells_cut":0,"cells_raw":0,"read":"whole","date_system":"1900"}

{"sheet":"Лист1","index":0,"n_rows":104,"n_cols":6,"rows_kept":104,"cut":false,"hidden":false,"merged":[]}
["Текст","Дата выхода",null,null,"Дата выхода","Текст"]
["В связи с расширением срочно требуются сотрудники в офис, от 35 000 руб. Тел. 201-06-13","21, 22, 25, 26, 29, 30/03;02, 03, 06, 07/04",{"$f":"IF(IFERROR(SEARCH(\";\",B2),0)<>0,SUBSTITUTE(LEFT(B2,IFERROR(SEARCH(\";\",B2),0)-1),\",\",RIGHT(LEFT(B2,IFERROR(SEARCH(\";\",B2),0)-1),3)&\"/\"&YEAR(TODAY()))&\"/\"&YEAR(TODAY())&\" \",\"\")&SUBSTITUTE(RIGHT(B2,LEN(B2)-IFERROR(SEARCH(\";\",B2),0)),\",\",RIGHT(RIGHT(B2,LEN(B2)-IFERROR(SEARCH(\";\",B2),0)),3)&\"/\"&YEAR(TODAY()))&\"/\"&YEAR(TODAY())","v":"21/03/2013 22/03/2013 25/03/2013 26/03/2013 29/03/2013 30/03/2013 02/04/2013 03/04/2013 06/04/2013 07/04/2013"},{"$f":"(LEN(C2)+1)/11+D1","v":10},21,"В связи с расширением срочно требуются сотрудники в офис, от 35 000 руб. Тел. 201-06-13"]
["Водители такси на новые Нексии. Выгодные условия. Тел. 207-10-65","21, 22, 23/03",{"$f":"IF(IFERROR(SEARCH(\";\",B3),0)<>0,SUBSTITUTE(LEFT(B3,IFERROR(SEARCH(\";\",B3),0)-1),\",\",RIGHT(LEFT(B3,IFERROR(SEARCH(\";\",B3),0)-1),3)&\"/\"&YEAR(TODAY()))&\"/\"&YEAR(TODAY())&\" \",\"\")&SUBSTITUTE(RIGHT(B3,LEN(B3)-IFERROR(SEARCH(\";\",B3),0)),\",\",RIGHT(RIGHT(B3,LEN(B3)-IFERROR(SEARCH(\";\",B3),0)),3)&\"/\"&YEAR(TODAY()))&\"/\"&YEAR(TODAY())","v":"21/03/2013 22/03/2013 23/03/2013"},{"$f":"(LEN(C3)+1)/11+D2","v":13},21,"Водители такси на новые Нексии. Выгодные условия. Тел. 207-10-65"]
["На постоянную работу диспетчер-логист, 2/2. Тел. 219-22-27","21, 22, 23/03","21/03/2013 22/03/2013 23/03/2013",16,21,"На постоянную работу диспетчер-логист, 2/2. Тел. 219-22-27"]
["Обучение на массажистов, косметологов-эстетистов, медсестер. Трудоустройство. Тел. 202-36-56","21, 22, 23, 24, 25/03","21/03/2013 22/03/2013 23/03/2013 24/03/2013 25/03/2013",21,21,"Обучение на массажистов, косметологов-эстетистов, медсестер. Трудоустройство. Тел. 202-36-56"]
["Подработка. Тел. 3-611-655","21, 24, 25, 26, 27/03","21/03/2013 24/03/2013 25/03/2013 26/03/2013 27/03/2013",26,21,"Подработка. Тел. 3-611-655"]
["Приглашаем комплектовщиков, приемосдатчиков, грузчиков, упаковщицу, складского логиста. Официальное трудоустройство, питание, доставка. Тел. 216-28-48","21, 24, 25, 26, 27/03","21/03/2013 24/03/2013 25/03/2013 26/03/2013 27/03/2013",31,21,"Приглашаем комплектовщиков, приемосдатчиков, грузчиков, упаковщицу, складского логиста. Официальное трудоустройство, питание, доставка. Тел. 216-28-48"]
["Работа на дому. Тел. 201-05-47","21, 22, 25, 26, 29, 30/03;02, 03, 06, 07/04","21/03/2013 22/03/2013 25/03/2013 26/03/2013 29/03/2013 30/03/2013 02/04/2013 03/04/2013 06/04/2013 07/04/2013",41,21,"Работа на дому. Тел. 201-05-47"]
["Срочно требуется команда консультантов в новый офис финансовой компании. От 20000 руб, гибкий график. Тел. 200-25-46","21, 22, 23, 24, 25/03","21/03/2013 22/03/2013 23/03/2013 24/03/2013 25/03/2013",46,21,"Срочно требуется команда консультантов в новый офис финансовой компании. От 20000 руб, гибкий график. Тел. 200-25-46"]
["Срочно требуются: продавец в мясной отдел, повар в холодный цех, продавец в колбасный отдел, товаровед с опытом работы, юрист. Тел. 8-912-294-60-06, 8-922-14-33-457","21, 25, 27, 29, 31/03;02, 04/04","21/03/2013 25/03/2013 27/03/2013 29/03/2013 31/03/2013 02/04/2013 04/04/2013",53,21,"Срочно требуются: продавец в мясной отдел, повар в холодный цех, продавец в колбасный отдел, товаровед с опытом работы, юрист. Тел. 8-912-294-60-06, 8-922-14-33-457"]
["Срочно! Требуются экспедиторы. Официальное трудоустройство. Тел. 216-28-49","21, 24, 25, 26, 27/03","21/03/2013 24/03/2013 25/03/2013 26/03/2013 27/03/2013",58,21,"Срочно! Требуются экспедиторы. Официальное трудоустройство. Тел. 216-28-49"]
["Требуется администратор зала, 28 000 руб. Тел. 200-93-67","21, 22, 25, 26, 29, 30/03;02, 03, 06, 07/04","21/03/2013 22/03/2013 25/03/2013 26/03/2013 29/03/2013 30/03/2013 02/04/2013 03/04/2013 06/04/2013 07/04/2013",68,21,"Требуется администратор зала, 28 000 руб. Тел. 200-93-67"]
["Требуется администратор, от 25000 руб. Тел. 213-35-60","21, 22, 26, 27, 29, 30/03;02, 03, 06, 07/04","21/03/2013 22/03/2013 26/03/2013 27/03/2013 29/03/2013 30/03/2013 02/04/2013 03/04/2013 06/04/2013 07/04/2013",78,21,"Требуется администратор, от 25000 руб. Тел. 213-35-60"]
["Требуется ведущий консультант. Работа с вип клиентами. Консультирование по продуктам компании, заключение договоров. От 50000 руб. Тел. 200-25-46","21, 22, 23, 24, 25/03","21/03/2013 22/03/2013 23/03/2013 24/03/2013 25/03/2013",83,21,"Требуется ведущий консультант. Работа с вип клиентами. Консультирование по продуктам компании, заключение договоров. От 50000 руб. Тел. 200-25-46"]
["Требуется водитель на маршрут. Тел. 8-922-028-57-64","21/03","21/03/2013",84,21,"Требуется водитель на маршрут. Тел. 8-922-028-57-64"]
["Требуется водитель погрузчика, машинист экскаватора, слесарь по ремонту погрузчиков. Тел. 295-62-18, 295-71-51","21, 22, 23/03","21/03/2013 22/03/2013 23/03/2013",87,21,"Требуется водитель погрузчика, машинист экскаватора, слесарь по ремонту погрузчиков. Тел. 295-62-18, 295-71-51"]
["Требуется менеджер корпоративных продаж, от 35 000 руб. Тел. 200-21-78","21, 22, 25, 26, 29, 30/03;02, 03, 06, 07/04","21/03/2013 22/03/2013 25/03/2013 26/03/2013 29/03/2013 30/03/2013 02/04/2013 03/04/2013 06/04/2013 07/04/2013",97,21,"Требуется менеджер корпоративных продаж, от 35 000 руб. Тел. 200-21-78"]
["Требуется менеджер по продажам. От 25000 руб. Тел. 200-25-46","21, 22, 23, 24, 25/03","21/03/2013 22/03/2013 23/03/2013 24/03/2013 25/03/2013",102,21,"Требуется менеджер по продажам. От 25000 руб. Тел. 200-25-46"]
["Требуется токарь, слесарь-ремонтник. Тел. 295-62-18, 295-71-51","21, 22, 23/03","21/03/2013 22/03/2013 23/03/2013",105,21,"Требуется токарь, слесарь-ремонтник. Тел. 295-62-18, 295-71-51"]
["Требуется электрогазосварщик. Тел. 287-02-47","21/03","21/03/2013",106,21,"Требуется электрогазосварщик. Тел. 287-02-47"]
["Требуются водители штабелера. Зарплата от 28000 руб. Официальное трудоустройство, питание, доставка. Тел. 216-28-48","21, 24, 25, 26, 27/03","21/03/2013 24/03/2013 25/03/2013 26/03/2013 27/03/2013",111,21,"Требуются водители штабелера. Зарплата от 28000 руб. Официальное трудоустройство, питание, доставка. Тел. 216-28-48"]
["Требуются менеджеры по туризму. Работа в офисе. Тел. 379-76-50, 379-76-50","21, 22, 23, 24/03","21/03/2013 22/03/2013 23/03/2013 24/03/2013",115,21,"Требуются менеджеры по туризму. Работа в офисе. Тел. 379-76-50, 379-76-50"]
["Требуются продавцы-консультанты, грузчики, фасовщицы. ЖБИ, Эльмаш, Центр, Сортировка. Тел. 290-16-48, 8-922-030-72-22","21, 24, 27, 30/03;02/04","21/03/2013 24/03/2013 27/03/2013 30/03/2013 02/04/2013",120,21,"Требуются продавцы-консультанты, грузчики, фасовщицы. ЖБИ, Эльмаш, Центр, Сортировка. Тел. 290-16-48, 8-922-030-72-22"]
["Требуются сотрудники в отдел продаж, оклад 30 000 руб + %. Тел. 200-21-78","21, 22, 25, 26, 29, 30/03;02, 03, 06, 07/04","21/03/2013 22/03/2013 25/03/2013 26/03/2013 29/03/2013 30/03/2013 02/04/2013 03/04/2013 06/04/2013 07/04/2013",130,21,"Требуются сотрудники в отдел продаж, оклад 30 000 руб + %. Тел. 200-21-78"]
[null,null,null,null,22,"В связи с расширением срочно требуются сотрудники в офис, от 35 000 руб. Тел. 201-06-13"]
[null,null,null,null,22,"Водители такси на новые Нексии. Выгодные условия. Тел. 207-10-65"]
[null,null,null,null,22,"На постоянную работу диспетчер-логист, 2/2. Тел. 219-22-27"]
[null,null,null,null,22,"Обучение на массажистов, косметологов-эстетистов, медсестер. Трудоустройство. Тел. 202-36-56"]
[null,null,null,null,22,"Работа на дому. Тел. 201-05-47"]
[null,null,null,null,22,"Срочно требуется команда консультантов в новый офис финансовой компании. От 20000 руб, гибкий график. Тел. 200-25-46"]
{"$rows_left_out":75}
{"sheet":"Расчётная","index":1,"n_rows":330,"n_cols":4,"rows_kept":330,"cut":false,"hidden":false,"merged":[]}
[1,"Текст","Дата выхода","Количество выходов объявления"]
[{"$f":"IFERROR(IF(ROW()=2,1,IF(INDEX(Лист1!$A$2:$I$32,$A1,4)=ROW()-2,IF(ROW()>=MAX(Лист1!D:D)+2,\"\",MAX(A$1:A1)+1),A1)),\"\")","v":1},{"$f":"IFERROR(INDEX(Лист1!$A$2:$G$32,$A2,1),\"\")","v":"В связи с расширением срочно требуются сотрудники в офис, от 35 000 руб. Тел. 201-06-13"},{"$f":"IFERROR(--MID(INDEX(Лист1!$A$2:$G$32,$A2,3),ROW()-1+10*(ROW()-2)-IF(A2=1,0,INDEX(Лист1!$A$2:$H$32,$A2-1,4)*11),10),\"\")","v":"2013-03-21"},{"$f":"IFERROR((LEN(INDEX(Лист1!$A$2:$G$32,$A2,3))+1)/11,\"\")","v":10}]
[{"$f":"IFERROR(IF(ROW()=2,1,IF(INDEX(Лист1!$A$2:$I$32,$A2,4)=ROW()-2,IF(ROW()>=MAX(Лист1!D:D)+2,\"\",MAX(A$1:A2)+1),A2)),\"\")","v":1},{"$f":"IFERROR(INDEX(Лист1!$A$2:$G$32,$A3,1),\"\")","v":"В связи с расширением срочно требуются сотрудники в офис, от 35 000 руб. Тел. 201-06-13"},{"$f":"IFERROR(--MID(INDEX(Лист1!$A$2:$G$32,$A3,3),ROW()-1+10*(ROW()-2)-IF(A3=1,0,INDEX(Лист1!$A$2:$H$32,$A3-1,4)*11),10),\"\")","v":"2013-03-22"},{"$f":"IFERROR((LEN(INDEX(Лист1!$A$2:$G$32,$A3,3))+1)/11,\"\")","v":10}]
[{"$f":"IFERROR(IF(ROW()=2,1,IF(INDEX(Лист1!$A$2:$I$32,$A3,4)=ROW()-2,IF(ROW()>=MAX(Лист1!D:D)+2,\"\",MAX(A$1:A3)+1),A3)),\"\")","v":1},{"$f":"IFERROR(INDEX(Лист1!$A$2:$G$32,$A4,1),\"\")","v":"В связи с расширением срочно требуются сотрудники в офис, от 35 000 руб. Тел. 201-06-13"},{"$f":"IFERROR(--MID(INDEX(Лист1!$A$2:$G$32,$A4,3),ROW()-1+10*(ROW()-2)-IF(A4=1,0,INDEX(Лист1!$A$2:$H$32,$A4-1,4)*11),10),\"\")","v":"2013-03-25"},{"$f":"IFERROR((LEN(INDEX(Лист1!$A$2:$G$32,$A4,3))+1)/11,\"\")","v":10}]
[{"$f":"IFERROR(IF(ROW()=2,1,IF(INDEX(Лист1!$A$2:$I$32,$A4,4)=ROW()-2,IF(ROW()>=MAX(Лист1!D:D)+2,\"\",MAX(A$1:A4)+1),A4)),\"\")","v":1},{"$f":"IFERROR(INDEX(Лист1!$A$2:$G$32,$A5,1),\"\")","v":"В связи с расширением срочно требуются сотрудники в офис, от 35 000 руб. Тел. 201-06-13"},{"$f":"IFERROR(--MID(INDEX(Лист1!$A$2:$G$32,$A5,3),ROW()-1+10*(ROW()-2)-IF(A5=1,0,INDEX(Лист1!$A$2:$H$32,$A5-1,4)*11),10),\"\")","v":"2013-03-26"},{"$f":"IFERROR((LEN(INDEX(Лист1!$A$2:$G$32,$A5,3))+1)/11,\"\")","v":10}]
[{"$f":"IFERROR(IF(ROW()=2,1,IF(INDEX(Лист1!$A$2:$I$32,$A5,4)=ROW()-2,IF(ROW()>=MAX(Лист1!D:D)+2,\"\",MAX(A$1:A5)+1),A5)),\"\")","v":1},{"$f":"IFERROR(INDEX(Лист1!$A$2:$G$32,$A6,1),\"\")","v":"В связи с расширением срочно требуются сотрудники в офис, от 35 000 руб. Тел. 201-06-13"},{"$f":"IFERROR(--MID(INDEX(Лист1!$A$2:$G$32,$A6,3),ROW()-1+10*(ROW()-2)-IF(A6=1,0,INDEX(Лист1!$A$2:$H$32,$A6-1,4)*11),10),\"\")","v":"2013-03-29"},{"$f":"IFERROR((LEN(INDEX(Лист1!$A$2:$G$32,$A6,3))+1)/11,\"\")","v":10}]
[{"$f":"IFERROR(IF(ROW()=2,1,IF(INDEX(Лист1!$A$2:$I$32,$A6,4)=ROW()-2,IF(ROW()>=MAX(Лист1!D:D)+2,\"\",MAX(A$1:A6)+1),A6)),\"\")","v":1},{"$f":"IFERROR(INDEX(Лист1!$A$2:$G$32,$A7,1),\"\")","v":"В связи с расширением срочно требуются сотрудники в офис, от 35 000 руб. Тел. 201-06-13"},{"$f":"IFERROR(--MID(INDEX(Лист1!$A$2:$G$32,$A7,3),ROW()-1+10*(ROW()-2)-IF(A7=1,0,INDEX(Лист1!$A$2:$H$32,$A7-1,4)*11),10),\"\")","v":"2013-03-30"},{"$f":"IFERROR((LEN(INDEX(Лист1!$A$2:$G$32,$A7,3))+1)/11,\"\")","v":10}]
[{"$f":"IFERROR(IF(ROW()=2,1,IF(INDEX(Лист1!$A$2:$I$32,$A7,4)=ROW()-2,IF(ROW()>=MAX(Лист1!D:D)+2,\"\",MAX(A$1:A7)+1),A7)),\"\")","v":1},{"$f":"IFERROR(INDEX(Лист1!$A$2:$G$32,$A8,1),\"\")","v":"В связи с расширением срочно требуются сотрудники в офис, от 35 000 руб. Тел. 201-06-13"},{"$f":"IFERROR(--MID(INDEX(Лист1!$A$2:$G$32,$A8,3),ROW()-1+10*(ROW()-2)-IF(A8=1,0,INDEX(Лист1!$A$2:$H$32,$A8-1,4)*11),10),\"\")","v":"2013-04-02"},{"$f":"IFERROR((LEN(INDEX(Лист1!$A$2:$G$32,$A8,3))+1)/11,\"\")","v":10}]
[{"$f":"IFERROR(IF(ROW()=2,1,IF(INDEX(Лист1!$A$2:$I$32,$A8,4)=ROW()-2,IF(ROW()>=MAX(Лист1!D:D)+2,\"\",MAX(A$1:A8)+1),A8)),\"\")","v":1},{"$f":"IFERROR(INDEX(Лист1!$A$2:$G$32,$A9,1),\"\")","v":"В связи с расширением срочно требуются сотрудники в офис, от 35 000 руб. Тел. 201-06-13"},{"$f":"IFERROR(--MID(INDEX(Лист1!$A$2:$G$32,$A9,3),ROW()-1+10*(ROW()-2)-IF(A9=1,0,INDEX(Лист1!$A$2:$H$32,$A9-1,4)*11),10),\"\")","v":"2013-04-03"},{"$f":"IFERROR((LEN(INDEX(Лист1!$A$2:$G$32,$A9,3))+1)/11,\"\")","v":10}]
[{"$f":"IFERROR(IF(ROW()=2,1,IF(INDEX(Лист1!$A$2:$I$32,$A9,4)=ROW()-2,IF(ROW()>=MAX(Лист1!D:D)+2,\"\",MAX(A$1:A9)+1),A9)),\"\")","v":1},{"$f":"IFERROR(INDEX(Лист1!$A$2:$G$32,$A10,1),\"\")","v":"В связи с расширением срочно требуются сотрудники в офис, от 35 000 руб. Тел. 201-06-13"},{"$f":"IFERROR(--MID(INDEX(Лист1!$A$2:$G$32,$A10,3),ROW()-1+10*(ROW()-2)-IF(A10=1,0,INDEX(Лист1!$A$2:$H$32,$A10-1,4)*11),10),\"\")","v":"2013-04-06"},{"$f":"IFERROR((LEN(INDEX(Лист1!$A$2:$G$32,$A10,3))+1)/11,\"\")","v":10}]
[{"$f":"IFERROR(IF(ROW()=2,1,IF(INDEX(Лист1!$A$2:$I$32,$A10,4)=ROW()-2,IF(ROW()>=MAX(Лист1!D:D)+2,\"\",MAX(A$1:A10)+1),A10)),\"\")","v":1},{"$f":"IFERROR(INDEX(Лист1!$A$2:$G$32,$A11,1),\"\")","v":"В связи с расширением срочно требуются сотрудники в офис, от 35 000 руб. Тел. 201-06-13"},{"$f":"IFERROR(--MID(INDEX(Лист1!$A$2:$G$32,$A11,3),ROW()-1+10*(ROW()-2)-IF(A11=1,0,INDEX(Лист1!$A$2:$H$32,$A11-1,4)*11),10),\"\")","v":"2013-04-07"},{"$f":"IFERROR((LEN(INDEX(Лист1!$A$2:$G$32,$A11,3))+1)/11,\"\")","v":10}]
[{"$f":"IFERROR(IF(ROW()=2,1,IF(INDEX(Лист1!$A$2:$I$32,$A11,4)=ROW()-2,IF(ROW()>=MAX(Лист1!D:D)+2,\"\",MAX(A$1:A11)+1),A11)),\"\")","v":2},{"$f":"IFERROR(INDEX(Лист1!$A$2:$G$32,$A12,1),\"\")","v":"Водители такси на новые Нексии. Выгодные условия. Тел. 207-10-65"},{"$f":"IFERROR(--MID(INDEX(Лист1!$A$2:$G$32,$A12,3),ROW()-1+10*(ROW()-2)-IF(A12=1,0,INDEX(Лист1!$A$2:$H$32,$A12-1,4)*11),10),\"\")","v":"2013-03-21"},{"$f":"IFERROR((LEN(INDEX(Лист1!$A$2:$G$32,$A12,3))+1)/11,\"\")","v":3}]
[{"$f":"IFERROR(IF(ROW()=2,1,IF(INDEX(Лист1!$A$2:$I$32,$A12,4)=ROW()-2,IF(ROW()>=MAX(Лист1!D:D)+2,\"\",MAX(A$1:A12)+1),A12)),\"\")","v":2},{"$f":"IFERROR(INDEX(Лист1!$A$2:$G$32,$A13,1),\"\")","v":"Водители такси на новые Нексии. Выгодные условия. Тел. 207-10-65"},{"$f":"IFERROR(--MID(INDEX(Лист1!$A$2:$G$32,$A13,3),ROW()-1+10*(ROW()-2)-IF(A13=1,0,INDEX(Лист1!$A$2:$H$32,$A13-1,4)*11),10),\"\")","v":"2013-03-22"},{"$f":"IFERROR((LEN(INDEX(Лист1!$A$2:$G$32,$A13,3))+1)/11,\"\")","v":3}]
[{"$f":"IFERROR(IF(ROW()=2,1,IF(INDEX(Лист1!$A$2:$I$32,$A13,4)=ROW()-2,IF(ROW()>=MAX(Лист1!D:D)+2,\"\",MAX(A$1:A13)+1),A13)),\"\")","v":2},{"$f":"IFERROR(INDEX(Лист1!$A$2:$G$32,$A14,1),\"\")","v":"Водители такси на новые Нексии. Выгодные условия. Тел. 207-10-65"},{"$f":"IFERROR(--MID(INDEX(Лист1!$A$2:$G$32,$A14,3),ROW()-1+10*(ROW()-2)-IF(A14=1,0,INDEX(Лист1!$A$2:$H$32,$A14-1,4)*11),10),\"\")","v":"2013-03-23"},{"$f":"IFERROR((LEN(INDEX(Лист1!$A$2:$G$32,$A14,3))+1)/11,\"\")","v":3}]
[{"$f":"IFERROR(IF(ROW()=2,1,IF(INDEX(Лист1!$A$2:$I$32,$A14,4)=ROW()-2,IF(ROW()>=MAX(Лист1!D:D)+2,\"\",MAX(A$1:A14)+1),A14)),\"\")","v":3},{"$f":"IFERROR(INDEX(Лист1!$A$2:$G$32,$A15,1),\"\")","v":"На постоянную работу диспетчер-логист, 2/2. Тел. 219-22-27"},{"$f":"IFERROR(--MID(INDEX(Лист1!$A$2:$G$32,$A15,3),ROW()-1+10*(ROW()-2)-IF(A15=1,0,INDEX(Лист1!$A$2:$H$32,$A15-1,4)*11),10),\"\")","v":"2013-03-21"},{"$f":"IFERROR((LEN(INDEX(Лист1!$A$2:$G$32,$A15,3))+1)/11,\"\")","v":3}]
[{"$f":"IFERROR(IF(ROW()=2,1,IF(INDEX(Лист1!$A$2:$I$32,$A15,4)=ROW()-2,IF(ROW()>=MAX(Лист1!D:D)+2,\"\",MAX(A$1:A15)+1),A15)),\"\")","v":3},{"$f":"IFERROR(INDEX(Лист1!$A$2:$G$32,$A16,1),\"\")","v":"На постоянную работу диспетчер-логист, 2/2. Тел. 219-22-27"},{"$f":"IFERROR(--MID(INDEX(Лист1!$A$2:$G$32,$A16,3),ROW()-1+10*(ROW()-2)-IF(A16=1,0,INDEX(Лист1!$A$2:$H$32,$A16-1,4)*11),10),\"\")","v":"2013-03-22"},{"$f":"IFERROR((LEN(INDEX(Лист1!$A$2:$G$32,$A16,3))+1)/11,\"\")","v":3}]
[{"$f":"IFERROR(IF(ROW()=2,1,IF(INDEX(Лист1!$A$2:$I$32,$A16,4)=ROW()-2,IF(ROW()>=MAX(Лист1!D:D)+2,\"\",MAX(A$1:A16)+1),A16)),\"\")","v":3},{"$f":"IFERROR(INDEX(Лист1!$A$2:$G$32,$A17,1),\"\")","v":"На постоянную работу диспетчер-логист, 2/2. Тел. 219-22-27"},{"$f":"IFERROR(--MID(INDEX(Лист1!$A$2:$G$32,$A17,3),ROW()-1+10*(ROW()-2)-IF(A17=1,0,INDEX(Лист1!$A$2:$H$32,$A17-1,4)*11),10),\"\")","v":"2013-03-23"},{"$f":"IFERROR((LEN(INDEX(Лист1!$A$2:$G$32,$A17,3))+1)/11,\"\")","v":3}]
[{"$f":"IFERROR(IF(ROW()=2,1,IF(INDEX(Лист1!$A$2:$I$32,$A17,4)=ROW()-2,IF(ROW()>=MAX(Лист1!D:D)+2,\"\",MAX(A$1:A17)+1),A17)),\"\")","v":4},{"$f":"IFERROR(INDEX(Лист1!$A$2:$G$32,$A18,1),\"\")","v":"Обучение на массажистов, косметологов-эстетистов, медсестер. Трудоустройство. Тел. 202-36-56"},{"$f":"IFERROR(--MID(INDEX(Лист1!$A$2:$G$32,$A18,3),ROW()-1+10*(ROW()-2)-IF(A18=1,0,INDEX(Лист1!$A$2:$H$32,$A18-1,4)*11),10),\"\")","v":"2013-03-21"},{"$f":"IFERROR((LEN(INDEX(Лист1!$A$2:$G$32,$A18,3))+1)/11,\"\")","v":5}]
[{"$f":"IFERROR(IF(ROW()=2,1,IF(INDEX(Лист1!$A$2:$I$32,$A18,4)=ROW()-2,IF(ROW()>=MAX(Лист1!D:D)+2,\"\",MAX(A$1:A18)+1),A18)),\"\")","v":4},{"$f":"IFERROR(INDEX(Лист1!$A$2:$G$32,$A19,1),\"\")","v":"Обучение на массажистов, косметологов-эстетистов, медсестер. Трудоустройство. Тел. 202-36-56"},{"$f":"IFERROR(--MID(INDEX(Лист1!$A$2:$G$32,$A19,3),ROW()-1+10*(ROW()-2)-IF(A19=1,0,INDEX(Лист1!$A$2:$H$32,$A19-1,4)*11),10),\"\")","v":"2013-03-22"},{"$f":"IFERROR((LEN(INDEX(Лист1!$A$2:$G$32,$A19,3))+1)/11,\"\")","v":5}]
[{"$f":"IFERROR(IF(ROW()=2,1,IF(INDEX(Лист1!$A$2:$I$32,$A19,4)=ROW()-2,IF(ROW()>=MAX(Лист1!D:D)+2,\"\",MAX(A$1:A19)+1),A19)),\"\")","v":4},{"$f":"IFERROR(INDEX(Лист1!$A$2:$G$32,$A20,1),\"\")","v":"Обучение на массажистов, косметологов-эстетистов, медсестер. Трудоустройство. Тел. 202-36-56"},{"$f":"IFERROR(--MID(INDEX(Лист1!$A$2:$G$32,$A20,3),ROW()-1+10*(ROW()-2)-IF(A20=1,0,INDEX(Лист1!$A$2:$H$32,$A20-1,4)*11),10),\"\")","v":"2013-03-23"},{"$f":"IFERROR((LEN(INDEX(Лист1!$A$2:$G$32,$A20,3))+1)/11,\"\")","v":5}]
[{"$f":"IFERROR(IF(ROW()=2,1,IF(INDEX(Лист1!$A$2:$I$32,$A20,4)=ROW()-2,IF(ROW()>=MAX(Лист1!D:D)+2,\"\",MAX(A$1:A20)+1),A20)),\"\")","v":4},{"$f":"IFERROR(INDEX(Лист1!$A$2:$G$32,$A21,1),\"\")","v":"Обучение на массажистов, косметологов-эстетистов, медсестер. Трудоустройство. Тел. 202-36-56"},{"$f":"IFERROR(--MID(INDEX(Лист1!$A$2:$G$32,$A21,3),ROW()-1+10*(ROW()-2)-IF(A21=1,0,INDEX(Лист1!$A$2:$H$32,$A21-1,4)*11),10),\"\")","v":"2013-03-24"},{"$f":"IFERROR((LEN(INDEX(Лист1!$A$2:$G$32,$A21,3))+1)/11,\"\")","v":5}]
[{"$f":"IFERROR(IF(ROW()=2,1,IF(INDEX(Лист1!$A$2:$I$32,$A21,4)=ROW()-2,IF(ROW()>=MAX(Лист1!D:D)+2,\"\",MAX(A$1:A21)+1),A21)),\"\")","v":4},{"$f":"IFERROR(INDEX(Лист1!$A$2:$G$32,$A22,1),\"\")","v":"Обучение на массажистов, косметологов-эстетистов, медсестер. Трудоустройство. Тел. 202-36-56"},{"$f":"IFERROR(--MID(INDEX(Лист1!$A$2:$G$32,$A22,3),ROW()-1+10*(ROW()-2)-IF(A22=1,0,INDEX(Лист1!$A$2:$H$32,$A22-1,4)*11),10),\"\")","v":"2013-03-25"},{"$f":"IFERROR((LEN(INDEX(Лист1!$A$2:$G$32,$A22,3))+1)/11,\"\")","v":5}]
[{"$f":"IFERROR(IF(ROW()=2,1,IF(INDEX(Лист1!$A$2:$I$32,$A22,4)=ROW()-2,IF(ROW()>=MAX(Лист1!D:D)+2,\"\",MAX(A$1:A22)+1),A22)),\"\")","v":5},{"$f":"IFERROR(INDEX(Лист1!$A$2:$G$32,$A23,1),\"\")","v":"Подработка. Тел. 3-611-655"},{"$f":"IFERROR(--MID(INDEX(Лист1!$A$2:$G$32,$A23,3),ROW()-1+10*(ROW()-2)-IF(A23=1,0,INDEX(Лист1!$A$2:$H$32,$A23-1,4)*11),10),\"\")","v":"2013-03-21"},{"$f":"IFERROR((LEN(INDEX(Лист1!$A$2:$G$32,$A23,3))+1)/11,\"\")","v":5}]
[{"$f":"IFERROR(IF(ROW()=2,1,IF(INDEX(Лист1!$A$2:$I$32,$A23,4)=ROW()-2,IF(ROW()>=MAX(Лист1!D:D)+2,\"\",MAX(A$1:A23)+1),A23)),\"\")","v":5},{"$f":"IFERROR(INDEX(Лист1!$A$2:$G$32,$A24,1),\"\")","v":"Подработка. Тел. 3-611-655"},{"$f":"IFERROR(--MID(INDEX(Лист1!$A$2:$G$32,$A24,3),ROW()-1+10*(ROW()-2)-IF(A24=1,0,INDEX(Лист1!$A$2:$H$32,$A24-1,4)*11),10),\"\")","v":"2013-03-24"},{"$f":"IFERROR((LEN(INDEX(Лист1!$A$2:$G$32,$A24,3))+1)/11,\"\")","v":5}]
[{"$f":"IFERROR(IF(ROW()=2,1,IF(INDEX(Лист1!$A$2:$I$32,$A24,4)=ROW()-2,IF(ROW()>=MAX(Лист1!D:D)+2,\"\",MAX(A$1:A24)+1),A24)),\"\")","v":5},{"$f":"IFERROR(INDEX(Лист1!$A$2:$G$32,$A25,1),\"\")","v":"Подработка. Тел. 3-611-655"},{"$f":"IFERROR(--MID(INDEX(Лист1!$A$2:$G$32,$A25,3),ROW()-1+10*(ROW()-2)-IF(A25=1,0,INDEX(Лист1!$A$2:$H$32,$A25-1,4)*11),10),\"\")","v":"2013-03-25"},{"$f":"IFERROR((LEN(INDEX(Лист1!$A$2:$G$32,$A25,3))+1)/11,\"\")","v":5}]
[{"$f":"IFERROR(IF(ROW()=2,1,IF(INDEX(Лист1!$A$2:$I$32,$A25,4)=ROW()-2,IF(ROW()>=MAX(Лист1!D:D)+2,\"\",MAX(A$1:A25)+1),A25)),\"\")","v":5},{"$f":"IFERROR(INDEX(Лист1!$A$2:$G$32,$A26,1),\"\")","v":"Подработка. Тел. 3-611-655"},{"$f":"IFERROR(--MID(INDEX(Лист1!$A$2:$G$32,$A26,3),ROW()-1+10*(ROW()-2)-IF(A26=1,0,INDEX(Лист1!$A$2:$H$32,$A26-1,4)*11),10),\"\")","v":"2013-03-26"},{"$f":"IFERROR((LEN(INDEX(Лист1!$A$2:$G$32,$A26,3))+1)/11,\"\")","v":5}]
[{"$f":"IFERROR(IF(ROW()=2,1,IF(INDEX(Лист1!$A$2:$I$32,$A26,4)=ROW()-2,IF(ROW()>=MAX(Лист1!D:D)+2,\"\",MAX(A$1:A26)+1),A26)),\"\")","v":5},{"$f":"IFERROR(INDEX(Лист1!$A$2:$G$32,$A27,1),\"\")","v":"Подработка. Тел. 3-611-655"},{"$f":"IFERROR(--MID(INDEX(Лист1!$A$2:$G$32,$A27,3),ROW()-1+10*(ROW()-2)-IF(A27=1,0,INDEX(Лист1!$A$2:$H$32,$A27-1,4)*11),10),\"\")","v":"2013-03-27"},{"$f":"IFERROR((LEN(INDEX(Лист1!$A$2:$G$32,$A27,3))+1)/11,\"\")","v":5}]
[{"$f":"IFERROR(IF(ROW()=2,1,IF(INDEX(Лист1!$A$2:$I$32,$A27,4)=ROW()-2,IF(ROW()>=MAX(Лист1!D:D)+2,\"\",MAX(A$1:A27)+1),A27)),\"\")","v":6},{"$f":"IFERROR(INDEX(Лист1!$A$2:$G$32,$A28,1),\"\")","v":"Приглашаем комплектовщиков, приемосдатчиков, грузчиков, упаковщицу, складского логиста. Официальное трудоустройство, питание, доставка. Тел. 216-28-48"},{"$f":"IFERROR(--MID(INDEX(Лист1!$A$2:$G$32,$A28,3),ROW()-1+10*(ROW()-2)-IF(A28=1,0,INDEX(Лист1!$A$2:$H$32,$A28-1,4)*11),10),\"\")","v":"2013-03-21"},{"$f":"IFERROR((LEN(INDEX(Лист1!$A$2:$G$32,$A28,3))+1)/11,\"\")","v":5}]
[{"$f":"IFERROR(IF(ROW()=2,1,IF(INDEX(Лист1!$A$2:$I$32,$A28,4)=ROW()-2,IF(ROW()>=MAX(Лист1!D:D)+2,\"\",MAX(A$1:A28)+1),A28)),\"\")","v":6},{"$f":"IFERROR(INDEX(Лист1!$A$2:$G$32,$A29,1),\"\")","v":"Приглашаем комплектовщиков, приемосдатчиков, грузчиков, упаковщицу, складского логиста. Официальное трудоустройство, питание, доставка. Тел. 216-28-48"},{"$f":"IFERROR(--MID(INDEX(Лист1!$A$2:$G$32,$A29,3),ROW()-1+10*(ROW()-2)-IF(A29=1,0,INDEX(Лист1!$A$2:$H$32,$A29-1,4)*11),10),\"\")","v":"2013-03-24"},{"$f":"IFERROR((LEN(INDEX(Лист1!$A$2:$G$32,$A29,3))+1)/11,\"\")","v":5}]
[{"$f":"IFERROR(IF(ROW()=2,1,IF(INDEX(Лист1!$A$2:$I$32,$A29,4)=ROW()-2,IF(ROW()>=MAX(Лист1!D:D)+2,\"\",MAX(A$1:A29)+1),A29)),\"\")","v":6},{"$f":"IFERROR(INDEX(Лист1!$A$2:$G$32,$A30,1),\"\")","v":"Приглашаем комплектовщиков, приемосдатчиков, грузчиков, упаковщицу, складского логиста. Официальное трудоустройство, питание, доставка. Тел. 216-28-48"},{"$f":"IFERROR(--MID(INDEX(Лист1!$A$2:$G$32,$A30,3),ROW()-1+10*(ROW()-2)-IF(A30=1,0,INDEX(Лист1!$A$2:$H$32,$A30-1,4)*11),10),\"\")","v":"2013-03-25"},{"$f":"IFERROR((LEN(INDEX(Лист1!$A$2:$G$32,$A30,3))+1)/11,\"\")","v":5}]
{"$rows_left_out":301}
{"sheet":"Сводная таблица","index":2,"n_rows":27,"n_cols":1,"rows_kept":27,"cut":false,"hidden":false,"merged":[]}
[]
[]
["Названия строк"]
["2013-03-21"]
["2013-03-22"]
["2013-03-23"]
["2013-03-24"]
["2013-03-25"]
["2013-03-26"]
["2013-03-27"]
["2013-03-29"]
["2013-03-30"]
["2013-03-31"]
["Срочно требуются: продавец в мясной отдел, повар в холодный цех, продавец в колбасный отдел, товаровед с опытом работы, юрист. Тел. 8-912-294-60-06, 8-922-14-33-457"]
["2013-04-02"]
["В связи с расширением срочно требуются сотрудники в офис, от 35 000 руб. Тел. 201-06-13"]
["Работа на дому. Тел. 201-05-47"]
["Срочно требуются: продавец в мясной отдел, повар в холодный цех, продавец в колбасный отдел, товаровед с опытом работы, юрист. Тел. 8-912-294-60-06, 8-922-14-33-457"]
["Требуется администратор зала, 28 000 руб. Тел. 200-93-67"]
["Требуется администратор, от 25000 руб. Тел. 213-35-60"]
["Требуется менеджер корпоративных продаж, от 35 000 руб. Тел. 200-21-78"]
["Требуются продавцы-консультанты, грузчики, фасовщицы. ЖБИ, Эльмаш, Центр, Сортировка. Тел. 290-16-48, 8-922-030-72-22"]
["Требуются сотрудники в отдел продаж, оклад 30 000 руб + %. Тел. 200-21-78"]
["2013-04-03"]
["2013-04-04"]
["2013-04-06"]
["2013-04-07"]