{"text_format":"1","workbook":"xlsx","n_sheets":2,"sheets":["Реестр","Отгрузка"],"not_rendered":{"charts":0,"images":0,"macros":1,"external_links":0,"defined_names":0,"comments":0,"pivot_tables":0},"unopened":[],"bounds":{"document_bytes":16777216,"sheet_cells":100000,"rows_first":2000,"rows_last":500,"rows_between":2000,"halvings":0,"cell_chars":16384,"cell_head_chars":4096},"cells_cut":0,"cells_raw":0,"read":"whole","date_system":"1900"}

{"sheet":"Реестр","index":0,"n_rows":10,"n_cols":8,"rows_kept":10,"cut":false,"hidden":false,"merged":[[2,6,3,6],[2,7,3,7],[2,5,3,5],[2,0,3,0],[2,1,2,2],[2,4,3,4]]}
[null,null,null,"Реестр счетов"]
[]
["Идентификатор","Cчет",null,"Контрагент ","Номенклатура","Кол-во","Цена","Сума"]
[null,"№ ","Дата ","Наименование "]
[{"$f":"IF(D5=\"\",\"\",CONCATENATE(D5,\" №\",B5,\" от \",TEXT(C5,\"ДД.ММ.ГГ\")))","v":"Меркурий, ООО №1 от 03.08.19"},1,"2019-08-03","Меркурий, ООО","BOSCH холодильник",10,1000,{"$f":"F5*G5","v":10000}]
[{"$f":"IF(D6=\"\",\"\",CONCATENATE(D6,\" №\",B6,\" от \",TEXT(C6,\"ДД.ММ.ГГ\")))","v":"Юпитер, ООО №2 от 03.08.19"},2,"2019-08-03","Юпитер, ООО","Кондиционер ELEKTA",5,2000,10000]
["Полипак,ООО №3 от 04.08.19",3,"2019-08-04","Полипак,ООО","Вентилятор BINATONE",20,3000,{"$f":"F7*G7","v":60000}]
["Омега,ООО №4 от 07.02.20",4,"2020-02-07","Омега,ООО","Стол компьютерный",3,550,{"$f":"F8*G8","v":1650}]
["Бета, ООО №5 от 10.02.20",5,"2020-02-10","Бета, ООО","Кухонный гарнитур \"Тинга-У\"",5,8000,{"$f":"F9*G9","v":40000}]
["Бета, ООО №5 от 10.02.20",5,"2020-02-10","Бета, ООО","Кухонный гарнитур \"Тинга\"",6,7500,45000]

{"sheet":"Отгрузка","index":1,"n_rows":14,"n_cols":5,"rows_kept":14,"cut":false,"hidden":false,"merged":[]}
[null,null,null,"красный цвет-формулы"]
[null,null,"Учет отгрузок"]
["Дата отгрузки","Товар","Наименование контрагента","Идентификатор(выбор из вып.списка)","Кол-во(вводится в ручную)"]
["2020-02-04",{"$f":"IF(D4=\"\",\"\",VLOOKUP(D4,Реестр!$A$5:$E$10,5,FALSE))","v":"Кондиционер ELEKTA"},{"$f":"IF(D4=\"\",\"\",VLOOKUP(D4,Реестр!$A$5:$D$10,4,FALSE))","v":"Юпитер, ООО"},"Юпитер, ООО №2 от 03.08.19",3]
["2020-02-05",{"$f":"IF(D5=\"\",\"\",VLOOKUP(D5,Реестр!$A$5:$E$10,5,FALSE))","v":"Стол компьютерный"},{"$f":"IF(D5=\"\",\"\",VLOOKUP(D5,Реестр!$A$5:$D$10,4,FALSE))","v":"Омега,ООО"},"Омега,ООО №4 от 07.02.20",2]
["2020-02-06",{"$f":"IF(D6=\"\",\"\",VLOOKUP(D6,Реестр!$A$5:$E$10,5,FALSE))","v":"Стол компьютерный"},{"$f":"IF(D6=\"\",\"\",VLOOKUP(D6,Реестр!$A$5:$D$10,4,FALSE))","v":"Омега,ООО"},"Омега,ООО №4 от 07.02.20",1]
["2020-02-11",{"$f":"IF(D7=\"\",\"\",VLOOKUP(D7,Реестр!$A$5:$E$10,5,FALSE))","v":"Кухонный гарнитур \"Тинга-У\""},{"$f":"IF(D7=\"\",\"\",VLOOKUP(D7,Реестр!$A$5:$D$10,4,FALSE))","v":"Бета, ООО"},"Бета, ООО №5 от 10.02.20",5]
["2020-02-11",{"$f":"IF(D8=\"\",\"\",VLOOKUP(D8,Реестр!$A$5:$E$10,5,FALSE))","v":"Кухонный гарнитур \"Тинга-У\""},{"$f":"IF(D8=\"\",\"\",VLOOKUP(D8,Реестр!$A$5:$D$10,4,FALSE))","v":"Бета, ООО"},"Бета, ООО №5 от 10.02.20",2]
[]
[null,"как подтянуть вторую позицию по счету :Кухонный гарнитур \"Тинга\"(сейчас подтягивает первое найденное)"]
[]
[null,"В счете выставлено две позиции товара "]
[5,"2020-02-10","Бета, ООО","Кухонный гарнитур \"Тинга-У\"",5]
[5,"2020-02-10","Бета, ООО","Кухонный гарнитур \"Тинга\"",6]