{"text_format":"1","workbook":"xlsx","n_sheets":4,"sheets":["СВОДНАЯ","Лист1","Лист2","Лист3"],"not_rendered":{"charts":0,"images":0,"macros":0,"external_links":0,"defined_names":1,"comments":0,"pivot_tables":0},"unopened":[],"bounds":{"document_bytes":16777216,"sheet_cells":100000,"rows_first":2000,"rows_last":500,"rows_between":2000,"halvings":0,"cell_chars":16384,"cell_head_chars":4096},"cells_cut":0,"cells_raw":0,"read":"whole","date_system":"1900"}

{"sheet":"СВОДНАЯ","index":0,"n_rows":116,"n_cols":6,"rows_kept":116,"cut":false,"hidden":false,"merged":[]}
[]
[]
[]
[]
[]
[]
[]
[]
[null,null,null,null,1]
[null,null,null,null,2]
[null,null,null,null,3]
[null,null,null,null,4]
[null,null,null,null,5]
[null,null,null,null,6]
[null,null,null,null,7]
[null,null,null,null,8]
[null,null,null,null,9]
[null,null,null,null,10]
[null,null,null,null,11]
[]
[]
[]
[]
[]
[]
[]
[]
[]
[]
[]
[]
[]
[]
[]
[]
[]
[]
[]
[]
[]
[]
[]
[]
[]
[]
[]
[]
[]
[]
[]
[]
[]
[]
[]
[]
[]
[]
[]
[]
[]
[]
[]
[]
[]
[]
[]
[]
[]
[]
[]
[]
[]
[]
[]
[]
[]
[]
[]
[]
[]
[]
[]
[]
[]
[]
[]
[]
[]
[]
[]
[]
[]
[]
[]
[]
[]
[]
[]
[]
[]
[]
[]
[]
[]
[]
[]
[]
[]
[null,null,null,null,1,"ф"]
[null,null,null,null,2,"в"]
[null,null,null,null,3,"п"]
[null,null,null,null,4,"р"]
[null,null,null,null,5,"с"]
[null,null,null,null,6,"т"]
[null,null,null,null,7,"у"]
[null,null,null,null,8,"к"]

{"sheet":"Лист1","index":1,"n_rows":3,"n_cols":3,"rows_kept":3,"cut":false,"hidden":false,"merged":[]}
[]
[]
[null,null,{"$f":"VLOOKUP(INDEX(СВОДНАЯ!E:E,ю+7),СВОДНАЯ!E109:F116,2,0)","v":"ф"}]

{"sheet":"Лист2","index":2,"n_rows":3,"n_cols":3,"rows_kept":3,"cut":false,"hidden":false,"merged":[]}
[]
[]
[null,null,{"$f":"VLOOKUP(INDEX(СВОДНАЯ!E:E,ю+7),СВОДНАЯ!E109:F116,2,0)","v":"в"}]

{"sheet":"Лист3","index":3,"n_rows":3,"n_cols":3,"rows_kept":3,"cut":false,"hidden":false,"merged":[]}
[]
[]
[null,null,{"$f":"VLOOKUP(INDEX(СВОДНАЯ!E:E,ю+7),СВОДНАЯ!E109:F116,2,0)","v":"п"}]