{"text_format":"1","workbook":"xlsx","n_sheets":2,"sheets":["Варианты","Время"],"not_rendered":{"charts":0,"images":0,"macros":1,"external_links":0,"defined_names":9,"comments":0,"pivot_tables":0},"unopened":[],"bounds":{"document_bytes":16777216,"sheet_cells":100000,"rows_first":2000,"rows_last":500,"rows_between":2000,"halvings":0,"cell_chars":16384,"cell_head_chars":4096},"cells_cut":0,"cells_raw":0,"read":"whole","date_system":"1900"}

{"sheet":"Варианты","index":0,"n_rows":17,"n_cols":10,"rows_kept":17,"cut":false,"hidden":false,"merged":[[1,3,1,9],[2,4,2,5],[2,8,2,9]]}
[]
[null,"2020-03-01"]
[null,null,null,"Будни","Рабочее время",null,null,"Выходные","Рабочее время"]
[null,null,null,1,null,{"$f":"IF(D4=\"\",\"\",E4+1)","v":1},null,101,null,{"$f":"IF(H4=\"\",\"\",I4+1)","v":1}]
[null,null,null,2,null,{"$f":"IF(D5=\"\",\"\",E5+1)","v":1},null,102,null,{"$f":"IF(H5=\"\",\"\",I5+1)","v":1}]
[null,null,null,3,null,1,null,103,null,1]
[null,"Выходные дни",null,4,null,1,null,104,null,1]
[null,"2020-03-01",null,5,null,1,null,105,null,1]
[null,"2020-03-07",null,6,null,1,null,106,null,1]
[null,"2020-03-08",null,7,null,1,null,107,null,1]
[null,"2020-03-09",null,8,null,1,null,108,null,1]
[null,null,null,9,null,1,null,null,null,""]
[null,null,null,10,null,1,null,null,null,""]
[null,null,null,11,null,1,null,null,null,""]
[null,null,null,12,null,1,null,null,null,""]
[null,null,null,13,null,1,null,null,null,""]
[null,null,null,14,null,1,null,null,null,""]

{"sheet":"Время","index":1,"n_rows":129,"n_cols":9,"rows_kept":129,"cut":false,"hidden":false,"merged":[[1,9,2,9],[1,1,2,1],[1,8,2,8],[1,2,2,2],[1,7,2,7],[1,3,2,3],[1,4,2,4],[1,5,2,6]]}
[]
[null,"Дата","Маршруты","Начало","Окончание","Обед",null,null,"Время"]
[]
[null,{"$f":"IF(Варианты!$B$2=\"\",\"\",Варианты!$B$2)","v":"2020-03-01"},{"$f":"IF(B4=\"\",\"\",IFERROR(IF(ISNUMBER(MATCH(B4,Варианты!$B$8:$B$17,0)),INDEX(Варианты!$H$4:$H$17,COUNTIF($B$4:B4,B4)),INDEX(Варианты!$D$4:$D$17,COUNTIF($B$4:B4,B4)))&\"\",\"\"))","v":"101"},null,null,null,null,null,{"$f":"IF(OR(F4=\"\",G4=\"\"),E4-D4,(E4-D4)-(G4-F4))","v":"00:00:00"}]
[null,{"$f":"IF(Варианты!$B$2=\"\",\"\",Варианты!$B$2)","v":"2020-03-01"},{"$f":"IF(B5=\"\",\"\",IFERROR(IF(ISNUMBER(MATCH(B5,Варианты!$B$8:$B$17,0)),INDEX(Варианты!$H$4:$H$17,COUNTIF($B$4:B5,B5)),INDEX(Варианты!$D$4:$D$17,COUNTIF($B$4:B5,B5)))&\"\",\"\"))","v":"102"},null,null,null,null,null,"00:00:00"]
[null,{"$f":"IF(Варианты!$B$2=\"\",\"\",Варианты!$B$2)","v":"2020-03-01"},{"$f":"IF(B6=\"\",\"\",IFERROR(IF(ISNUMBER(MATCH(B6,Варианты!$B$8:$B$17,0)),INDEX(Варианты!$H$4:$H$17,COUNTIF($B$4:B6,B6)),INDEX(Варианты!$D$4:$D$17,COUNTIF($B$4:B6,B6)))&\"\",\"\"))","v":"103"},null,null,null,null,null,"00:00:00"]
[null,{"$f":"IF(Варианты!$B$2=\"\",\"\",Варианты!$B$2)","v":"2020-03-01"},{"$f":"IF(B7=\"\",\"\",IFERROR(IF(ISNUMBER(MATCH(B7,Варианты!$B$8:$B$17,0)),INDEX(Варианты!$H$4:$H$17,COUNTIF($B$4:B7,B7)),INDEX(Варианты!$D$4:$D$17,COUNTIF($B$4:B7,B7)))&\"\",\"\"))","v":"104"},null,null,null,null,null,"00:00:00"]
[null,{"$f":"IF(Варианты!$B$2=\"\",\"\",Варианты!$B$2)","v":"2020-03-01"},{"$f":"IF(B8=\"\",\"\",IFERROR(IF(ISNUMBER(MATCH(B8,Варианты!$B$8:$B$17,0)),INDEX(Варианты!$H$4:$H$17,COUNTIF($B$4:B8,B8)),INDEX(Варианты!$D$4:$D$17,COUNTIF($B$4:B8,B8)))&\"\",\"\"))","v":"105"},null,null,null,null,null,"00:00:00"]
[null,{"$f":"IF(Варианты!$B$2=\"\",\"\",Варианты!$B$2)","v":"2020-03-01"},{"$f":"IF(B9=\"\",\"\",IFERROR(IF(ISNUMBER(MATCH(B9,Варианты!$B$8:$B$17,0)),INDEX(Варианты!$H$4:$H$17,COUNTIF($B$4:B9,B9)),INDEX(Варианты!$D$4:$D$17,COUNTIF($B$4:B9,B9)))&\"\",\"\"))","v":"106"},null,null,null,null,null,"00:00:00"]
[null,{"$f":"IF(Варианты!$B$2=\"\",\"\",Варианты!$B$2)","v":"2020-03-01"},{"$f":"IF(B10=\"\",\"\",IFERROR(IF(ISNUMBER(MATCH(B10,Варианты!$B$8:$B$17,0)),INDEX(Варианты!$H$4:$H$17,COUNTIF($B$4:B10,B10)),INDEX(Варианты!$D$4:$D$17,COUNTIF($B$4:B10,B10)))&\"\",\"\"))","v":"107"},null,null,null,null,null,"00:00:00"]
[null,{"$f":"IF(Варианты!$B$2=\"\",\"\",Варианты!$B$2)","v":"2020-03-01"},{"$f":"IF(B11=\"\",\"\",IFERROR(IF(ISNUMBER(MATCH(B11,Варианты!$B$8:$B$17,0)),INDEX(Варианты!$H$4:$H$17,COUNTIF($B$4:B11,B11)),INDEX(Варианты!$D$4:$D$17,COUNTIF($B$4:B11,B11)))&\"\",\"\"))","v":"108"},null,null,null,null,null,"00:00:00"]
[null,{"$f":"IF(Варианты!$B$2=\"\",\"\",Варианты!$B$2)","v":"2020-03-01"},{"$f":"IF(B12=\"\",\"\",IFERROR(IF(ISNUMBER(MATCH(B12,Варианты!$B$8:$B$17,0)),INDEX(Варианты!$H$4:$H$17,COUNTIF($B$4:B12,B12)),INDEX(Варианты!$D$4:$D$17,COUNTIF($B$4:B12,B12)))&\"\",\"\"))","v":""},null,null,null,null,null,"00:00:00"]
[null,{"$f":"IF(Варианты!$B$2=\"\",\"\",Варианты!$B$2)","v":"2020-03-01"},{"$f":"IF(B13=\"\",\"\",IFERROR(IF(ISNUMBER(MATCH(B13,Варианты!$B$8:$B$17,0)),INDEX(Варианты!$H$4:$H$17,COUNTIF($B$4:B13,B13)),INDEX(Варианты!$D$4:$D$17,COUNTIF($B$4:B13,B13)))&\"\",\"\"))","v":""},null,null,null,null,null,"00:00:00"]
[null,{"$f":"IF(Варианты!$B$2=\"\",\"\",Варианты!$B$2)","v":"2020-03-01"},{"$f":"IF(B14=\"\",\"\",IFERROR(IF(ISNUMBER(MATCH(B14,Варианты!$B$8:$B$17,0)),INDEX(Варианты!$H$4:$H$17,COUNTIF($B$4:B14,B14)),INDEX(Варианты!$D$4:$D$17,COUNTIF($B$4:B14,B14)))&\"\",\"\"))","v":""},null,null,null,null,null,"00:00:00"]
[null,{"$f":"IF(Варианты!$B$2=\"\",\"\",Варианты!$B$2)","v":"2020-03-01"},{"$f":"IF(B15=\"\",\"\",IFERROR(IF(ISNUMBER(MATCH(B15,Варианты!$B$8:$B$17,0)),INDEX(Варианты!$H$4:$H$17,COUNTIF($B$4:B15,B15)),INDEX(Варианты!$D$4:$D$17,COUNTIF($B$4:B15,B15)))&\"\",\"\"))","v":""},null,null,null,null,null,"00:00:00"]
[null,{"$f":"IF(Варианты!$B$2=\"\",\"\",Варианты!$B$2)","v":"2020-03-01"},{"$f":"IF(B16=\"\",\"\",IFERROR(IF(ISNUMBER(MATCH(B16,Варианты!$B$8:$B$17,0)),INDEX(Варианты!$H$4:$H$17,COUNTIF($B$4:B16,B16)),INDEX(Варианты!$D$4:$D$17,COUNTIF($B$4:B16,B16)))&\"\",\"\"))","v":""},null,null,null,null,null,"00:00:00"]
[null,{"$f":"IF(Варианты!$B$2=\"\",\"\",Варианты!$B$2)","v":"2020-03-01"},{"$f":"IF(B17=\"\",\"\",IFERROR(IF(ISNUMBER(MATCH(B17,Варианты!$B$8:$B$17,0)),INDEX(Варианты!$H$4:$H$17,COUNTIF($B$4:B17,B17)),INDEX(Варианты!$D$4:$D$17,COUNTIF($B$4:B17,B17)))&\"\",\"\"))","v":""},null,null,null,null,null,"00:00:00"]
[null,{"$f":"IF(ISERR(B4+1),\"\",IF(B4+1<=EOMONTH(Варианты!$B$2,0),B4+1,\"\"))","v":"2020-03-02"},{"$f":"IF(B18=\"\",\"\",IFERROR(IF(ISNUMBER(MATCH(B18,Варианты!$B$8:$B$17,0)),INDEX(Варианты!$H$4:$H$17,COUNTIF($B$4:B18,B18)),INDEX(Варианты!$D$4:$D$17,COUNTIF($B$4:B18,B18)))&\"\",\"\"))","v":"1"},null,null,null,null,null,"00:00:00"]
[null,{"$f":"IF(ISERR(B5+1),\"\",IF(B5+1<=EOMONTH(Варианты!$B$2,0),B5+1,\"\"))","v":"2020-03-02"},{"$f":"IF(B19=\"\",\"\",IFERROR(IF(ISNUMBER(MATCH(B19,Варианты!$B$8:$B$17,0)),INDEX(Варианты!$H$4:$H$17,COUNTIF($B$4:B19,B19)),INDEX(Варианты!$D$4:$D$17,COUNTIF($B$4:B19,B19)))&\"\",\"\"))","v":"2"},null,null,null,null,null,"00:00:00"]
[null,{"$f":"IF(ISERR(B6+1),\"\",IF(B6+1<=EOMONTH(Варианты!$B$2,0),B6+1,\"\"))","v":"2020-03-02"},{"$f":"IF(B20=\"\",\"\",IFERROR(IF(ISNUMBER(MATCH(B20,Варианты!$B$8:$B$17,0)),INDEX(Варианты!$H$4:$H$17,COUNTIF($B$4:B20,B20)),INDEX(Варианты!$D$4:$D$17,COUNTIF($B$4:B20,B20)))&\"\",\"\"))","v":"3"},null,null,null,null,null,"00:00:00"]
[null,{"$f":"IF(ISERR(B7+1),\"\",IF(B7+1<=EOMONTH(Варианты!$B$2,0),B7+1,\"\"))","v":"2020-03-02"},{"$f":"IF(B21=\"\",\"\",IFERROR(IF(ISNUMBER(MATCH(B21,Варианты!$B$8:$B$17,0)),INDEX(Варианты!$H$4:$H$17,COUNTIF($B$4:B21,B21)),INDEX(Варианты!$D$4:$D$17,COUNTIF($B$4:B21,B21)))&\"\",\"\"))","v":"4"},null,null,null,null,null,"00:00:00"]
[null,{"$f":"IF(ISERR(B8+1),\"\",IF(B8+1<=EOMONTH(Варианты!$B$2,0),B8+1,\"\"))","v":"2020-03-02"},{"$f":"IF(B22=\"\",\"\",IFERROR(IF(ISNUMBER(MATCH(B22,Варианты!$B$8:$B$17,0)),INDEX(Варианты!$H$4:$H$17,COUNTIF($B$4:B22,B22)),INDEX(Варианты!$D$4:$D$17,COUNTIF($B$4:B22,B22)))&\"\",\"\"))","v":"5"},null,null,null,null,null,"00:00:00"]
[null,{"$f":"IF(ISERR(B9+1),\"\",IF(B9+1<=EOMONTH(Варианты!$B$2,0),B9+1,\"\"))","v":"2020-03-02"},{"$f":"IF(B23=\"\",\"\",IFERROR(IF(ISNUMBER(MATCH(B23,Варианты!$B$8:$B$17,0)),INDEX(Варианты!$H$4:$H$17,COUNTIF($B$4:B23,B23)),INDEX(Варианты!$D$4:$D$17,COUNTIF($B$4:B23,B23)))&\"\",\"\"))","v":"6"},null,null,null,null,null,"00:00:00"]
[null,{"$f":"IF(ISERR(B10+1),\"\",IF(B10+1<=EOMONTH(Варианты!$B$2,0),B10+1,\"\"))","v":"2020-03-02"},{"$f":"IF(B24=\"\",\"\",IFERROR(IF(ISNUMBER(MATCH(B24,Варианты!$B$8:$B$17,0)),INDEX(Варианты!$H$4:$H$17,COUNTIF($B$4:B24,B24)),INDEX(Варианты!$D$4:$D$17,COUNTIF($B$4:B24,B24)))&\"\",\"\"))","v":"7"},null,null,null,null,null,"00:00:00"]
[null,{"$f":"IF(ISERR(B11+1),\"\",IF(B11+1<=EOMONTH(Варианты!$B$2,0),B11+1,\"\"))","v":"2020-03-02"},{"$f":"IF(B25=\"\",\"\",IFERROR(IF(ISNUMBER(MATCH(B25,Варианты!$B$8:$B$17,0)),INDEX(Варианты!$H$4:$H$17,COUNTIF($B$4:B25,B25)),INDEX(Варианты!$D$4:$D$17,COUNTIF($B$4:B25,B25)))&\"\",\"\"))","v":"8"},null,null,null,null,null,"00:00:00"]
[null,{"$f":"IF(ISERR(B12+1),\"\",IF(B12+1<=EOMONTH(Варианты!$B$2,0),B12+1,\"\"))","v":"2020-03-02"},{"$f":"IF(B26=\"\",\"\",IFERROR(IF(ISNUMBER(MATCH(B26,Варианты!$B$8:$B$17,0)),INDEX(Варианты!$H$4:$H$17,COUNTIF($B$4:B26,B26)),INDEX(Варианты!$D$4:$D$17,COUNTIF($B$4:B26,B26)))&\"\",\"\"))","v":"9"},null,null,null,null,null,"00:00:00"]
[null,{"$f":"IF(ISERR(B13+1),\"\",IF(B13+1<=EOMONTH(Варианты!$B$2,0),B13+1,\"\"))","v":"2020-03-02"},{"$f":"IF(B27=\"\",\"\",IFERROR(IF(ISNUMBER(MATCH(B27,Варианты!$B$8:$B$17,0)),INDEX(Варианты!$H$4:$H$17,COUNTIF($B$4:B27,B27)),INDEX(Варианты!$D$4:$D$17,COUNTIF($B$4:B27,B27)))&\"\",\"\"))","v":"10"},null,null,null,null,null,"00:00:00"]
[null,{"$f":"IF(ISERR(B14+1),\"\",IF(B14+1<=EOMONTH(Варианты!$B$2,0),B14+1,\"\"))","v":"2020-03-02"},{"$f":"IF(B28=\"\",\"\",IFERROR(IF(ISNUMBER(MATCH(B28,Варианты!$B$8:$B$17,0)),INDEX(Варианты!$H$4:$H$17,COUNTIF($B$4:B28,B28)),INDEX(Варианты!$D$4:$D$17,COUNTIF($B$4:B28,B28)))&\"\",\"\"))","v":"11"},null,null,null,null,null,"00:00:00"]
[null,{"$f":"IF(ISERR(B15+1),\"\",IF(B15+1<=EOMONTH(Варианты!$B$2,0),B15+1,\"\"))","v":"2020-03-02"},{"$f":"IF(B29=\"\",\"\",IFERROR(IF(ISNUMBER(MATCH(B29,Варианты!$B$8:$B$17,0)),INDEX(Варианты!$H$4:$H$17,COUNTIF($B$4:B29,B29)),INDEX(Варианты!$D$4:$D$17,COUNTIF($B$4:B29,B29)))&\"\",\"\"))","v":"12"},null,null,null,null,null,"00:00:00"]
[null,{"$f":"IF(ISERR(B16+1),\"\",IF(B16+1<=EOMONTH(Варианты!$B$2,0),B16+1,\"\"))","v":"2020-03-02"},{"$f":"IF(B30=\"\",\"\",IFERROR(IF(ISNUMBER(MATCH(B30,Варианты!$B$8:$B$17,0)),INDEX(Варианты!$H$4:$H$17,COUNTIF($B$4:B30,B30)),INDEX(Варианты!$D$4:$D$17,COUNTIF($B$4:B30,B30)))&\"\",\"\"))","v":"13"},null,null,null,null,null,"00:00:00"]
[null,{"$f":"IF(ISERR(B17+1),\"\",IF(B17+1<=EOMONTH(Варианты!$B$2,0),B17+1,\"\"))","v":"2020-03-02"},{"$f":"IF(B31=\"\",\"\",IFERROR(IF(ISNUMBER(MATCH(B31,Варианты!$B$8:$B$17,0)),INDEX(Варианты!$H$4:$H$17,COUNTIF($B$4:B31,B31)),INDEX(Варианты!$D$4:$D$17,COUNTIF($B$4:B31,B31)))&\"\",\"\"))","v":"14"},null,null,null,null,null,"00:00:00"]
[null,{"$f":"IF(ISERR(B18+1),\"\",IF(B18+1<=EOMONTH(Варианты!$B$2,0),B18+1,\"\"))","v":"2020-03-03"},{"$f":"IF(B32=\"\",\"\",IFERROR(IF(ISNUMBER(MATCH(B32,Варианты!$B$8:$B$17,0)),INDEX(Варианты!$H$4:$H$17,COUNTIF($B$4:B32,B32)),INDEX(Варианты!$D$4:$D$17,COUNTIF($B$4:B32,B32)))&\"\",\"\"))","v":"1"},null,null,null,null,null,"00:00:00"]
[null,{"$f":"IF(ISERR(B19+1),\"\",IF(B19+1<=EOMONTH(Варианты!$B$2,0),B19+1,\"\"))","v":"2020-03-03"},{"$f":"IF(B33=\"\",\"\",IFERROR(IF(ISNUMBER(MATCH(B33,Варианты!$B$8:$B$17,0)),INDEX(Варианты!$H$4:$H$17,COUNTIF($B$4:B33,B33)),INDEX(Варианты!$D$4:$D$17,COUNTIF($B$4:B33,B33)))&\"\",\"\"))","v":"2"},null,null,null,null,null,"00:00:00"]
[null,{"$f":"IF(ISERR(B20+1),\"\",IF(B20+1<=EOMONTH(Варианты!$B$2,0),B20+1,\"\"))","v":"2020-03-03"},{"$f":"IF(B34=\"\",\"\",IFERROR(IF(ISNUMBER(MATCH(B34,Варианты!$B$8:$B$17,0)),INDEX(Варианты!$H$4:$H$17,COUNTIF($B$4:B34,B34)),INDEX(Варианты!$D$4:$D$17,COUNTIF($B$4:B34,B34)))&\"\",\"\"))","v":"3"},null,null,null,null,null,"00:00:00"]
[null,{"$f":"IF(ISERR(B21+1),\"\",IF(B21+1<=EOMONTH(Варианты!$B$2,0),B21+1,\"\"))","v":"2020-03-03"},{"$f":"IF(B35=\"\",\"\",IFERROR(IF(ISNUMBER(MATCH(B35,Варианты!$B$8:$B$17,0)),INDEX(Варианты!$H$4:$H$17,COUNTIF($B$4:B35,B35)),INDEX(Варианты!$D$4:$D$17,COUNTIF($B$4:B35,B35)))&\"\",\"\"))","v":"4"},null,null,null,null,null,"00:00:00"]
[null,{"$f":"IF(ISERR(B22+1),\"\",IF(B22+1<=EOMONTH(Варианты!$B$2,0),B22+1,\"\"))","v":"2020-03-03"},{"$f":"IF(B36=\"\",\"\",IFERROR(IF(ISNUMBER(MATCH(B36,Варианты!$B$8:$B$17,0)),INDEX(Варианты!$H$4:$H$17,COUNTIF($B$4:B36,B36)),INDEX(Варианты!$D$4:$D$17,COUNTIF($B$4:B36,B36)))&\"\",\"\"))","v":"5"},null,null,null,null,null,{"$f":"IF(OR(F36=\"\",G36=\"\"),E36-D36,(E36-D36)-(G36-F36))","v":"00:00:00"}]
[null,{"$f":"IF(ISERR(B23+1),\"\",IF(B23+1<=EOMONTH(Варианты!$B$2,0),B23+1,\"\"))","v":"2020-03-03"},{"$f":"IF(B37=\"\",\"\",IFERROR(IF(ISNUMBER(MATCH(B37,Варианты!$B$8:$B$17,0)),INDEX(Варианты!$H$4:$H$17,COUNTIF($B$4:B37,B37)),INDEX(Варианты!$D$4:$D$17,COUNTIF($B$4:B37,B37)))&\"\",\"\"))","v":"6"},null,null,null,null,null,"00:00:00"]
[null,{"$f":"IF(ISERR(B24+1),\"\",IF(B24+1<=EOMONTH(Варианты!$B$2,0),B24+1,\"\"))","v":"2020-03-03"},{"$f":"IF(B38=\"\",\"\",IFERROR(IF(ISNUMBER(MATCH(B38,Варианты!$B$8:$B$17,0)),INDEX(Варианты!$H$4:$H$17,COUNTIF($B$4:B38,B38)),INDEX(Варианты!$D$4:$D$17,COUNTIF($B$4:B38,B38)))&\"\",\"\"))","v":"7"},null,null,null,null,null,"00:00:00"]
[null,{"$f":"IF(ISERR(B25+1),\"\",IF(B25+1<=EOMONTH(Варианты!$B$2,0),B25+1,\"\"))","v":"2020-03-03"},{"$f":"IF(B39=\"\",\"\",IFERROR(IF(ISNUMBER(MATCH(B39,Варианты!$B$8:$B$17,0)),INDEX(Варианты!$H$4:$H$17,COUNTIF($B$4:B39,B39)),INDEX(Варианты!$D$4:$D$17,COUNTIF($B$4:B39,B39)))&\"\",\"\"))","v":"8"},null,null,null,null,null,"00:00:00"]
[null,{"$f":"IF(ISERR(B26+1),\"\",IF(B26+1<=EOMONTH(Варианты!$B$2,0),B26+1,\"\"))","v":"2020-03-03"},{"$f":"IF(B40=\"\",\"\",IFERROR(IF(ISNUMBER(MATCH(B40,Варианты!$B$8:$B$17,0)),INDEX(Варианты!$H$4:$H$17,COUNTIF($B$4:B40,B40)),INDEX(Варианты!$D$4:$D$17,COUNTIF($B$4:B40,B40)))&\"\",\"\"))","v":"9"},null,null,null,null,null,"00:00:00"]
[null,{"$f":"IF(ISERR(B27+1),\"\",IF(B27+1<=EOMONTH(Варианты!$B$2,0),B27+1,\"\"))","v":"2020-03-03"},{"$f":"IF(B41=\"\",\"\",IFERROR(IF(ISNUMBER(MATCH(B41,Варианты!$B$8:$B$17,0)),INDEX(Варианты!$H$4:$H$17,COUNTIF($B$4:B41,B41)),INDEX(Варианты!$D$4:$D$17,COUNTIF($B$4:B41,B41)))&\"\",\"\"))","v":"10"},null,null,null,null,null,"00:00:00"]
[null,{"$f":"IF(ISERR(B28+1),\"\",IF(B28+1<=EOMONTH(Варианты!$B$2,0),B28+1,\"\"))","v":"2020-03-03"},{"$f":"IF(B42=\"\",\"\",IFERROR(IF(ISNUMBER(MATCH(B42,Варианты!$B$8:$B$17,0)),INDEX(Варианты!$H$4:$H$17,COUNTIF($B$4:B42,B42)),INDEX(Варианты!$D$4:$D$17,COUNTIF($B$4:B42,B42)))&\"\",\"\"))","v":"11"},null,null,null,null,null,"00:00:00"]
[null,{"$f":"IF(ISERR(B29+1),\"\",IF(B29+1<=EOMONTH(Варианты!$B$2,0),B29+1,\"\"))","v":"2020-03-03"},{"$f":"IF(B43=\"\",\"\",IFERROR(IF(ISNUMBER(MATCH(B43,Варианты!$B$8:$B$17,0)),INDEX(Варианты!$H$4:$H$17,COUNTIF($B$4:B43,B43)),INDEX(Варианты!$D$4:$D$17,COUNTIF($B$4:B43,B43)))&\"\",\"\"))","v":"12"},null,null,null,null,null,"00:00:00"]
[null,{"$f":"IF(ISERR(B30+1),\"\",IF(B30+1<=EOMONTH(Варианты!$B$2,0),B30+1,\"\"))","v":"2020-03-03"},{"$f":"IF(B44=\"\",\"\",IFERROR(IF(ISNUMBER(MATCH(B44,Варианты!$B$8:$B$17,0)),INDEX(Варианты!$H$4:$H$17,COUNTIF($B$4:B44,B44)),INDEX(Варианты!$D$4:$D$17,COUNTIF($B$4:B44,B44)))&\"\",\"\"))","v":"13"},null,null,null,null,null,"00:00:00"]
[null,{"$f":"IF(ISERR(B31+1),\"\",IF(B31+1<=EOMONTH(Варианты!$B$2,0),B31+1,\"\"))","v":"2020-03-03"},{"$f":"IF(B45=\"\",\"\",IFERROR(IF(ISNUMBER(MATCH(B45,Варианты!$B$8:$B$17,0)),INDEX(Варианты!$H$4:$H$17,COUNTIF($B$4:B45,B45)),INDEX(Варианты!$D$4:$D$17,COUNTIF($B$4:B45,B45)))&\"\",\"\"))","v":"14"},null,null,null,null,null,"00:00:00"]
[null,{"$f":"IF(ISERR(B32+1),\"\",IF(B32+1<=EOMONTH(Варианты!$B$2,0),B32+1,\"\"))","v":"2020-03-04"},{"$f":"IF(B46=\"\",\"\",IFERROR(IF(ISNUMBER(MATCH(B46,Варианты!$B$8:$B$17,0)),INDEX(Варианты!$H$4:$H$17,COUNTIF($B$4:B46,B46)),INDEX(Варианты!$D$4:$D$17,COUNTIF($B$4:B46,B46)))&\"\",\"\"))","v":"1"},null,null,null,null,null,"00:00:00"]
[null,{"$f":"IF(ISERR(B33+1),\"\",IF(B33+1<=EOMONTH(Варианты!$B$2,0),B33+1,\"\"))","v":"2020-03-04"},{"$f":"IF(B47=\"\",\"\",IFERROR(IF(ISNUMBER(MATCH(B47,Варианты!$B$8:$B$17,0)),INDEX(Варианты!$H$4:$H$17,COUNTIF($B$4:B47,B47)),INDEX(Варианты!$D$4:$D$17,COUNTIF($B$4:B47,B47)))&\"\",\"\"))","v":"2"},null,null,null,null,null,"00:00:00"]
[null,{"$f":"IF(ISERR(B34+1),\"\",IF(B34+1<=EOMONTH(Варианты!$B$2,0),B34+1,\"\"))","v":"2020-03-04"},{"$f":"IF(B48=\"\",\"\",IFERROR(IF(ISNUMBER(MATCH(B48,Варианты!$B$8:$B$17,0)),INDEX(Варианты!$H$4:$H$17,COUNTIF($B$4:B48,B48)),INDEX(Варианты!$D$4:$D$17,COUNTIF($B$4:B48,B48)))&\"\",\"\"))","v":"3"},null,null,null,null,null,"00:00:00"]
[null,{"$f":"IF(ISERR(B35+1),\"\",IF(B35+1<=EOMONTH(Варианты!$B$2,0),B35+1,\"\"))","v":"2020-03-04"},{"$f":"IF(B49=\"\",\"\",IFERROR(IF(ISNUMBER(MATCH(B49,Варианты!$B$8:$B$17,0)),INDEX(Варианты!$H$4:$H$17,COUNTIF($B$4:B49,B49)),INDEX(Варианты!$D$4:$D$17,COUNTIF($B$4:B49,B49)))&\"\",\"\"))","v":"4"},null,null,null,null,null,"00:00:00"]
[null,{"$f":"IF(ISERR(B36+1),\"\",IF(B36+1<=EOMONTH(Варианты!$B$2,0),B36+1,\"\"))","v":"2020-03-04"},{"$f":"IF(B50=\"\",\"\",IFERROR(IF(ISNUMBER(MATCH(B50,Варианты!$B$8:$B$17,0)),INDEX(Варианты!$H$4:$H$17,COUNTIF($B$4:B50,B50)),INDEX(Варианты!$D$4:$D$17,COUNTIF($B$4:B50,B50)))&\"\",\"\"))","v":"5"},null,null,null,null,null,"00:00:00"]
[null,{"$f":"IF(ISERR(B37+1),\"\",IF(B37+1<=EOMONTH(Варианты!$B$2,0),B37+1,\"\"))","v":"2020-03-04"},{"$f":"IF(B51=\"\",\"\",IFERROR(IF(ISNUMBER(MATCH(B51,Варианты!$B$8:$B$17,0)),INDEX(Варианты!$H$4:$H$17,COUNTIF($B$4:B51,B51)),INDEX(Варианты!$D$4:$D$17,COUNTIF($B$4:B51,B51)))&\"\",\"\"))","v":"6"},null,null,null,null,null,"00:00:00"]
[null,{"$f":"IF(ISERR(B38+1),\"\",IF(B38+1<=EOMONTH(Варианты!$B$2,0),B38+1,\"\"))","v":"2020-03-04"},{"$f":"IF(B52=\"\",\"\",IFERROR(IF(ISNUMBER(MATCH(B52,Варианты!$B$8:$B$17,0)),INDEX(Варианты!$H$4:$H$17,COUNTIF($B$4:B52,B52)),INDEX(Варианты!$D$4:$D$17,COUNTIF($B$4:B52,B52)))&\"\",\"\"))","v":"7"},null,null,null,null,null,"00:00:00"]
[null,{"$f":"IF(ISERR(B39+1),\"\",IF(B39+1<=EOMONTH(Варианты!$B$2,0),B39+1,\"\"))","v":"2020-03-04"},{"$f":"IF(B53=\"\",\"\",IFERROR(IF(ISNUMBER(MATCH(B53,Варианты!$B$8:$B$17,0)),INDEX(Варианты!$H$4:$H$17,COUNTIF($B$4:B53,B53)),INDEX(Варианты!$D$4:$D$17,COUNTIF($B$4:B53,B53)))&\"\",\"\"))","v":"8"},null,null,null,null,null,"00:00:00"]
[null,{"$f":"IF(ISERR(B40+1),\"\",IF(B40+1<=EOMONTH(Варианты!$B$2,0),B40+1,\"\"))","v":"2020-03-04"},{"$f":"IF(B54=\"\",\"\",IFERROR(IF(ISNUMBER(MATCH(B54,Варианты!$B$8:$B$17,0)),INDEX(Варианты!$H$4:$H$17,COUNTIF($B$4:B54,B54)),INDEX(Варианты!$D$4:$D$17,COUNTIF($B$4:B54,B54)))&\"\",\"\"))","v":"9"},null,null,null,null,null,"00:00:00"]
[null,{"$f":"IF(ISERR(B41+1),\"\",IF(B41+1<=EOMONTH(Варианты!$B$2,0),B41+1,\"\"))","v":"2020-03-04"},{"$f":"IF(B55=\"\",\"\",IFERROR(IF(ISNUMBER(MATCH(B55,Варианты!$B$8:$B$17,0)),INDEX(Варианты!$H$4:$H$17,COUNTIF($B$4:B55,B55)),INDEX(Варианты!$D$4:$D$17,COUNTIF($B$4:B55,B55)))&\"\",\"\"))","v":"10"},null,null,null,null,null,"00:00:00"]
[null,{"$f":"IF(ISERR(B42+1),\"\",IF(B42+1<=EOMONTH(Варианты!$B$2,0),B42+1,\"\"))","v":"2020-03-04"},{"$f":"IF(B56=\"\",\"\",IFERROR(IF(ISNUMBER(MATCH(B56,Варианты!$B$8:$B$17,0)),INDEX(Варианты!$H$4:$H$17,COUNTIF($B$4:B56,B56)),INDEX(Варианты!$D$4:$D$17,COUNTIF($B$4:B56,B56)))&\"\",\"\"))","v":"11"},null,null,null,null,null,"00:00:00"]
[null,{"$f":"IF(ISERR(B43+1),\"\",IF(B43+1<=EOMONTH(Варианты!$B$2,0),B43+1,\"\"))","v":"2020-03-04"},{"$f":"IF(B57=\"\",\"\",IFERROR(IF(ISNUMBER(MATCH(B57,Варианты!$B$8:$B$17,0)),INDEX(Варианты!$H$4:$H$17,COUNTIF($B$4:B57,B57)),INDEX(Варианты!$D$4:$D$17,COUNTIF($B$4:B57,B57)))&\"\",\"\"))","v":"12"},null,null,null,null,null,"00:00:00"]
[null,{"$f":"IF(ISERR(B44+1),\"\",IF(B44+1<=EOMONTH(Варианты!$B$2,0),B44+1,\"\"))","v":"2020-03-04"},{"$f":"IF(B58=\"\",\"\",IFERROR(IF(ISNUMBER(MATCH(B58,Варианты!$B$8:$B$17,0)),INDEX(Варианты!$H$4:$H$17,COUNTIF($B$4:B58,B58)),INDEX(Варианты!$D$4:$D$17,COUNTIF($B$4:B58,B58)))&\"\",\"\"))","v":"13"},null,null,null,null,null,"00:00:00"]
[null,{"$f":"IF(ISERR(B45+1),\"\",IF(B45+1<=EOMONTH(Варианты!$B$2,0),B45+1,\"\"))","v":"2020-03-04"},{"$f":"IF(B59=\"\",\"\",IFERROR(IF(ISNUMBER(MATCH(B59,Варианты!$B$8:$B$17,0)),INDEX(Варианты!$H$4:$H$17,COUNTIF($B$4:B59,B59)),INDEX(Варианты!$D$4:$D$17,COUNTIF($B$4:B59,B59)))&\"\",\"\"))","v":"14"},null,null,null,null,null,"00:00:00"]
[null,{"$f":"IF(ISERR(B46+1),\"\",IF(B46+1<=EOMONTH(Варианты!$B$2,0),B46+1,\"\"))","v":"2020-03-05"},{"$f":"IF(B60=\"\",\"\",IFERROR(IF(ISNUMBER(MATCH(B60,Варианты!$B$8:$B$17,0)),INDEX(Варианты!$H$4:$H$17,COUNTIF($B$4:B60,B60)),INDEX(Варианты!$D$4:$D$17,COUNTIF($B$4:B60,B60)))&\"\",\"\"))","v":"1"},null,null,null,null,null,"00:00:00"]
{"$rows_left_out":69}