{"text_format":"1","workbook":"xlsx","n_sheets":4,"sheets":["ПДУ","ВидыГод","Доли","RCData"],"not_rendered":{"charts":2,"images":0,"macros":1,"external_links":0,"defined_names":5,"comments":1,"pivot_tables":0},"unopened":[],"bounds":{"document_bytes":16777216,"sheet_cells":100000,"rows_first":2000,"rows_last":500,"rows_between":2000,"halvings":0,"cell_chars":16384,"cell_head_chars":4096},"cells_cut":0,"cells_raw":0,"read":"whole","date_system":"1900"}

{"sheet":"ПДУ","index":0,"n_rows":0,"n_cols":0,"rows_kept":0,"cut":false,"hidden":false,"merged":[]}

{"sheet":"ВидыГод","index":1,"n_rows":109,"n_cols":9,"rows_kept":109,"cut":false,"hidden":false,"merged":[[106,0,106,1],[107,0,107,1],[108,0,108,1],[100,0,100,1],[101,0,101,1],[102,0,102,1],[103,0,103,1],[104,0,104,1],[105,0,105,1],[94,0,94,1],[95,0,95,1],[96,0,96,1],[97,0,97,1],[98,0,98,1],[99,0,99,1],[88,0,88,1],[89,0,89,1],[90,0,90,1],[91,0,91,1],[92,0,92,1],[93,0,93,1],[84,0,84,1],[85,0,85,1],[86,0,86,1],[87,0,87,1],[78,0,78,1],[79,0,79,1],[80,0,80,1],[81,0,81,1],[82,0,82,1],[83,0,83,1],[65,0,65,1],[59,0,59,1],[72,0,72,1],[73,0,73,1],[74,0,74,1],[75,0,75,1],[76,0,76,1],[77,0,77,1],[66,0,66,1],[67,0,67,1],[68,0,68,1],[69,0,69,1],[70,0,70,1],[71,0,71,1],[55,0,55,1],[56,0,56,1],[57,0,57,1],[58,0,58,1],[60,0,60,1],[61,0,61,1],[62,0,62,1],[63,0,63,1],[64,0,64,1],[49,0,49,1],[50,0,50,1],[51,0,51,1],[52,0,52,1],[53,0,53,1],[54,0,54,1],[43,0,43,1],[44,0,44,1],[45,0,45,1],[46,0,46,1],[47,0,47,1],[48,0,48,1],[40,0,40,1],[41,0,41,1],[42,0,42,1],[18,0,18,1],[19,0,19,1],[20,0,20,1],[21,0,21,1],[22,0,22,1],[36,0,36,1],[33,0,33,1],[34,0,34,1],[35,0,35,1],[9,0,9,1],[10,0,10,1],[11,0,11,1],[37,0,37,1],[38,0,38,1],[39,0,39,1],[5,0,5,7],[6,0,6,1],[7,0,7,1],[27,0,27,1],[28,0,28,1],[29,0,29,1],[30,0,30,1],[31,0,31,1],[32,0,32,1],[8,0,8,1],[23,0,23,1],[24,0,24,1],[25,0,25,1],[26,0,26,1],[12,0,12,1],[13,0,13,1],[14,0,14,1],[15,0,15,1],[16,0,16,1],[17,0,17,1]]}
[]
[]
[]
[]
[]
[]
[]
[]
["Пожарное оборудование",null,null,244,83185,127438.73,44253.73,"53.199%",{"$f":"IF(ISERR(--(\"1 \"&A9)),MAX($I$8:I8)+1,I8)","v":1}]
["Огнетушители",null," ",116,54377,82338.25,27961.25,"51.421%",{"$f":"IF(ISERR(--(\"1 \"&A10)),MAX($I$8:I9)+1,I9)","v":2}]
["  Февраль 19",null," ",15,12536,20782.189999999999,8246.19,"65.780%",{"$f":"IF(ISERR(--(\"1 \"&A11)),MAX($I$8:I10)+1,I10)","v":2}]
["  Март 19",null," ",10,4732,6598.35,1866.35,"39.441%",{"$f":"IF(ISERR(--(\"1 \"&A12)),MAX($I$8:I11)+1,I11)","v":2}]
["  Апрель 19",null," ",10,5133,7038.21,1905.21,"37.117%",{"$f":"IF(ISERR(--(\"1 \"&A13)),MAX($I$8:I12)+1,I12)","v":2}]
["  Май 19",null," ",9,3371,4905.6099999999997,1534.61,"45.524%",{"$f":"IF(ISERR(--(\"1 \"&A14)),MAX($I$8:I13)+1,I13)","v":2}]
["  Июнь 19",null," ",6,2273,3339.84,1066.8399999999999,"46.935%",{"$f":"IF(ISERR(--(\"1 \"&A15)),MAX($I$8:I14)+1,I14)","v":2}]
["  Июль 19",null," ",10,3846,5508,1662,"43.214%",{"$f":"IF(ISERR(--(\"1 \"&A16)),MAX($I$8:I15)+1,I15)","v":2}]
["  Август 19",null," ",23,8824,12786.46,3962.46,"44.905%",{"$f":"IF(ISERR(--(\"1 \"&A17)),MAX($I$8:I16)+1,I16)","v":2}]
["  Сентябрь 19",null," ",5,1959,3001.98,1042.98,"53.240%",{"$f":"IF(ISERR(--(\"1 \"&A18)),MAX($I$8:I17)+1,I17)","v":2}]
["  Октябрь 19",null," ",2,1117,1768.13,651.13,"58.293%",{"$f":"IF(ISERR(--(\"1 \"&A19)),MAX($I$8:I18)+1,I18)","v":2}]
["  Ноябрь 19",null," ",9,3582,5460.65,1878.65,"52.447%",{"$f":"IF(ISERR(--(\"1 \"&A20)),MAX($I$8:I19)+1,I19)","v":2}]
["  Декабрь 19",null," ",12,5139,8164.89,3025.89,"58.881%",{"$f":"IF(ISERR(--(\"1 \"&A21)),MAX($I$8:I20)+1,I20)","v":2}]
["  Январь 20",null," ",3,1239,2048.1,809.1,"65.303%",{"$f":"IF(ISERR(--(\"1 \"&A22)),MAX($I$8:I21)+1,I21)","v":2}]
["  Февраль 20",null," ",2,626,935.84,309.83999999999997,"49.495%",{"$f":"IF(ISERR(--(\"1 \"&A23)),MAX($I$8:I22)+1,I22)","v":2}]
["Клапаны и вентили пожарные",null," ",5,2704,3639.03,935.03,"34.580%",{"$f":"IF(ISERR(--(\"1 \"&A24)),MAX($I$8:I23)+1,I23)","v":3}]
["  Май 19",null," ",3,1764,2227.1999999999998,463.2,"26.259%",{"$f":"IF(ISERR(--(\"1 \"&A25)),MAX($I$8:I24)+1,I24)","v":3}]
["  Ноябрь 19",null," ",2,940,1411.83,471.83,"50.195%",{"$f":"IF(ISERR(--(\"1 \"&A26)),MAX($I$8:I25)+1,I25)","v":3}]
["Муфты противопожарные",null," ",1,151.69999999999999,245.67,93.97,"61.945%",{"$f":"IF(ISERR(--(\"1 \"&A27)),MAX($I$8:I26)+1,I26)","v":4}]
["  Май 19",null," ",1,151.69999999999999,245.67,93.97,"61.945%",{"$f":"IF(ISERR(--(\"1 \"&A28)),MAX($I$8:I27)+1,I27)","v":4}]
["Наклейки и плакаты",null," ",42,827.3,2399.38,1572.08,"190.025%",{"$f":"IF(ISERR(--(\"1 \"&A29)),MAX($I$8:I28)+1,I28)","v":5}]
["  Февраль 19",null," ",1,20,45,25,"125.000%",{"$f":"IF(ISERR(--(\"1 \"&A30)),MAX($I$8:I29)+1,I29)","v":5}]
["  Май 19",null," ",21,378,1289,911,"241.005%",{"$f":"IF(ISERR(--(\"1 \"&A31)),MAX($I$8:I30)+1,I30)","v":5}]
["  Июль 19",null," ",5,110,339,229,"208.182%",{"$f":"IF(ISERR(--(\"1 \"&A32)),MAX($I$8:I31)+1,I31)","v":5}]
["  Август 19",null," ",1,14,58.64,44.64,"318.857%",{"$f":"IF(ISERR(--(\"1 \"&A33)),MAX($I$8:I32)+1,I32)","v":5}]
["  Сентябрь 19",null," ",7,169.3,267.88,98.58,"58.228%",{"$f":"IF(ISERR(--(\"1 \"&A34)),MAX($I$8:I33)+1,I33)","v":5}]
["  Октябрь 19",null," ",5,96,302.20999999999998,206.21,"214.802%",{"$f":"IF(ISERR(--(\"1 \"&A35)),MAX($I$8:I34)+1,I34)","v":5}]
["  Февраль 20",null," ",2,40,97.65,57.65,"144.125%",{"$f":"IF(ISERR(--(\"1 \"&A36)),MAX($I$8:I35)+1,I35)","v":5}]
["Рукава и комплектующие",null," ",30,15040,22894.02,7854.02,"52.221%",{"$f":"IF(ISERR(--(\"1 \"&A37)),MAX($I$8:I36)+1,I36)","v":6}]
["  Март 19",null," ",9,6265,9359.2800000000007,3094.28,"49.390%",{"$f":"IF(ISERR(--(\"1 \"&A38)),MAX($I$8:I37)+1,I37)","v":6}]
["  Апрель 19",null," ",1,120,189.72,69.72,"58.100%",{"$f":"IF(ISERR(--(\"1 \"&A39)),MAX($I$8:I38)+1,I38)","v":6}]
["  Май 19",null," ",3,189,266.39999999999998,77.400000000000006,"40.952%",{"$f":"IF(ISERR(--(\"1 \"&A40)),MAX($I$8:I39)+1,I39)","v":6}]
["  Июнь 19",null," ",1,795,1343.85,548.85,"69.038%",{"$f":"IF(ISERR(--(\"1 \"&A41)),MAX($I$8:I40)+1,I40)","v":6}]
["  Август 19",null," ",1,75,98,23,"30.667%",{"$f":"IF(ISERR(--(\"1 \"&A42)),MAX($I$8:I41)+1,I41)","v":6}]
["  Октябрь 19",null," ",12,5782,8799.65,3017.65,"52.190%",{"$f":"IF(ISERR(--(\"1 \"&A43)),MAX($I$8:I42)+1,I42)","v":6}]
["  Декабрь 19",null," ",1,847,1303.55,456.55,"53.902%",{"$f":"IF(ISERR(--(\"1 \"&A44)),MAX($I$8:I43)+1,I43)","v":6}]
["  Январь 20",null," ",1,847,1343.85,496.85,"58.660%",{"$f":"IF(ISERR(--(\"1 \"&A45)),MAX($I$8:I44)+1,I44)","v":6}]
["  Февраль 20",null," ",1,120,189.72,69.72,"58.100%",{"$f":"IF(ISERR(--(\"1 \"&A46)),MAX($I$8:I45)+1,I45)","v":6}]
["Шкафы пожарные",null," ",50,10085,15922.38,5837.38,"57.882%",{"$f":"IF(ISERR(--(\"1 \"&A47)),MAX($I$8:I46)+1,I46)","v":7}]
["  Февраль 19",null," ",4,280,380.8,100.8,"36.000%",{"$f":"IF(ISERR(--(\"1 \"&A48)),MAX($I$8:I47)+1,I47)","v":7}]
["  Март 19",null," ",1,175,209,34,"19.429%",{"$f":"IF(ISERR(--(\"1 \"&A49)),MAX($I$8:I48)+1,I48)","v":7}]
["  Апрель 19",null," ",4,710,1119.51,409.51,"57.677%",{"$f":"IF(ISERR(--(\"1 \"&A50)),MAX($I$8:I49)+1,I49)","v":7}]
["  Май 19",null," ",8,1950,3284.4,1334.4,"68.431%",{"$f":"IF(ISERR(--(\"1 \"&A51)),MAX($I$8:I50)+1,I50)","v":7}]
["  Июль 19",null," ",4,2560,3200.12,640.12,"25.005%",{"$f":"IF(ISERR(--(\"1 \"&A52)),MAX($I$8:I51)+1,I51)","v":7}]
["  Август 19",null," ",14,1405,1899.75,494.75,"35.214%",{"$f":"IF(ISERR(--(\"1 \"&A53)),MAX($I$8:I52)+1,I52)","v":7}]
["  Сентябрь 19",null," ",3,570,1092.42,522.41999999999996,"91.653%",{"$f":"IF(ISERR(--(\"1 \"&A54)),MAX($I$8:I53)+1,I53)","v":7}]
["  Октябрь 19",null," ",1,85,130.80000000000001,45.8,"53.882%",{"$f":"IF(ISERR(--(\"1 \"&A55)),MAX($I$8:I54)+1,I54)","v":7}]
["  Ноябрь 19",null," ",5,1250,2528.75,1278.75,"102.300%",{"$f":"IF(ISERR(--(\"1 \"&A56)),MAX($I$8:I55)+1,I55)","v":7}]
["  Декабрь 19",null," ",1,240,398.73,158.72999999999999,"66.138%",{"$f":"IF(ISERR(--(\"1 \"&A57)),MAX($I$8:I56)+1,I56)","v":7}]
["  Январь 20",null," ",2,500,1106.7,606.70000000000005,"121.340%",{"$f":"IF(ISERR(--(\"1 \"&A58)),MAX($I$8:I57)+1,I57)","v":7}]
["  Февраль 20",null," ",3,360,571.4,211.4,"58.722%",{"$f":"IF(ISERR(--(\"1 \"&A59)),MAX($I$8:I58)+1,I58)","v":7}]
["Смесители",null,null,17241,14192564.77,23315221,9122656.2300000004,"64.278%",{"$f":"IF(ISERR(--(\"1 \"&A60)),MAX($I$8:I59)+1,I59)","v":8}]
["Душевая программа",null," ",357,1347400.71,2088132.55,740731.84,"54.975%",{"$f":"IF(ISERR(--(\"1 \"&A61)),MAX($I$8:I60)+1,I60)","v":9}]
["  Февраль 19",null," ",34,152621.32999999999,247516.09,94894.76,"62.177%",{"$f":"IF(ISERR(--(\"1 \"&A62)),MAX($I$8:I61)+1,I61)","v":9}]
["  Март 19",null," ",38,184795.95,271881.08,87085.13,"47.125%",{"$f":"IF(ISERR(--(\"1 \"&A63)),MAX($I$8:I62)+1,I62)","v":9}]
["  Апрель 19",null," ",30,71241.740000000005,112038.52,40796.78,"57.265%",{"$f":"IF(ISERR(--(\"1 \"&A64)),MAX($I$8:I63)+1,I63)","v":9}]
["  Май 19",null," ",18,50600.959999999999,77819.149999999994,27218.19,"53.790%",{"$f":"IF(ISERR(--(\"1 \"&A65)),MAX($I$8:I64)+1,I64)","v":9}]
["  Июнь 19",null," ",40,163258.88,241308.28,78049.399999999994,"47.807%",{"$f":"IF(ISERR(--(\"1 \"&A66)),MAX($I$8:I65)+1,I65)","v":9}]
["  Июль 19",null," ",32,148112.88,211382,63269.120000000003,"42.717%",{"$f":"IF(ISERR(--(\"1 \"&A67)),MAX($I$8:I66)+1,I66)","v":9}]
["  Август 19",null," ",28,84920.8,131406.32,46485.52,"54.740%",{"$f":"IF(ISERR(--(\"1 \"&A68)),MAX($I$8:I67)+1,I67)","v":9}]
["  Сентябрь 19",null," ",23,82433.440000000002,127383.21,44949.77,"54.529%",{"$f":"IF(ISERR(--(\"1 \"&A69)),MAX($I$8:I68)+1,I68)","v":9}]
["  Октябрь 19",null," ",19,100051.86,147779.15,47727.29,"47.703%",{"$f":"IF(ISERR(--(\"1 \"&A70)),MAX($I$8:I69)+1,I69)","v":9}]
["  Ноябрь 19",null," ",27,94834.63,164211.71,69377.08,"73.156%",{"$f":"IF(ISERR(--(\"1 \"&A71)),MAX($I$8:I70)+1,I70)","v":9}]
["  Декабрь 19",null," ",25,73152.36,130989.73,57837.37,"79.064%",{"$f":"IF(ISERR(--(\"1 \"&A72)),MAX($I$8:I71)+1,I71)","v":9}]
["  Январь 20",null," ",21,80265.100000000006,129447.82,49182.720000000001,"61.275%",{"$f":"IF(ISERR(--(\"1 \"&A73)),MAX($I$8:I72)+1,I72)","v":9}]
["  Февраль 20",null," ",22,61110.78,94969.49,33858.71,"55.405%",{"$f":"IF(ISERR(--(\"1 \"&A74)),MAX($I$8:I73)+1,I73)","v":9}]
["Комплектующие к смесителям",null," ",4246,480150.52,970860.09,490709.57,"102.199%",{"$f":"IF(ISERR(--(\"1 \"&A75)),MAX($I$8:I74)+1,I74)","v":10}]
["  Февраль 19",null," ",345,40199.17,77070.52,36871.35,"91.722%",{"$f":"IF(ISERR(--(\"1 \"&A76)),MAX($I$8:I75)+1,I75)","v":10}]
["  Март 19",null," ",298,33701.599999999999,69798.58,36096.980000000003,"107.108%",{"$f":"IF(ISERR(--(\"1 \"&A77)),MAX($I$8:I76)+1,I76)","v":10}]
["  Апрель 19",null," ",290,31625.98,65467.16,33841.18,"107.004%",{"$f":"IF(ISERR(--(\"1 \"&A78)),MAX($I$8:I77)+1,I77)","v":10}]
["  Май 19",null," ",309,38148.050000000003,77885.649999999994,39737.599999999999,"104.167%",{"$f":"IF(ISERR(--(\"1 \"&A79)),MAX($I$8:I78)+1,I78)","v":10}]
["  Июнь 19",null," ",307,35941.32,70786.679999999993,34845.360000000001,"96.951%",{"$f":"IF(ISERR(--(\"1 \"&A80)),MAX($I$8:I79)+1,I79)","v":10}]
{"$rows_left_out":30}
{"sheet":"Доли","index":2,"n_rows":16,"n_cols":6,"rows_kept":16,"cut":false,"hidden":true,"merged":[]}
[null,"ОМ","ОМПГ",null,"Доля ОМ","Доля ОМПГ"]
["Котельное оборудование",{"$f":"VLOOKUP($A$2:$A$11,#REF!,3,FALSE)","v":{"$error":"#REF!"}},{"$f":"VLOOKUP($A$2:$A$11,#REF!,5,FALSE)","v":{"$error":"#REF!"}},null,{"$f":"B2/$B$16","v":{"$error":"#REF!"}},{"$f":"C2/$C$16","v":{"$error":"#REF!"}}]
["Водонагреватели и бойлеры",{"$f":"VLOOKUP($A$2:$A$11,#REF!,3,FALSE)","v":{"$error":"#REF!"}},{"$f":"VLOOKUP($A$2:$A$11,#REF!,5,FALSE)","v":{"$error":"#REF!"}},null,{"$f":"B3/$B$16","v":{"$error":"#REF!"}},{"$f":"C3/$C$16","v":{"$error":"#REF!"}}]
["Смесители",{"$f":"VLOOKUP($A$2:$A$11,#REF!,3,FALSE)","v":{"$error":"#REF!"}},{"$f":"VLOOKUP($A$2:$A$11,#REF!,5,FALSE)","v":{"$error":"#REF!"}},null,{"$error":"#REF!"},{"$error":"#REF!"}]
["Полотенцесушители",{"$f":"VLOOKUP($A$2:$A$11,#REF!,3,FALSE)","v":{"$error":"#REF!"}},{"$f":"VLOOKUP($A$2:$A$11,#REF!,5,FALSE)","v":{"$error":"#REF!"}},null,{"$error":"#REF!"},{"$error":"#REF!"}]
["Водоочистка",{"$f":"VLOOKUP($A$2:$A$11,#REF!,3,FALSE)","v":{"$error":"#REF!"}},{"$f":"VLOOKUP($A$2:$A$11,#REF!,5,FALSE)","v":{"$error":"#REF!"}},null,{"$error":"#REF!"},{"$error":"#REF!"}]
["Вентиляция и лючки под плитку",{"$f":"VLOOKUP($A$2:$A$11,#REF!,3,FALSE)","v":{"$error":"#REF!"}},{"$f":"VLOOKUP($A$2:$A$11,#REF!,5,FALSE)","v":{"$error":"#REF!"}},null,{"$error":"#REF!"},{"$error":"#REF!"}]
["Трубы и фитинги PPRS",{"$f":"VLOOKUP($A$2:$A$11,#REF!,3,FALSE)","v":{"$error":"#REF!"}},{"$f":"VLOOKUP($A$2:$A$11,#REF!,5,FALSE)","v":{"$error":"#REF!"}},null,{"$error":"#REF!"},{"$error":"#REF!"}]
["Насосное оборудование",{"$f":"VLOOKUP($A$2:$A$11,#REF!,3,FALSE)","v":{"$error":"#REF!"}},{"$f":"VLOOKUP($A$2:$A$11,#REF!,5,FALSE)","v":{"$error":"#REF!"}},null,{"$error":"#REF!"},{"$error":"#REF!"}]
["Отопительное оборудование",{"$f":"VLOOKUP($A$2:$A$11,#REF!,3,FALSE)","v":{"$error":"#REF!"}},{"$f":"VLOOKUP($A$2:$A$11,#REF!,5,FALSE)","v":{"$error":"#REF!"}},null,{"$error":"#REF!"},{"$error":"#REF!"}]
["Теплый пол",{"$f":"VLOOKUP($A$2:$A$11,#REF!,3,FALSE)","v":{"$error":"#REF!"}},{"$f":"VLOOKUP($A$2:$A$11,#REF!,5,FALSE)","v":{"$error":"#REF!"}},null,{"$error":"#REF!"},{"$error":"#REF!"}]
[]
[]
["Водоснабжение и Водоотведение",{"$f":"VLOOKUP($A14,#REF!,6,FALSE)","v":{"$error":"#REF!"}},{"$f":"VLOOKUP($A14,#REF!,5,FALSE)","v":{"$error":"#REF!"}}]
["Сантехника",{"$f":"VLOOKUP($A15,#REF!,6,FALSE)","v":{"$error":"#REF!"}},{"$f":"VLOOKUP($A15,#REF!,5,FALSE)","v":{"$error":"#REF!"}}]
[null,{"$f":"SUM(B14:B15)","v":{"$error":"#REF!"}},{"$f":"SUM(C14:C15)","v":{"$error":"#REF!"}}]

{"sheet":"RCData","index":3,"n_rows":845,"n_cols":15,"rows_kept":845,"cut":false,"hidden":false,"merged":[[0,0,0,2]]}
[]
[]
[]
["Код","ГРУППЫ","ТАБЛИЦЫ",null,null,null,null,null,null,null,null,null,null,"Пожарное оборудование","Смесители"]
[1,null,"Таблица1",null,null,null,null,null,null,null,null,null,null,"Наклейки и плакаты","Душевая программа"]
[2,null,"Таблица2",null,null,null,null,null,null,null,null,null,null,"Огнетушители","Комплектующие к смесителям"]
[3,null,"Таблица3",null,null,null,null,null,null,null,null,null,null,"Рукава и комплектующие","Смесители встроенные"]
[4,null,"Таблица4",null,null,null,null,null,null,null,null,null,null,"Шкафы пожарные","Смесители для биде"]
[5,null,"Таблица5"]
[6,null,"Таблица6"]
[7,null,"Таблица7"]
[8,null,"Таблица8"]
[9,null,"Таблица9"]
[10,null,"Таблица10"]
[11,"Пожарное оборудование","Таблица11"]
[12,null,"Таблица12"]
[13,null,"Таблица13"]
[14,null,"Таблица14"]
[15,"Смесители","Таблица15"]
[16,null,"Таблица16"]
[17,null,"Таблица17"]
[18,null,"Таблица18"]
[19,null,"Таблица19"]
[20,null,"Таблица20"]
[]
[]
[]
[]
[]
[]
[]
[]
[]
[]
[]
[]
[]
[]
[]
[]
[]
[null,null,null,null,null,{"$f":"IFERROR(VLOOKUP(B44,#REF!,5,FALSE), \"\")","v":""},{"$f":"IFERROR(VLOOKUP(B44,#REF!,6,FALSE), \"\")","v":""}]
[null,null,null,null,"ПДУ",null,"ОМ","Доли подгрупп от группы"]
[11,{"$f":"VLOOKUP(GroupCode, GroupTable, 2, FALSE)","v":"Пожарное оборудование"},{"$f":"VLOOKUP(GroupCode, GroupTable, 3, FALSE)","v":"Таблица11"},1,{"$f":"IFERROR(INDEX(GroupName, A5, 1), \"\")","v":"Наклейки и плакаты"},{"$f":"IFERROR(VLOOKUP(E44,#REF!,5,FALSE), \"\")","v":""},{"$f":"IFERROR(VLOOKUP(E44,#REF!,6,FALSE), \"\")","v":""},{"$f":"IFERROR(F44*100/$F$42, \"\")","v":""},{"$f":"IFERROR(G44/$G$42, \"\")","v":""}]
[null,null,null,2,"Огнетушители",{"$f":"IFERROR(VLOOKUP(E45,#REF!,5,FALSE), \"\")","v":""},{"$f":"IFERROR(VLOOKUP(E45,#REF!,6,FALSE), \"\")","v":""},{"$f":"IFERROR(F45*100/$F$42, \"\")","v":""},{"$f":"IFERROR(G45/$G$42, \"\")","v":""}]
[1,{"$f":"INDEX(GroupName,A46,1)","v":"Наклейки и плакаты"},null,3,"Рукава и комплектующие",{"$f":"IFERROR(VLOOKUP(E46,#REF!,5,FALSE), \"\")","v":""},{"$f":"IFERROR(VLOOKUP(E46,#REF!,6,FALSE), \"\")","v":""},"",""]
[null,null,null,4,"Шкафы пожарные",{"$f":"IFERROR(VLOOKUP(E47,#REF!,5,FALSE), \"\")","v":""},{"$f":"IFERROR(VLOOKUP(E47,#REF!,6,FALSE), \"\")","v":""},"",""]
[null,null,null,5,"",{"$f":"IFERROR(VLOOKUP(E48,#REF!,5,FALSE), \"\")","v":""},{"$f":"IFERROR(VLOOKUP(E48,#REF!,6,FALSE), \"\")","v":""},"",""]
[null,null,null,6,"",{"$f":"IFERROR(VLOOKUP(E49,#REF!,5,FALSE), \"\")","v":""},{"$f":"IFERROR(VLOOKUP(E49,#REF!,6,FALSE), \"\")","v":""},"",""]
[null,null,null,7,"",{"$f":"IFERROR(VLOOKUP(E50,#REF!,5,FALSE), \"\")","v":""},{"$f":"IFERROR(VLOOKUP(E50,#REF!,6,FALSE), \"\")","v":""},"",""]
[null,null,null,8,"",{"$f":"IFERROR(VLOOKUP(E51,#REF!,5,FALSE), \"\")","v":""},{"$f":"IFERROR(VLOOKUP(E51,#REF!,6,FALSE), \"\")","v":""},"",""]
[null,null,null,9,"",{"$f":"IFERROR(VLOOKUP(E52,#REF!,5,FALSE), \"\")","v":""},{"$f":"IFERROR(VLOOKUP(E52,#REF!,6,FALSE), \"\")","v":""},"",""]
[null,null,null,10,"",{"$f":"IFERROR(VLOOKUP(E53,#REF!,5,FALSE), \"\")","v":""},{"$f":"IFERROR(VLOOKUP(E53,#REF!,6,FALSE), \"\")","v":""},"",""]
[null,null,null,11,"",{"$f":"IFERROR(VLOOKUP(E54,#REF!,5,FALSE), \"\")","v":""},{"$f":"IFERROR(VLOOKUP(E54,#REF!,6,FALSE), \"\")","v":""},"",""]
[null,null,null,12,"",{"$f":"IFERROR(VLOOKUP(E55,#REF!,5,FALSE), \"\")","v":""},{"$f":"IFERROR(VLOOKUP(E55,#REF!,6,FALSE), \"\")","v":""},"",""]
[]
[null,null,null,null,null,"прибыль","кол-во","наценка toggle","прибыль toggle"]
[null,null,null,null,null,null,null,false,false]
[null,null,null,null,{"$f":"ВидыГод!A11","v":"  Февраль 19"},{"$f":"IFERROR(VLOOKUP(E59,INDEX(ВидыГод!A:A,MATCH($B$46,ВидыГод!$A$1:$A$209,)):INDEX(ВидыГод!I:I,MATCH($B$46,ВидыГод!$A$1:$A$209,)+COUNTIF(ВидыГод!I:I,VLOOKUP(RCData!$B$46,ВидыГод!A:I,9,0))),7,),0)","v":25},{"$f":"IFERROR(VLOOKUP(E59,INDEX(ВидыГод!A:A,MATCH($B$46,ВидыГод!$A$1:$A$209,)):INDEX(ВидыГод!I:I,MATCH($B$46,ВидыГод!$A$1:$A$209,)+COUNTIF(ВидыГод!I:I,VLOOKUP(RCData!$B$46,ВидыГод!A:I,9,0))),4,),0)","v":1},{"$f":"IF($H$58=TRUE,F59/G59,\"\")","v":""},{"$f":"IF($I$58=TRUE, F59,\"\")","v":""}]
[null,null,null,null,{"$f":"ВидыГод!A12","v":"  Март 19"},{"$f":"IFERROR(VLOOKUP(E60,INDEX(ВидыГод!A:A,MATCH($B$46,ВидыГод!$A$1:$A$209,)):INDEX(ВидыГод!I:I,MATCH($B$46,ВидыГод!$A$1:$A$209,)+COUNTIF(ВидыГод!I:I,VLOOKUP(RCData!$B$46,ВидыГод!A:I,9,0))),7,),0)","v":0},{"$f":"IFERROR(VLOOKUP(E60,INDEX(ВидыГод!A:A,MATCH($B$46,ВидыГод!$A$1:$A$209,)):INDEX(ВидыГод!I:I,MATCH($B$46,ВидыГод!$A$1:$A$209,)+COUNTIF(ВидыГод!I:I,VLOOKUP(RCData!$B$46,ВидыГод!A:I,9,0))),4,),0)","v":0},{"$f":"IF($H$58=TRUE,F60/G60,\"\")","v":""},{"$f":"IF($I$58=TRUE, F60,\"\")","v":""}]
[null,null,null,null,{"$f":"ВидыГод!A13","v":"  Апрель 19"},{"$f":"IFERROR(VLOOKUP(E61,INDEX(ВидыГод!A:A,MATCH($B$46,ВидыГод!$A$1:$A$209,)):INDEX(ВидыГод!I:I,MATCH($B$46,ВидыГод!$A$1:$A$209,)+COUNTIF(ВидыГод!I:I,VLOOKUP(RCData!$B$46,ВидыГод!A:I,9,0))),7,),0)","v":0},{"$f":"IFERROR(VLOOKUP(E61,INDEX(ВидыГод!A:A,MATCH($B$46,ВидыГод!$A$1:$A$209,)):INDEX(ВидыГод!I:I,MATCH($B$46,ВидыГод!$A$1:$A$209,)+COUNTIF(ВидыГод!I:I,VLOOKUP(RCData!$B$46,ВидыГод!A:I,9,0))),4,),0)","v":0},"",""]
[null,null,null,null,{"$f":"ВидыГод!A14","v":"  Май 19"},{"$f":"IFERROR(VLOOKUP(E62,INDEX(ВидыГод!A:A,MATCH($B$46,ВидыГод!$A$1:$A$209,)):INDEX(ВидыГод!I:I,MATCH($B$46,ВидыГод!$A$1:$A$209,)+COUNTIF(ВидыГод!I:I,VLOOKUP(RCData!$B$46,ВидыГод!A:I,9,0))),7,),0)","v":911},{"$f":"IFERROR(VLOOKUP(E62,INDEX(ВидыГод!A:A,MATCH($B$46,ВидыГод!$A$1:$A$209,)):INDEX(ВидыГод!I:I,MATCH($B$46,ВидыГод!$A$1:$A$209,)+COUNTIF(ВидыГод!I:I,VLOOKUP(RCData!$B$46,ВидыГод!A:I,9,0))),4,),0)","v":21},"",""]
[null,null,null,null,{"$f":"ВидыГод!A15","v":"  Июнь 19"},{"$f":"IFERROR(VLOOKUP(E63,INDEX(ВидыГод!A:A,MATCH($B$46,ВидыГод!$A$1:$A$209,)):INDEX(ВидыГод!I:I,MATCH($B$46,ВидыГод!$A$1:$A$209,)+COUNTIF(ВидыГод!I:I,VLOOKUP(RCData!$B$46,ВидыГод!A:I,9,0))),7,),0)","v":0},{"$f":"IFERROR(VLOOKUP(E63,INDEX(ВидыГод!A:A,MATCH($B$46,ВидыГод!$A$1:$A$209,)):INDEX(ВидыГод!I:I,MATCH($B$46,ВидыГод!$A$1:$A$209,)+COUNTIF(ВидыГод!I:I,VLOOKUP(RCData!$B$46,ВидыГод!A:I,9,0))),4,),0)","v":0},"",""]
[null,null,null,null,{"$f":"ВидыГод!A16","v":"  Июль 19"},{"$f":"IFERROR(VLOOKUP(E64,INDEX(ВидыГод!A:A,MATCH($B$46,ВидыГод!$A$1:$A$209,)):INDEX(ВидыГод!I:I,MATCH($B$46,ВидыГод!$A$1:$A$209,)+COUNTIF(ВидыГод!I:I,VLOOKUP(RCData!$B$46,ВидыГод!A:I,9,0))),7,),0)","v":229},{"$f":"IFERROR(VLOOKUP(E64,INDEX(ВидыГод!A:A,MATCH($B$46,ВидыГод!$A$1:$A$209,)):INDEX(ВидыГод!I:I,MATCH($B$46,ВидыГод!$A$1:$A$209,)+COUNTIF(ВидыГод!I:I,VLOOKUP(RCData!$B$46,ВидыГод!A:I,9,0))),4,),0)","v":5},"",""]
[null,null,null,null,{"$f":"ВидыГод!A17","v":"  Август 19"},{"$f":"IFERROR(VLOOKUP(E65,INDEX(ВидыГод!A:A,MATCH($B$46,ВидыГод!$A$1:$A$209,)):INDEX(ВидыГод!I:I,MATCH($B$46,ВидыГод!$A$1:$A$209,)+COUNTIF(ВидыГод!I:I,VLOOKUP(RCData!$B$46,ВидыГод!A:I,9,0))),7,),0)","v":44.64},{"$f":"IFERROR(VLOOKUP(E65,INDEX(ВидыГод!A:A,MATCH($B$46,ВидыГод!$A$1:$A$209,)):INDEX(ВидыГод!I:I,MATCH($B$46,ВидыГод!$A$1:$A$209,)+COUNTIF(ВидыГод!I:I,VLOOKUP(RCData!$B$46,ВидыГод!A:I,9,0))),4,),0)","v":1},"",""]
[null,null,null,null,{"$f":"ВидыГод!A18","v":"  Сентябрь 19"},{"$f":"IFERROR(VLOOKUP(E66,INDEX(ВидыГод!A:A,MATCH($B$46,ВидыГод!$A$1:$A$209,)):INDEX(ВидыГод!I:I,MATCH($B$46,ВидыГод!$A$1:$A$209,)+COUNTIF(ВидыГод!I:I,VLOOKUP(RCData!$B$46,ВидыГод!A:I,9,0))),7,),0)","v":98.58},{"$f":"IFERROR(VLOOKUP(E66,INDEX(ВидыГод!A:A,MATCH($B$46,ВидыГод!$A$1:$A$209,)):INDEX(ВидыГод!I:I,MATCH($B$46,ВидыГод!$A$1:$A$209,)+COUNTIF(ВидыГод!I:I,VLOOKUP(RCData!$B$46,ВидыГод!A:I,9,0))),4,),0)","v":7},"",""]
[null,null,null,null,{"$f":"ВидыГод!A19","v":"  Октябрь 19"},{"$f":"IFERROR(VLOOKUP(E67,INDEX(ВидыГод!A:A,MATCH($B$46,ВидыГод!$A$1:$A$209,)):INDEX(ВидыГод!I:I,MATCH($B$46,ВидыГод!$A$1:$A$209,)+COUNTIF(ВидыГод!I:I,VLOOKUP(RCData!$B$46,ВидыГод!A:I,9,0))),7,),0)","v":206.21},{"$f":"IFERROR(VLOOKUP(E67,INDEX(ВидыГод!A:A,MATCH($B$46,ВидыГод!$A$1:$A$209,)):INDEX(ВидыГод!I:I,MATCH($B$46,ВидыГод!$A$1:$A$209,)+COUNTIF(ВидыГод!I:I,VLOOKUP(RCData!$B$46,ВидыГод!A:I,9,0))),4,),0)","v":5},"",""]
[null,null,null,null,{"$f":"ВидыГод!A20","v":"  Ноябрь 19"},{"$f":"IFERROR(VLOOKUP(E68,INDEX(ВидыГод!A:A,MATCH($B$46,ВидыГод!$A$1:$A$209,)):INDEX(ВидыГод!I:I,MATCH($B$46,ВидыГод!$A$1:$A$209,)+COUNTIF(ВидыГод!I:I,VLOOKUP(RCData!$B$46,ВидыГод!A:I,9,0))),7,),0)","v":0},{"$f":"IFERROR(VLOOKUP(E68,INDEX(ВидыГод!A:A,MATCH($B$46,ВидыГод!$A$1:$A$209,)):INDEX(ВидыГод!I:I,MATCH($B$46,ВидыГод!$A$1:$A$209,)+COUNTIF(ВидыГод!I:I,VLOOKUP(RCData!$B$46,ВидыГод!A:I,9,0))),4,),0)","v":0},"",""]
[null,null,null,null,{"$f":"ВидыГод!A21","v":"  Декабрь 19"},{"$f":"IFERROR(VLOOKUP(E69,INDEX(ВидыГод!A:A,MATCH($B$46,ВидыГод!$A$1:$A$209,)):INDEX(ВидыГод!I:I,MATCH($B$46,ВидыГод!$A$1:$A$209,)+COUNTIF(ВидыГод!I:I,VLOOKUP(RCData!$B$46,ВидыГод!A:I,9,0))),7,),0)","v":0},{"$f":"IFERROR(VLOOKUP(E69,INDEX(ВидыГод!A:A,MATCH($B$46,ВидыГод!$A$1:$A$209,)):INDEX(ВидыГод!I:I,MATCH($B$46,ВидыГод!$A$1:$A$209,)+COUNTIF(ВидыГод!I:I,VLOOKUP(RCData!$B$46,ВидыГод!A:I,9,0))),4,),0)","v":0},"",""]
[null,null,null,null,{"$f":"ВидыГод!A22","v":"  Январь 20"},{"$f":"IFERROR(VLOOKUP(E70,INDEX(ВидыГод!A:A,MATCH($B$46,ВидыГод!$A$1:$A$209,)):INDEX(ВидыГод!I:I,MATCH($B$46,ВидыГод!$A$1:$A$209,)+COUNTIF(ВидыГод!I:I,VLOOKUP(RCData!$B$46,ВидыГод!A:I,9,0))),7,),0)","v":0},{"$f":"IFERROR(VLOOKUP(E70,INDEX(ВидыГод!A:A,MATCH($B$46,ВидыГод!$A$1:$A$209,)):INDEX(ВидыГод!I:I,MATCH($B$46,ВидыГод!$A$1:$A$209,)+COUNTIF(ВидыГод!I:I,VLOOKUP(RCData!$B$46,ВидыГод!A:I,9,0))),4,),0)","v":0},"",""]
[null,null,null,null,{"$f":"ВидыГод!A23","v":"  Февраль 20"},{"$f":"IFERROR(VLOOKUP(E71,INDEX(ВидыГод!A:A,MATCH($B$46,ВидыГод!$A$1:$A$209,)):INDEX(ВидыГод!I:I,MATCH($B$46,ВидыГод!$A$1:$A$209,)+COUNTIF(ВидыГод!I:I,VLOOKUP(RCData!$B$46,ВидыГод!A:I,9,0))),7,),0)","v":57.65},{"$f":"IFERROR(VLOOKUP(E71,INDEX(ВидыГод!A:A,MATCH($B$46,ВидыГод!$A$1:$A$209,)):INDEX(ВидыГод!I:I,MATCH($B$46,ВидыГод!$A$1:$A$209,)+COUNTIF(ВидыГод!I:I,VLOOKUP(RCData!$B$46,ВидыГод!A:I,9,0))),4,),0)","v":2},"",""]
[]
[]
[]
[]
[]
[]
[]
[]
[]
{"$rows_left_out":765}