{"text_format":"1","workbook":"xlsx","n_sheets":4,"sheets":["Лист2","Скрещивание","Результат скрещивания","Вариант"],"not_rendered":{"charts":0,"images":0,"macros":1,"external_links":0,"defined_names":1,"comments":0,"pivot_tables":0},"unopened":[],"bounds":{"document_bytes":16777216,"sheet_cells":100000,"rows_first":2000,"rows_last":500,"rows_between":2000,"halvings":0,"cell_chars":16384,"cell_head_chars":4096},"cells_cut":0,"cells_raw":0,"read":"whole","date_system":"1900"}

{"sheet":"Лист2","index":0,"n_rows":31,"n_cols":4,"rows_kept":31,"cut":false,"hidden":false,"merged":[]}
[null,"Газ","Порядок","Значения"]
["15.01.2020","qaz",1,1000]
["15.01.2020","wsx",2,2000]
["15.01.2020","edc",3,3000]
["15.01.2020","rfv",4,4000]
["15.01.2020","yhn",5,4500]
["31.01.2020","qaz",1,5000]
["31.01.2020","wsx",2,6000]
["31.01.2020","edc",3,7000]
["31.01.2020","rfv",4,8000]
["31.01.2020","yhn",5,8500]
["15.02.2020","qaz",1,9000]
["15.02.2020","wsx",2,10000]
["15.02.2020","edc",3,11000]
["15.02.2020","rfv",4,12000]
["15.02.2020","yhn",5,12500]
["29.02.2020","qaz",1,13000]
["29.02.2020","wsx",2,14000]
["29.02.2020","edc",3,15000]
["29.02.2020","rfv",4,16000]
["29.02.2020","yhn",5,17000]
["15.03.2020","qaz",1,18000]
["15.03.2020","wsx",2,19000]
["15.03.2020","edc",3,20000]
["15.03.2020","rfv",4,21000]
["15.03.2020","yhn",5,22000]
["30.03.2020","qaz",1,23000]
["30.03.2020","wsx",2,24000]
["30.03.2020","edc",3,25000]
["30.03.2020","rfv",4,26000]
["30.03.2020","yhn",5,27000]

{"sheet":"Скрещивание","index":1,"n_rows":16,"n_cols":8,"rows_kept":16,"cut":false,"hidden":false,"merged":[]}
["Газ","Порядок","2020-01-15","2020-01-31","2020-02-15","2020-02-29","2020-03-15","2020-03-30"]
["qaz",1,1000,5000,9000,13000,18000,23000]
["wsx",2,2000,6000,10000,14000,19000,24000]
["edc",3,3000,7000,11000,15000,20000,25000]
["rfv",4,4000,8000,12000,16000,21000,26000]
["yhn",5,4500,8500,12500,17000,22000,27000]
["Здесь количество строк с данными =5"]
["Для каждого числа "]
["ЦЕЛОЕ(СТРОКА(A5)/5, а это =5/5=1"]
["ЦЕЛОЕ(СТРОКА(A6)/5, а это =целое(6/5)=1"]
[]
[{"$f":"IFERROR(INDEX(Скрещивание!$C$1:$H$1,INT(ROW(A5)/5)),\"\")","v":"2020-01-15"},{"$f":"IF(A12=\"\",\"\",INDEX(Скрещивание!$A$2:$A$6,MOD(ROW(B5),5)+1))","v":"qaz"},{"$f":"IFERROR(VLOOKUP(B12,Скрещивание!$A$2:$B$6,2,),\"\")","v":1},{"$f":"IFERROR(INDEX(Скрещивание!$C$2:$H$6,MATCH(B12,Скрещивание!$A$2:$A$6,),MATCH(A12,Скрещивание!$C$1:$H$1,)),\"\")","v":1000}]
[{"$f":"IFERROR(INDEX(Скрещивание!$C$1:$H$1,INT(ROW(A6)/5)),\"\")","v":"2020-01-15"},{"$f":"IF(A13=\"\",\"\",INDEX(Скрещивание!$A$2:$A$6,MOD(ROW(B6),5)+1))","v":"wsx"},{"$f":"IFERROR(VLOOKUP(B13,Скрещивание!$A$2:$B$6,2,),\"\")","v":2},{"$f":"IFERROR(INDEX(Скрещивание!$C$2:$H$6,MATCH(B13,Скрещивание!$A$2:$A$6,),MATCH(A13,Скрещивание!$C$1:$H$1,)),\"\")","v":2000}]
[{"$f":"IFERROR(INDEX(Скрещивание!$C$1:$H$1,INT(ROW(A7)/5)),\"\")","v":"2020-01-15"},{"$f":"IF(A14=\"\",\"\",INDEX(Скрещивание!$A$2:$A$6,MOD(ROW(B7),5)+1))","v":"edc"},{"$f":"IFERROR(VLOOKUP(B14,Скрещивание!$A$2:$B$6,2,),\"\")","v":3},{"$f":"IFERROR(INDEX(Скрещивание!$C$2:$H$6,MATCH(B14,Скрещивание!$A$2:$A$6,),MATCH(A14,Скрещивание!$C$1:$H$1,)),\"\")","v":3000}]
[{"$f":"IFERROR(INDEX(Скрещивание!$C$1:$H$1,INT(ROW(A8)/5)),\"\")","v":"2020-01-15"},{"$f":"IF(A15=\"\",\"\",INDEX(Скрещивание!$A$2:$A$6,MOD(ROW(B8),5)+1))","v":"rfv"},{"$f":"IFERROR(VLOOKUP(B15,Скрещивание!$A$2:$B$6,2,),\"\")","v":4},{"$f":"IFERROR(INDEX(Скрещивание!$C$2:$H$6,MATCH(B15,Скрещивание!$A$2:$A$6,),MATCH(A15,Скрещивание!$C$1:$H$1,)),\"\")","v":4000}]
[{"$f":"IFERROR(INDEX(Скрещивание!$C$1:$H$1,INT(ROW(A9)/5)),\"\")","v":"2020-01-15"},{"$f":"IF(A16=\"\",\"\",INDEX(Скрещивание!$A$2:$A$6,MOD(ROW(B9),5)+1))","v":"yhn"},{"$f":"IFERROR(VLOOKUP(B16,Скрещивание!$A$2:$B$6,2,),\"\")","v":5},{"$f":"IFERROR(INDEX(Скрещивание!$C$2:$H$6,MATCH(B16,Скрещивание!$A$2:$A$6,),MATCH(A16,Скрещивание!$C$1:$H$1,)),\"\")","v":4500}]

{"sheet":"Результат скрещивания","index":2,"n_rows":31,"n_cols":4,"rows_kept":31,"cut":false,"hidden":false,"merged":[]}
["Пример результата на другом листе"]
["2020-01-15","qaz",1,1000]
["2020-01-15","wsx",2,2000]
["2020-01-15","edc",3,3000]
["2020-01-15","rfv",4,4000]
["2020-01-15","yhn",5,4500]
["2020-01-31","qaz",1,5000]
["2020-01-31","wsx",2,6000]
["2020-01-31","edc",3,7000]
["2020-01-31","rfv",4,8000]
["2020-01-31","yhn",5,8500]
["2020-02-15","qaz",1,9000]
["2020-02-15","wsx",2,10000]
["2020-02-15","edc",3,11000]
["2020-02-15","rfv",4,12000]
["2020-02-15","yhn",5,12500]
["2020-02-29","qaz",1,13000]
["2020-02-29","wsx",2,14000]
["2020-02-29","edc",3,15000]
["2020-02-29","rfv",4,16000]
["2020-02-29","yhn",5,17000]
["2020-03-15","qaz",1,18000]
["2020-03-15","wsx",2,19000]
["2020-03-15","edc",3,20000]
["2020-03-15","rfv",4,21000]
["2020-03-15","yhn",5,22000]
["2020-03-30","qaz",1,23000]
["2020-03-30","wsx",2,24000]
["2020-03-30","edc",3,25000]
["2020-03-30","rfv",4,26000]
["2020-03-30","yhn",5,27000]

{"sheet":"Вариант","index":3,"n_rows":53,"n_cols":4,"rows_kept":53,"cut":false,"hidden":false,"merged":[]}
[null,null,"Вариант"]
[{"$f":"IFERROR(INDEX(Скрещивание!$C$1:$H$1,INT(ROW(A5)/5)),\"\")","v":"2020-01-15"},{"$f":"IF(A2=\"\",\"\",INDEX(Скрещивание!$A$2:$A$6,MOD(ROW(B5),5)+1))","v":"qaz"},{"$f":"IFERROR(VLOOKUP(B2,Скрещивание!$A$2:$B$6,2,),\"\")","v":1},{"$f":"IFERROR(INDEX(Скрещивание!$C$2:$H$6,MATCH(B2,Скрещивание!$A$2:$A$6,),MATCH(A2,Скрещивание!$C$1:$H$1,)),\"\")","v":1000}]
[{"$f":"IFERROR(INDEX(Скрещивание!$C$1:$H$1,INT(ROW(A6)/5)),\"\")","v":"2020-01-15"},{"$f":"IF(A3=\"\",\"\",INDEX(Скрещивание!$A$2:$A$6,MOD(ROW(B6),5)+1))","v":"wsx"},{"$f":"IFERROR(VLOOKUP(B3,Скрещивание!$A$2:$B$6,2,),\"\")","v":2},{"$f":"IFERROR(INDEX(Скрещивание!$C$2:$H$6,MATCH(B3,Скрещивание!$A$2:$A$6,),MATCH(A3,Скрещивание!$C$1:$H$1,)),\"\")","v":2000}]
[{"$f":"IFERROR(INDEX(Скрещивание!$C$1:$H$1,INT(ROW(A7)/5)),\"\")","v":"2020-01-15"},{"$f":"IF(A4=\"\",\"\",INDEX(Скрещивание!$A$2:$A$6,MOD(ROW(B7),5)+1))","v":"edc"},{"$f":"IFERROR(VLOOKUP(B4,Скрещивание!$A$2:$B$6,2,),\"\")","v":3},{"$f":"IFERROR(INDEX(Скрещивание!$C$2:$H$6,MATCH(B4,Скрещивание!$A$2:$A$6,),MATCH(A4,Скрещивание!$C$1:$H$1,)),\"\")","v":3000}]
[{"$f":"IFERROR(INDEX(Скрещивание!$C$1:$H$1,INT(ROW(A8)/5)),\"\")","v":"2020-01-15"},{"$f":"IF(A5=\"\",\"\",INDEX(Скрещивание!$A$2:$A$6,MOD(ROW(B8),5)+1))","v":"rfv"},{"$f":"IFERROR(VLOOKUP(B5,Скрещивание!$A$2:$B$6,2,),\"\")","v":4},{"$f":"IFERROR(INDEX(Скрещивание!$C$2:$H$6,MATCH(B5,Скрещивание!$A$2:$A$6,),MATCH(A5,Скрещивание!$C$1:$H$1,)),\"\")","v":4000}]
[{"$f":"IFERROR(INDEX(Скрещивание!$C$1:$H$1,INT(ROW(A9)/5)),\"\")","v":"2020-01-15"},{"$f":"IF(A6=\"\",\"\",INDEX(Скрещивание!$A$2:$A$6,MOD(ROW(B9),5)+1))","v":"yhn"},{"$f":"IFERROR(VLOOKUP(B6,Скрещивание!$A$2:$B$6,2,),\"\")","v":5},{"$f":"IFERROR(INDEX(Скрещивание!$C$2:$H$6,MATCH(B6,Скрещивание!$A$2:$A$6,),MATCH(A6,Скрещивание!$C$1:$H$1,)),\"\")","v":4500}]
[{"$f":"IFERROR(INDEX(Скрещивание!$C$1:$H$1,INT(ROW(A10)/5)),\"\")","v":"2020-01-31"},{"$f":"IF(A7=\"\",\"\",INDEX(Скрещивание!$A$2:$A$6,MOD(ROW(B10),5)+1))","v":"qaz"},{"$f":"IFERROR(VLOOKUP(B7,Скрещивание!$A$2:$B$6,2,),\"\")","v":1},{"$f":"IFERROR(INDEX(Скрещивание!$C$2:$H$6,MATCH(B7,Скрещивание!$A$2:$A$6,),MATCH(A7,Скрещивание!$C$1:$H$1,)),\"\")","v":5000}]
[{"$f":"IFERROR(INDEX(Скрещивание!$C$1:$H$1,INT(ROW(A11)/5)),\"\")","v":"2020-01-31"},{"$f":"IF(A8=\"\",\"\",INDEX(Скрещивание!$A$2:$A$6,MOD(ROW(B11),5)+1))","v":"wsx"},{"$f":"IFERROR(VLOOKUP(B8,Скрещивание!$A$2:$B$6,2,),\"\")","v":2},{"$f":"IFERROR(INDEX(Скрещивание!$C$2:$H$6,MATCH(B8,Скрещивание!$A$2:$A$6,),MATCH(A8,Скрещивание!$C$1:$H$1,)),\"\")","v":6000}]
[{"$f":"IFERROR(INDEX(Скрещивание!$C$1:$H$1,INT(ROW(A12)/5)),\"\")","v":"2020-01-31"},{"$f":"IF(A9=\"\",\"\",INDEX(Скрещивание!$A$2:$A$6,MOD(ROW(B12),5)+1))","v":"edc"},{"$f":"IFERROR(VLOOKUP(B9,Скрещивание!$A$2:$B$6,2,),\"\")","v":3},{"$f":"IFERROR(INDEX(Скрещивание!$C$2:$H$6,MATCH(B9,Скрещивание!$A$2:$A$6,),MATCH(A9,Скрещивание!$C$1:$H$1,)),\"\")","v":7000}]
[{"$f":"IFERROR(INDEX(Скрещивание!$C$1:$H$1,INT(ROW(A13)/5)),\"\")","v":"2020-01-31"},{"$f":"IF(A10=\"\",\"\",INDEX(Скрещивание!$A$2:$A$6,MOD(ROW(B13),5)+1))","v":"rfv"},{"$f":"IFERROR(VLOOKUP(B10,Скрещивание!$A$2:$B$6,2,),\"\")","v":4},{"$f":"IFERROR(INDEX(Скрещивание!$C$2:$H$6,MATCH(B10,Скрещивание!$A$2:$A$6,),MATCH(A10,Скрещивание!$C$1:$H$1,)),\"\")","v":8000}]
[{"$f":"IFERROR(INDEX(Скрещивание!$C$1:$H$1,INT(ROW(A14)/5)),\"\")","v":"2020-01-31"},{"$f":"IF(A11=\"\",\"\",INDEX(Скрещивание!$A$2:$A$6,MOD(ROW(B14),5)+1))","v":"yhn"},{"$f":"IFERROR(VLOOKUP(B11,Скрещивание!$A$2:$B$6,2,),\"\")","v":5},{"$f":"IFERROR(INDEX(Скрещивание!$C$2:$H$6,MATCH(B11,Скрещивание!$A$2:$A$6,),MATCH(A11,Скрещивание!$C$1:$H$1,)),\"\")","v":8500}]
[{"$f":"IFERROR(INDEX(Скрещивание!$C$1:$H$1,INT(ROW(A15)/5)),\"\")","v":"2020-02-15"},{"$f":"IF(A12=\"\",\"\",INDEX(Скрещивание!$A$2:$A$6,MOD(ROW(B15),5)+1))","v":"qaz"},{"$f":"IFERROR(VLOOKUP(B12,Скрещивание!$A$2:$B$6,2,),\"\")","v":1},{"$f":"IFERROR(INDEX(Скрещивание!$C$2:$H$6,MATCH(B12,Скрещивание!$A$2:$A$6,),MATCH(A12,Скрещивание!$C$1:$H$1,)),\"\")","v":9000}]
[{"$f":"IFERROR(INDEX(Скрещивание!$C$1:$H$1,INT(ROW(A16)/5)),\"\")","v":"2020-02-15"},{"$f":"IF(A13=\"\",\"\",INDEX(Скрещивание!$A$2:$A$6,MOD(ROW(B16),5)+1))","v":"wsx"},{"$f":"IFERROR(VLOOKUP(B13,Скрещивание!$A$2:$B$6,2,),\"\")","v":2},{"$f":"IFERROR(INDEX(Скрещивание!$C$2:$H$6,MATCH(B13,Скрещивание!$A$2:$A$6,),MATCH(A13,Скрещивание!$C$1:$H$1,)),\"\")","v":10000}]
[{"$f":"IFERROR(INDEX(Скрещивание!$C$1:$H$1,INT(ROW(A17)/5)),\"\")","v":"2020-02-15"},{"$f":"IF(A14=\"\",\"\",INDEX(Скрещивание!$A$2:$A$6,MOD(ROW(B17),5)+1))","v":"edc"},{"$f":"IFERROR(VLOOKUP(B14,Скрещивание!$A$2:$B$6,2,),\"\")","v":3},{"$f":"IFERROR(INDEX(Скрещивание!$C$2:$H$6,MATCH(B14,Скрещивание!$A$2:$A$6,),MATCH(A14,Скрещивание!$C$1:$H$1,)),\"\")","v":11000}]
[{"$f":"IFERROR(INDEX(Скрещивание!$C$1:$H$1,INT(ROW(A18)/5)),\"\")","v":"2020-02-15"},{"$f":"IF(A15=\"\",\"\",INDEX(Скрещивание!$A$2:$A$6,MOD(ROW(B18),5)+1))","v":"rfv"},{"$f":"IFERROR(VLOOKUP(B15,Скрещивание!$A$2:$B$6,2,),\"\")","v":4},{"$f":"IFERROR(INDEX(Скрещивание!$C$2:$H$6,MATCH(B15,Скрещивание!$A$2:$A$6,),MATCH(A15,Скрещивание!$C$1:$H$1,)),\"\")","v":12000}]
[{"$f":"IFERROR(INDEX(Скрещивание!$C$1:$H$1,INT(ROW(A19)/5)),\"\")","v":"2020-02-15"},{"$f":"IF(A16=\"\",\"\",INDEX(Скрещивание!$A$2:$A$6,MOD(ROW(B19),5)+1))","v":"yhn"},{"$f":"IFERROR(VLOOKUP(B16,Скрещивание!$A$2:$B$6,2,),\"\")","v":5},{"$f":"IFERROR(INDEX(Скрещивание!$C$2:$H$6,MATCH(B16,Скрещивание!$A$2:$A$6,),MATCH(A16,Скрещивание!$C$1:$H$1,)),\"\")","v":12500}]
[{"$f":"IFERROR(INDEX(Скрещивание!$C$1:$H$1,INT(ROW(A20)/5)),\"\")","v":"2020-02-29"},{"$f":"IF(A17=\"\",\"\",INDEX(Скрещивание!$A$2:$A$6,MOD(ROW(B20),5)+1))","v":"qaz"},{"$f":"IFERROR(VLOOKUP(B17,Скрещивание!$A$2:$B$6,2,),\"\")","v":1},{"$f":"IFERROR(INDEX(Скрещивание!$C$2:$H$6,MATCH(B17,Скрещивание!$A$2:$A$6,),MATCH(A17,Скрещивание!$C$1:$H$1,)),\"\")","v":13000}]
[{"$f":"IFERROR(INDEX(Скрещивание!$C$1:$H$1,INT(ROW(A21)/5)),\"\")","v":"2020-02-29"},{"$f":"IF(A18=\"\",\"\",INDEX(Скрещивание!$A$2:$A$6,MOD(ROW(B21),5)+1))","v":"wsx"},{"$f":"IFERROR(VLOOKUP(B18,Скрещивание!$A$2:$B$6,2,),\"\")","v":2},{"$f":"IFERROR(INDEX(Скрещивание!$C$2:$H$6,MATCH(B18,Скрещивание!$A$2:$A$6,),MATCH(A18,Скрещивание!$C$1:$H$1,)),\"\")","v":14000}]
[{"$f":"IFERROR(INDEX(Скрещивание!$C$1:$H$1,INT(ROW(A22)/5)),\"\")","v":"2020-02-29"},{"$f":"IF(A19=\"\",\"\",INDEX(Скрещивание!$A$2:$A$6,MOD(ROW(B22),5)+1))","v":"edc"},{"$f":"IFERROR(VLOOKUP(B19,Скрещивание!$A$2:$B$6,2,),\"\")","v":3},{"$f":"IFERROR(INDEX(Скрещивание!$C$2:$H$6,MATCH(B19,Скрещивание!$A$2:$A$6,),MATCH(A19,Скрещивание!$C$1:$H$1,)),\"\")","v":15000}]
[{"$f":"IFERROR(INDEX(Скрещивание!$C$1:$H$1,INT(ROW(A23)/5)),\"\")","v":"2020-02-29"},{"$f":"IF(A20=\"\",\"\",INDEX(Скрещивание!$A$2:$A$6,MOD(ROW(B23),5)+1))","v":"rfv"},{"$f":"IFERROR(VLOOKUP(B20,Скрещивание!$A$2:$B$6,2,),\"\")","v":4},{"$f":"IFERROR(INDEX(Скрещивание!$C$2:$H$6,MATCH(B20,Скрещивание!$A$2:$A$6,),MATCH(A20,Скрещивание!$C$1:$H$1,)),\"\")","v":16000}]
[{"$f":"IFERROR(INDEX(Скрещивание!$C$1:$H$1,INT(ROW(A24)/5)),\"\")","v":"2020-02-29"},{"$f":"IF(A21=\"\",\"\",INDEX(Скрещивание!$A$2:$A$6,MOD(ROW(B24),5)+1))","v":"yhn"},{"$f":"IFERROR(VLOOKUP(B21,Скрещивание!$A$2:$B$6,2,),\"\")","v":5},{"$f":"IFERROR(INDEX(Скрещивание!$C$2:$H$6,MATCH(B21,Скрещивание!$A$2:$A$6,),MATCH(A21,Скрещивание!$C$1:$H$1,)),\"\")","v":17000}]
[{"$f":"IFERROR(INDEX(Скрещивание!$C$1:$H$1,INT(ROW(A25)/5)),\"\")","v":"2020-03-15"},{"$f":"IF(A22=\"\",\"\",INDEX(Скрещивание!$A$2:$A$6,MOD(ROW(B25),5)+1))","v":"qaz"},{"$f":"IFERROR(VLOOKUP(B22,Скрещивание!$A$2:$B$6,2,),\"\")","v":1},{"$f":"IFERROR(INDEX(Скрещивание!$C$2:$H$6,MATCH(B22,Скрещивание!$A$2:$A$6,),MATCH(A22,Скрещивание!$C$1:$H$1,)),\"\")","v":18000}]
[{"$f":"IFERROR(INDEX(Скрещивание!$C$1:$H$1,INT(ROW(A26)/5)),\"\")","v":"2020-03-15"},{"$f":"IF(A23=\"\",\"\",INDEX(Скрещивание!$A$2:$A$6,MOD(ROW(B26),5)+1))","v":"wsx"},{"$f":"IFERROR(VLOOKUP(B23,Скрещивание!$A$2:$B$6,2,),\"\")","v":2},{"$f":"IFERROR(INDEX(Скрещивание!$C$2:$H$6,MATCH(B23,Скрещивание!$A$2:$A$6,),MATCH(A23,Скрещивание!$C$1:$H$1,)),\"\")","v":19000}]
[{"$f":"IFERROR(INDEX(Скрещивание!$C$1:$H$1,INT(ROW(A27)/5)),\"\")","v":"2020-03-15"},{"$f":"IF(A24=\"\",\"\",INDEX(Скрещивание!$A$2:$A$6,MOD(ROW(B27),5)+1))","v":"edc"},{"$f":"IFERROR(VLOOKUP(B24,Скрещивание!$A$2:$B$6,2,),\"\")","v":3},{"$f":"IFERROR(INDEX(Скрещивание!$C$2:$H$6,MATCH(B24,Скрещивание!$A$2:$A$6,),MATCH(A24,Скрещивание!$C$1:$H$1,)),\"\")","v":20000}]
[{"$f":"IFERROR(INDEX(Скрещивание!$C$1:$H$1,INT(ROW(A28)/5)),\"\")","v":"2020-03-15"},{"$f":"IF(A25=\"\",\"\",INDEX(Скрещивание!$A$2:$A$6,MOD(ROW(B28),5)+1))","v":"rfv"},{"$f":"IFERROR(VLOOKUP(B25,Скрещивание!$A$2:$B$6,2,),\"\")","v":4},{"$f":"IFERROR(INDEX(Скрещивание!$C$2:$H$6,MATCH(B25,Скрещивание!$A$2:$A$6,),MATCH(A25,Скрещивание!$C$1:$H$1,)),\"\")","v":21000}]
[{"$f":"IFERROR(INDEX(Скрещивание!$C$1:$H$1,INT(ROW(A29)/5)),\"\")","v":"2020-03-15"},{"$f":"IF(A26=\"\",\"\",INDEX(Скрещивание!$A$2:$A$6,MOD(ROW(B29),5)+1))","v":"yhn"},{"$f":"IFERROR(VLOOKUP(B26,Скрещивание!$A$2:$B$6,2,),\"\")","v":5},{"$f":"IFERROR(INDEX(Скрещивание!$C$2:$H$6,MATCH(B26,Скрещивание!$A$2:$A$6,),MATCH(A26,Скрещивание!$C$1:$H$1,)),\"\")","v":22000}]
[{"$f":"IFERROR(INDEX(Скрещивание!$C$1:$H$1,INT(ROW(A30)/5)),\"\")","v":"2020-03-30"},{"$f":"IF(A27=\"\",\"\",INDEX(Скрещивание!$A$2:$A$6,MOD(ROW(B30),5)+1))","v":"qaz"},{"$f":"IFERROR(VLOOKUP(B27,Скрещивание!$A$2:$B$6,2,),\"\")","v":1},{"$f":"IFERROR(INDEX(Скрещивание!$C$2:$H$6,MATCH(B27,Скрещивание!$A$2:$A$6,),MATCH(A27,Скрещивание!$C$1:$H$1,)),\"\")","v":23000}]
[{"$f":"IFERROR(INDEX(Скрещивание!$C$1:$H$1,INT(ROW(A31)/5)),\"\")","v":"2020-03-30"},{"$f":"IF(A28=\"\",\"\",INDEX(Скрещивание!$A$2:$A$6,MOD(ROW(B31),5)+1))","v":"wsx"},{"$f":"IFERROR(VLOOKUP(B28,Скрещивание!$A$2:$B$6,2,),\"\")","v":2},{"$f":"IFERROR(INDEX(Скрещивание!$C$2:$H$6,MATCH(B28,Скрещивание!$A$2:$A$6,),MATCH(A28,Скрещивание!$C$1:$H$1,)),\"\")","v":24000}]
[{"$f":"IFERROR(INDEX(Скрещивание!$C$1:$H$1,INT(ROW(A32)/5)),\"\")","v":"2020-03-30"},{"$f":"IF(A29=\"\",\"\",INDEX(Скрещивание!$A$2:$A$6,MOD(ROW(B32),5)+1))","v":"edc"},{"$f":"IFERROR(VLOOKUP(B29,Скрещивание!$A$2:$B$6,2,),\"\")","v":3},{"$f":"IFERROR(INDEX(Скрещивание!$C$2:$H$6,MATCH(B29,Скрещивание!$A$2:$A$6,),MATCH(A29,Скрещивание!$C$1:$H$1,)),\"\")","v":25000}]
[{"$f":"IFERROR(INDEX(Скрещивание!$C$1:$H$1,INT(ROW(A33)/5)),\"\")","v":"2020-03-30"},{"$f":"IF(A30=\"\",\"\",INDEX(Скрещивание!$A$2:$A$6,MOD(ROW(B33),5)+1))","v":"rfv"},{"$f":"IFERROR(VLOOKUP(B30,Скрещивание!$A$2:$B$6,2,),\"\")","v":4},{"$f":"IFERROR(INDEX(Скрещивание!$C$2:$H$6,MATCH(B30,Скрещивание!$A$2:$A$6,),MATCH(A30,Скрещивание!$C$1:$H$1,)),\"\")","v":26000}]
[{"$f":"IFERROR(INDEX(Скрещивание!$C$1:$H$1,INT(ROW(A34)/5)),\"\")","v":"2020-03-30"},{"$f":"IF(A31=\"\",\"\",INDEX(Скрещивание!$A$2:$A$6,MOD(ROW(B34),5)+1))","v":"yhn"},{"$f":"IFERROR(VLOOKUP(B31,Скрещивание!$A$2:$B$6,2,),\"\")","v":5},{"$f":"IFERROR(INDEX(Скрещивание!$C$2:$H$6,MATCH(B31,Скрещивание!$A$2:$A$6,),MATCH(A31,Скрещивание!$C$1:$H$1,)),\"\")","v":27000}]
[{"$f":"IFERROR(INDEX(Скрещивание!$C$1:$H$1,INT(ROW(A35)/5)),\"\")","v":""},{"$f":"IF(A32=\"\",\"\",INDEX(Скрещивание!$A$2:$A$6,MOD(ROW(B35),5)+1))","v":""},{"$f":"IFERROR(VLOOKUP(B32,Скрещивание!$A$2:$B$6,2,),\"\")","v":""},{"$f":"IFERROR(INDEX(Скрещивание!$C$2:$H$6,MATCH(B32,Скрещивание!$A$2:$A$6,),MATCH(A32,Скрещивание!$C$1:$H$1,)),\"\")","v":""}]
[{"$f":"IFERROR(INDEX(Скрещивание!$C$1:$H$1,INT(ROW(A36)/5)),\"\")","v":""},{"$f":"IF(A33=\"\",\"\",INDEX(Скрещивание!$A$2:$A$6,MOD(ROW(B36),5)+1))","v":""},{"$f":"IFERROR(VLOOKUP(B33,Скрещивание!$A$2:$B$6,2,),\"\")","v":""},{"$f":"IFERROR(INDEX(Скрещивание!$C$2:$H$6,MATCH(B33,Скрещивание!$A$2:$A$6,),MATCH(A33,Скрещивание!$C$1:$H$1,)),\"\")","v":""}]
[{"$f":"IFERROR(INDEX(Скрещивание!$C$1:$H$1,INT(ROW(A37)/5)),\"\")","v":""},{"$f":"IF(A34=\"\",\"\",INDEX(Скрещивание!$A$2:$A$6,MOD(ROW(B37),5)+1))","v":""},{"$f":"IFERROR(VLOOKUP(B34,Скрещивание!$A$2:$B$6,2,),\"\")","v":""},{"$f":"IFERROR(INDEX(Скрещивание!$C$2:$H$6,MATCH(B34,Скрещивание!$A$2:$A$6,),MATCH(A34,Скрещивание!$C$1:$H$1,)),\"\")","v":""}]
[{"$f":"IFERROR(INDEX(Скрещивание!$C$1:$H$1,INT(ROW(A38)/5)),\"\")","v":""},{"$f":"IF(A35=\"\",\"\",INDEX(Скрещивание!$A$2:$A$6,MOD(ROW(B38),5)+1))","v":""},{"$f":"IFERROR(VLOOKUP(B35,Скрещивание!$A$2:$B$6,2,),\"\")","v":""},{"$f":"IFERROR(INDEX(Скрещивание!$C$2:$H$6,MATCH(B35,Скрещивание!$A$2:$A$6,),MATCH(A35,Скрещивание!$C$1:$H$1,)),\"\")","v":""}]
[{"$f":"IFERROR(INDEX(Скрещивание!$C$1:$H$1,INT(ROW(A39)/5)),\"\")","v":""},{"$f":"IF(A36=\"\",\"\",INDEX(Скрещивание!$A$2:$A$6,MOD(ROW(B39),5)+1))","v":""},{"$f":"IFERROR(VLOOKUP(B36,Скрещивание!$A$2:$B$6,2,),\"\")","v":""},{"$f":"IFERROR(INDEX(Скрещивание!$C$2:$H$6,MATCH(B36,Скрещивание!$A$2:$A$6,),MATCH(A36,Скрещивание!$C$1:$H$1,)),\"\")","v":""}]
[{"$f":"IFERROR(INDEX(Скрещивание!$C$1:$H$1,INT(ROW(A40)/5)),\"\")","v":""},{"$f":"IF(A37=\"\",\"\",INDEX(Скрещивание!$A$2:$A$6,MOD(ROW(B40),5)+1))","v":""},{"$f":"IFERROR(VLOOKUP(B37,Скрещивание!$A$2:$B$6,2,),\"\")","v":""},{"$f":"IFERROR(INDEX(Скрещивание!$C$2:$H$6,MATCH(B37,Скрещивание!$A$2:$A$6,),MATCH(A37,Скрещивание!$C$1:$H$1,)),\"\")","v":""}]
[{"$f":"IFERROR(INDEX(Скрещивание!$C$1:$H$1,INT(ROW(A41)/5)),\"\")","v":""},{"$f":"IF(A38=\"\",\"\",INDEX(Скрещивание!$A$2:$A$6,MOD(ROW(B41),5)+1))","v":""},{"$f":"IFERROR(VLOOKUP(B38,Скрещивание!$A$2:$B$6,2,),\"\")","v":""},{"$f":"IFERROR(INDEX(Скрещивание!$C$2:$H$6,MATCH(B38,Скрещивание!$A$2:$A$6,),MATCH(A38,Скрещивание!$C$1:$H$1,)),\"\")","v":""}]
[{"$f":"IFERROR(INDEX(Скрещивание!$C$1:$H$1,INT(ROW(A42)/5)),\"\")","v":""},{"$f":"IF(A39=\"\",\"\",INDEX(Скрещивание!$A$2:$A$6,MOD(ROW(B42),5)+1))","v":""},{"$f":"IFERROR(VLOOKUP(B39,Скрещивание!$A$2:$B$6,2,),\"\")","v":""},{"$f":"IFERROR(INDEX(Скрещивание!$C$2:$H$6,MATCH(B39,Скрещивание!$A$2:$A$6,),MATCH(A39,Скрещивание!$C$1:$H$1,)),\"\")","v":""}]
[{"$f":"IFERROR(INDEX(Скрещивание!$C$1:$H$1,INT(ROW(A43)/5)),\"\")","v":""},{"$f":"IF(A40=\"\",\"\",INDEX(Скрещивание!$A$2:$A$6,MOD(ROW(B43),5)+1))","v":""},{"$f":"IFERROR(VLOOKUP(B40,Скрещивание!$A$2:$B$6,2,),\"\")","v":""},{"$f":"IFERROR(INDEX(Скрещивание!$C$2:$H$6,MATCH(B40,Скрещивание!$A$2:$A$6,),MATCH(A40,Скрещивание!$C$1:$H$1,)),\"\")","v":""}]
[{"$f":"IFERROR(INDEX(Скрещивание!$C$1:$H$1,INT(ROW(A44)/5)),\"\")","v":""},{"$f":"IF(A41=\"\",\"\",INDEX(Скрещивание!$A$2:$A$6,MOD(ROW(B44),5)+1))","v":""},{"$f":"IFERROR(VLOOKUP(B41,Скрещивание!$A$2:$B$6,2,),\"\")","v":""},{"$f":"IFERROR(INDEX(Скрещивание!$C$2:$H$6,MATCH(B41,Скрещивание!$A$2:$A$6,),MATCH(A41,Скрещивание!$C$1:$H$1,)),\"\")","v":""}]
[{"$f":"IFERROR(INDEX(Скрещивание!$C$1:$H$1,INT(ROW(A45)/5)),\"\")","v":""},{"$f":"IF(A42=\"\",\"\",INDEX(Скрещивание!$A$2:$A$6,MOD(ROW(B45),5)+1))","v":""},{"$f":"IFERROR(VLOOKUP(B42,Скрещивание!$A$2:$B$6,2,),\"\")","v":""},{"$f":"IFERROR(INDEX(Скрещивание!$C$2:$H$6,MATCH(B42,Скрещивание!$A$2:$A$6,),MATCH(A42,Скрещивание!$C$1:$H$1,)),\"\")","v":""}]
[{"$f":"IFERROR(INDEX(Скрещивание!$C$1:$H$1,INT(ROW(A46)/5)),\"\")","v":""},{"$f":"IF(A43=\"\",\"\",INDEX(Скрещивание!$A$2:$A$6,MOD(ROW(B46),5)+1))","v":""},{"$f":"IFERROR(VLOOKUP(B43,Скрещивание!$A$2:$B$6,2,),\"\")","v":""},{"$f":"IFERROR(INDEX(Скрещивание!$C$2:$H$6,MATCH(B43,Скрещивание!$A$2:$A$6,),MATCH(A43,Скрещивание!$C$1:$H$1,)),\"\")","v":""}]
[{"$f":"IFERROR(INDEX(Скрещивание!$C$1:$H$1,INT(ROW(A47)/5)),\"\")","v":""},{"$f":"IF(A44=\"\",\"\",INDEX(Скрещивание!$A$2:$A$6,MOD(ROW(B47),5)+1))","v":""},{"$f":"IFERROR(VLOOKUP(B44,Скрещивание!$A$2:$B$6,2,),\"\")","v":""},{"$f":"IFERROR(INDEX(Скрещивание!$C$2:$H$6,MATCH(B44,Скрещивание!$A$2:$A$6,),MATCH(A44,Скрещивание!$C$1:$H$1,)),\"\")","v":""}]
[{"$f":"IFERROR(INDEX(Скрещивание!$C$1:$H$1,INT(ROW(A48)/5)),\"\")","v":""},{"$f":"IF(A45=\"\",\"\",INDEX(Скрещивание!$A$2:$A$6,MOD(ROW(B48),5)+1))","v":""},{"$f":"IFERROR(VLOOKUP(B45,Скрещивание!$A$2:$B$6,2,),\"\")","v":""},{"$f":"IFERROR(INDEX(Скрещивание!$C$2:$H$6,MATCH(B45,Скрещивание!$A$2:$A$6,),MATCH(A45,Скрещивание!$C$1:$H$1,)),\"\")","v":""}]
[{"$f":"IFERROR(INDEX(Скрещивание!$C$1:$H$1,INT(ROW(A49)/5)),\"\")","v":""},{"$f":"IF(A46=\"\",\"\",INDEX(Скрещивание!$A$2:$A$6,MOD(ROW(B49),5)+1))","v":""},{"$f":"IFERROR(VLOOKUP(B46,Скрещивание!$A$2:$B$6,2,),\"\")","v":""},{"$f":"IFERROR(INDEX(Скрещивание!$C$2:$H$6,MATCH(B46,Скрещивание!$A$2:$A$6,),MATCH(A46,Скрещивание!$C$1:$H$1,)),\"\")","v":""}]
[{"$f":"IFERROR(INDEX(Скрещивание!$C$1:$H$1,INT(ROW(A50)/5)),\"\")","v":""},{"$f":"IF(A47=\"\",\"\",INDEX(Скрещивание!$A$2:$A$6,MOD(ROW(B50),5)+1))","v":""},{"$f":"IFERROR(VLOOKUP(B47,Скрещивание!$A$2:$B$6,2,),\"\")","v":""},{"$f":"IFERROR(INDEX(Скрещивание!$C$2:$H$6,MATCH(B47,Скрещивание!$A$2:$A$6,),MATCH(A47,Скрещивание!$C$1:$H$1,)),\"\")","v":""}]
[{"$f":"IFERROR(INDEX(Скрещивание!$C$1:$H$1,INT(ROW(A51)/5)),\"\")","v":""},{"$f":"IF(A48=\"\",\"\",INDEX(Скрещивание!$A$2:$A$6,MOD(ROW(B51),5)+1))","v":""},{"$f":"IFERROR(VLOOKUP(B48,Скрещивание!$A$2:$B$6,2,),\"\")","v":""},{"$f":"IFERROR(INDEX(Скрещивание!$C$2:$H$6,MATCH(B48,Скрещивание!$A$2:$A$6,),MATCH(A48,Скрещивание!$C$1:$H$1,)),\"\")","v":""}]
[{"$f":"IFERROR(INDEX(Скрещивание!$C$1:$H$1,INT(ROW(A52)/5)),\"\")","v":""},{"$f":"IF(A49=\"\",\"\",INDEX(Скрещивание!$A$2:$A$6,MOD(ROW(B52),5)+1))","v":""},{"$f":"IFERROR(VLOOKUP(B49,Скрещивание!$A$2:$B$6,2,),\"\")","v":""},{"$f":"IFERROR(INDEX(Скрещивание!$C$2:$H$6,MATCH(B49,Скрещивание!$A$2:$A$6,),MATCH(A49,Скрещивание!$C$1:$H$1,)),\"\")","v":""}]
[{"$f":"IFERROR(INDEX(Скрещивание!$C$1:$H$1,INT(ROW(A53)/5)),\"\")","v":""},{"$f":"IF(A50=\"\",\"\",INDEX(Скрещивание!$A$2:$A$6,MOD(ROW(B53),5)+1))","v":""},{"$f":"IFERROR(VLOOKUP(B50,Скрещивание!$A$2:$B$6,2,),\"\")","v":""},{"$f":"IFERROR(INDEX(Скрещивание!$C$2:$H$6,MATCH(B50,Скрещивание!$A$2:$A$6,),MATCH(A50,Скрещивание!$C$1:$H$1,)),\"\")","v":""}]
[{"$f":"IFERROR(INDEX(Скрещивание!$C$1:$H$1,INT(ROW(A54)/5)),\"\")","v":""},{"$f":"IF(A51=\"\",\"\",INDEX(Скрещивание!$A$2:$A$6,MOD(ROW(B54),5)+1))","v":""},{"$f":"IFERROR(VLOOKUP(B51,Скрещивание!$A$2:$B$6,2,),\"\")","v":""},{"$f":"IFERROR(INDEX(Скрещивание!$C$2:$H$6,MATCH(B51,Скрещивание!$A$2:$A$6,),MATCH(A51,Скрещивание!$C$1:$H$1,)),\"\")","v":""}]
[{"$f":"IFERROR(INDEX(Скрещивание!$C$1:$H$1,INT(ROW(A55)/5)),\"\")","v":""},{"$f":"IF(A52=\"\",\"\",INDEX(Скрещивание!$A$2:$A$6,MOD(ROW(B55),5)+1))","v":""},{"$f":"IFERROR(VLOOKUP(B52,Скрещивание!$A$2:$B$6,2,),\"\")","v":""},{"$f":"IFERROR(INDEX(Скрещивание!$C$2:$H$6,MATCH(B52,Скрещивание!$A$2:$A$6,),MATCH(A52,Скрещивание!$C$1:$H$1,)),\"\")","v":""}]
[{"$f":"IFERROR(INDEX(Скрещивание!$C$1:$H$1,INT(ROW(A56)/5)),\"\")","v":""},{"$f":"IF(A53=\"\",\"\",INDEX(Скрещивание!$A$2:$A$6,MOD(ROW(B56),5)+1))","v":""},{"$f":"IFERROR(VLOOKUP(B53,Скрещивание!$A$2:$B$6,2,),\"\")","v":""},{"$f":"IFERROR(INDEX(Скрещивание!$C$2:$H$6,MATCH(B53,Скрещивание!$A$2:$A$6,),MATCH(A53,Скрещивание!$C$1:$H$1,)),\"\")","v":""}]