{"text_format":"1","workbook":"xlsx","n_sheets":8,"sheets":["123(Вариант)","Таблица","Календарь","123","Перчатки","Электроинструмент","Руч.инструм.","Лист1"],"not_rendered":{"charts":0,"images":3,"macros":1,"external_links":0,"defined_names":5,"comments":0,"pivot_tables":1},"unopened":[],"bounds":{"document_bytes":16777216,"sheet_cells":100000,"rows_first":2000,"rows_last":500,"rows_between":2000,"halvings":0,"cell_chars":16384,"cell_head_chars":4096},"cells_cut":0,"cells_raw":0,"read":"whole","date_system":"1900"}

{"sheet":"123(Вариант)","index":0,"n_rows":29,"n_cols":6,"rows_kept":29,"cut":false,"hidden":false,"merged":[]}
["Годы","2020"]
["Дата отправки на испытание","июн"]
[]
["Место нахождения","Наименование СИЗ","Поряд. № СИЗ","Инв. №","Дата последней годовой проверки","Дата следующей годовой проверки"]
["АТС","Индикатор ИНО-500 напряжения-отвертк",6,"LOC100422159","2019-08-20","2020-08-20"]
[null,"Отвертка","3-1","LOC100431348","2019-08-19","2020-08-19"]
[null,null,"3-2","LOC100431348","2019-08-19","2020-08-19"]
[null,null,"3-3","LOC100431348","2019-08-19","2020-08-19"]
[null,null,"3-4","LOC100431348","2019-08-19","2020-08-19"]
[null,null,"3-5","LOC100431348","2019-08-19","2020-08-19"]
[null,null,"3-6","LOC100431348","2019-08-19","2020-08-19"]
["ВБ","Индикатор ИНО-500 напряжения-отвертк",10,"LOC100422159","2019-08-20","2020-08-20"]
[null,"Отвертка","4-1","LOC100431348","2019-08-19","2020-08-19"]
[null,null,"4-2","LOC100431348","2019-08-19","2020-08-19"]
[null,null,"4-3","LOC100431348","2019-08-19","2020-08-19"]
[null,null,"4-4","LOC100431348","2019-08-19","2020-08-19"]
[null,null,"4-5","LOC100431348","2019-08-19","2020-08-19"]
[null,null,"4-6","LOC100431348","2019-08-19","2020-08-19"]
["Выпрям.","Бокорезы","2-3","LOC100415755","2019-08-23","2020-08-23"]
[null,"Индикатор напряж.ПИН90-2М",5,"LOC100422167","2019-08-20","2020-08-20"]
[null,"Круглогубцы","2-2","LOC100427548","2019-08-23","2020-08-23"]
[null,"Отвертка","2-1","LOC100431335","2019-08-23","2020-08-23"]
[null,null,"2-2","LOC100431335","2019-08-23","2020-08-23"]
[null,null,"2-3","LOC100431335","2019-08-23","2020-08-23"]
[null,null,"2-4","LOC100431335","2019-08-23","2020-08-23"]
[null,null,"2-5","LOC100431335","2019-08-23","2020-08-23"]
[null,null,"2-6","LOC100431335","2019-08-23","2020-08-23"]
[null,"Пассатижи","2-1","LOC100433506","2019-08-23","2020-08-23"]
["Общий итог"]

{"sheet":"Таблица","index":1,"n_rows":76,"n_cols":17,"rows_kept":76,"cut":false,"hidden":false,"merged":[[63,15,75,15],[1,1,1,10],[0,1,0,10],[3,15,8,15],[22,15,24,15],[26,15,34,15],[10,15,13,15],[15,15,20,15],[36,15,44,15],[46,15,51,15],[53,15,58,15],[60,15,61,15]]}
[null,"СПИСОК",null,null,null,null,null,null,null,null,null,null,null,null,null,"проведен периодический осмотр"]
[null,"CИЗ, находящихся на участке связи № 5",null,null,null,null,null,null,null,null,null,null,null,null,null,{"$f":"TODAY()","v":"2020-05-30"}]
["В календарь","№ п/п","Наименование СИЗ","Поряд. № СИЗ","Место нахождения","Инв. №","Дата последней годовой проверки","Дата следующей годовой проверки","Дата отправки на испытание","Дата периодического осмотра","Дата следующего квартального осмотра","Дата следующего квартального осмотра","Дата следующего квартального осмотра","Дата следующего квартального осмотра","Дата следующего квартального осмотра","Испытание ","Здесь нужна отметка"]
[{"$f":"IF(AND(EOMONTH(1&Календарь!$D$2,0)>=INDEX(B4:K4,MATCH(Календарь!$B$2,Календарь!$A$4:$J$4,)),INDEX(B4:K4,MATCH(Календарь!$B$2,Календарь!$A$4:$J$4,))>0,Q4=\"\"),MAX($A$1:A3)+1,\"\")","v":1},1,"Перчатки диэлектрические",4,"Выпрям.","LOC100433954","2020-03-11",{"$f":"IF(EDATE(G4,6)>91,EDATE(G4,6),-50)","v":"2020-09-11"},{"$f":"IF(EDATE(G4,4)>91,EDATE(G4,4),-50)","v":"2020-07-11"},{"$f":"G4+87","v":"2020-06-06"},{"$f":"J4+87","v":"2020-09-01"},null,null,null,null,"Испытание 1 раз в 6 месяцев, осмотр 1 раз в 3 месяца"]
[{"$f":"IF(AND(EOMONTH(1&Календарь!$D$2,0)>=INDEX(B5:K5,MATCH(Календарь!$B$2,Календарь!$A$4:$J$4,)),INDEX(B5:K5,MATCH(Календарь!$B$2,Календарь!$A$4:$J$4,))>0,Q5=\"\"),MAX($A$1:A4)+1,\"\")","v":2},2,"Перчатки диэлектрические",5,"ВБ","LOC100433954","2020-03-11",{"$f":"IF(EDATE(G5,6)>91,EDATE(G5,6),-50)","v":"2020-09-11"},{"$f":"IF(EDATE(G5,4)>91,EDATE(G5,4),-50)","v":"2020-07-11"},{"$f":"G5+87","v":"2020-06-06"},{"$f":"J5+87","v":"2020-09-01"}]
[{"$f":"IF(AND(EOMONTH(1&Календарь!$D$2,0)>=INDEX(B6:K6,MATCH(Календарь!$B$2,Календарь!$A$4:$J$4,)),INDEX(B6:K6,MATCH(Календарь!$B$2,Календарь!$A$4:$J$4,))>0,Q6=\"\"),MAX($A$1:A5)+1,\"\")","v":3},3,"Перчатки диэлектрические",31,"АТС","LOC100433954","2020-03-11","2020-09-11","2020-07-11","2020-06-06","2020-09-01"]
[{"$f":"IF(AND(EOMONTH(1&Календарь!$D$2,0)>=INDEX(B7:K7,MATCH(Календарь!$B$2,Календарь!$A$4:$J$4,)),INDEX(B7:K7,MATCH(Календарь!$B$2,Календарь!$A$4:$J$4,))>0,Q7=\"\"),MAX($A$1:A6)+1,\"\")","v":""},4,"Перчатки диэлектрические",9,"ВБ","LOC100433954","на испытании"]
[{"$f":"IF(AND(EOMONTH(1&Календарь!$D$2,0)>=INDEX(B8:K8,MATCH(Календарь!$B$2,Календарь!$A$4:$J$4,)),INDEX(B8:K8,MATCH(Календарь!$B$2,Календарь!$A$4:$J$4,))>0,Q8=\"\"),MAX($A$1:A7)+1,\"\")","v":""},5,"Перчатки диэлектрические",10,"АТС","LOC100433954","на испытании"]
[{"$f":"IF(AND(EOMONTH(1&Календарь!$D$2,0)>=INDEX(B9:K9,MATCH(Календарь!$B$2,Календарь!$A$4:$J$4,)),INDEX(B9:K9,MATCH(Календарь!$B$2,Календарь!$A$4:$J$4,))>0,Q9=\"\"),MAX($A$1:A8)+1,\"\")","v":""},6,"Перчатки диэлектрические (новые)",11,"Выпрям.","LOC100828099","на испытании"]
[{"$f":"IF(AND(EOMONTH(1&Календарь!$D$2,0)>=INDEX(B10:K10,MATCH(Календарь!$B$2,Календарь!$A$4:$J$4,)),INDEX(B10:K10,MATCH(Календарь!$B$2,Календарь!$A$4:$J$4,))>0,Q10=\"\"),MAX($A$1:A9)+1,\"\")","v":""}]
[{"$f":"IF(AND(EOMONTH(1&Календарь!$D$2,0)>=INDEX(B11:K11,MATCH(Календарь!$B$2,Календарь!$A$4:$J$4,)),INDEX(B11:K11,MATCH(Календарь!$B$2,Календарь!$A$4:$J$4,))>0,Q11=\"\"),MAX($A$1:A10)+1,\"\")","v":""},7,"Боты диэлектрические",12,"АТС","LOC100416152","2020-03-11",{"$f":"IF(EDATE(G11,36)>91,EDATE(G11,36),-50)","v":"2023-03-11"},{"$f":"IF(EDATE(G11,34)>91,EDATE(G11,34),-50)","v":"2023-01-11"},{"$f":"G11+175","v":"2020-09-02"},{"$f":"J11+175","v":"2021-02-24"},{"$f":"K11+175","v":"2021-08-18"},{"$f":"L11+175","v":"2022-02-09"},{"$f":"M11+175","v":"2022-08-03"},{"$f":"N11+175","v":"2023-01-25"},"Испытание 1 раз в 3 года, осмотр 1 раз в 6 месяца"]
[{"$f":"IF(AND(EOMONTH(1&Календарь!$D$2,0)>=INDEX(B12:K12,MATCH(Календарь!$B$2,Календарь!$A$4:$J$4,)),INDEX(B12:K12,MATCH(Календарь!$B$2,Календарь!$A$4:$J$4,))>0,Q12=\"\"),MAX($A$1:A11)+1,\"\")","v":""},8,"Боты диэлектрические",11,"Выпрям.","350010000715","2019-02-19",{"$f":"IF(EDATE(G12,36)>91,EDATE(G12,36),-50)","v":"2022-02-19"},{"$f":"IF(EDATE(G12,34)>91,EDATE(G12,34),-50)","v":"2021-12-19"},{"$f":"G12+175","v":"2019-08-13"},{"$f":"J12+175","v":"2020-02-04"},"2020-07-28","2021-01-19","2021-07-13","2022-01-04"]
[{"$f":"IF(AND(EOMONTH(1&Календарь!$D$2,0)>=INDEX(B13:K13,MATCH(Календарь!$B$2,Календарь!$A$4:$J$4,)),INDEX(B13:K13,MATCH(Календарь!$B$2,Календарь!$A$4:$J$4,))>0,Q13=\"\"),MAX($A$1:A12)+1,\"\")","v":""},7,"Боты диэлектрические",9,"АТС","350010000716","2019-11-25",{"$f":"IF(EDATE(G13,36)>91,EDATE(G13,36),-50)","v":"2022-11-25"},{"$f":"IF(EDATE(G13,34)>91,EDATE(G13,34),-50)","v":"2022-09-25"},{"$f":"G13+175","v":"2020-05-18"},{"$f":"J13+175","v":"2020-11-09"},{"$f":"K13+175","v":"2021-05-03"},{"$f":"L13+175","v":"2021-10-25"},{"$f":"M13+175","v":"2022-04-18"},{"$f":"N13+175","v":"2022-10-10"}]
[{"$f":"IF(AND(EOMONTH(1&Календарь!$D$2,0)>=INDEX(B14:K14,MATCH(Календарь!$B$2,Календарь!$A$4:$J$4,)),INDEX(B14:K14,MATCH(Календарь!$B$2,Календарь!$A$4:$J$4,))>0,Q14=\"\"),MAX($A$1:A13)+1,\"\")","v":""},7,"Боты диэлектрические (новые)",10,"Выпрям.","LOC100827944","на испытании"]
[{"$f":"IF(AND(EOMONTH(1&Календарь!$D$2,0)>=INDEX(B15:K15,MATCH(Календарь!$B$2,Календарь!$A$4:$J$4,)),INDEX(B15:K15,MATCH(Календарь!$B$2,Календарь!$A$4:$J$4,))>0,Q15=\"\"),MAX($A$1:A14)+1,\"\")","v":""},10]
[{"$f":"IF(AND(EOMONTH(1&Календарь!$D$2,0)>=INDEX(B16:K16,MATCH(Календарь!$B$2,Календарь!$A$4:$J$4,)),INDEX(B16:K16,MATCH(Календарь!$B$2,Календарь!$A$4:$J$4,))>0,Q16=\"\"),MAX($A$1:A15)+1,\"\")","v":4},11,"Индикатор напряж.ПИН90-2М",5,"Выпрям.","LOC100422167","2019-08-20",{"$f":"IF(EDATE(G16,12)>91,EDATE(G16,12),-50)","v":"2020-08-20"},{"$f":"IF(EDATE(G16,10)>91,EDATE(G16,10),-50)","v":"2020-06-20"},{"$f":"G16+87","v":"2019-11-15"},{"$f":"J16+87","v":"2020-02-10"},{"$f":"K16+87","v":"2020-05-07"},{"$f":"L16+87","v":"2020-08-02"},null,null,"Испытание 1 раз в год осмотр 1 раз в 3 месяца"]
[{"$f":"IF(AND(EOMONTH(1&Календарь!$D$2,0)>=INDEX(B17:K17,MATCH(Календарь!$B$2,Календарь!$A$4:$J$4,)),INDEX(B17:K17,MATCH(Календарь!$B$2,Календарь!$A$4:$J$4,))>0,Q17=\"\"),MAX($A$1:A16)+1,\"\")","v":5},12,"Индикатор ИНО-500 напряжения-отвертк",6,"АТС","LOC100422159","2019-08-20","2020-08-20",{"$f":"IF(EDATE(G17,10)>91,EDATE(G17,10),-50)","v":"2020-06-20"},"2019-11-15",{"$f":"J17+87","v":"2020-02-10"},{"$f":"K17+87","v":"2020-05-07"},"2020-08-02"]
[{"$f":"IF(AND(EOMONTH(1&Календарь!$D$2,0)>=INDEX(B18:K18,MATCH(Календарь!$B$2,Календарь!$A$4:$J$4,)),INDEX(B18:K18,MATCH(Календарь!$B$2,Календарь!$A$4:$J$4,))>0,Q18=\"\"),MAX($A$1:A17)+1,\"\")","v":6},13,"Индикатор ИНО-500 напряжения-отвертк",10,"ВБ","LOC100422159","2019-08-20","2020-08-20","2020-06-20","2019-11-15","2020-02-10","2020-05-07","2020-08-02"]
[{"$f":"IF(AND(EOMONTH(1&Календарь!$D$2,0)>=INDEX(B19:K19,MATCH(Календарь!$B$2,Календарь!$A$4:$J$4,)),INDEX(B19:K19,MATCH(Календарь!$B$2,Календарь!$A$4:$J$4,))>0,Q19=\"\"),MAX($A$1:A18)+1,\"\")","v":""},14,"Индикатор ИНО-500 напряжения-отвертк",9,"ВБ","LOC100422159","2019-11-25","2020-11-25","2020-09-25","2020-02-20",{"$f":"IF(EDATE(J19,3)>3,EDATE(J19,3),-3)","v":"2020-05-20"},"2020-08-15","2020-11-10"]
[{"$f":"IF(AND(EOMONTH(1&Календарь!$D$2,0)>=INDEX(B20:K20,MATCH(Календарь!$B$2,Календарь!$A$4:$J$4,)),INDEX(B20:K20,MATCH(Календарь!$B$2,Календарь!$A$4:$J$4,))>0,Q20=\"\"),MAX($A$1:A19)+1,\"\")","v":""},15,"Индикатор ИНО-500 напряжения-отвертк",8,"АТС","LOC100422159","2019-11-25","2020-11-25","2020-09-25","2020-02-20","2020-05-20","2020-08-15","2020-11-10"]
[{"$f":"IF(AND(EOMONTH(1&Календарь!$D$2,0)>=INDEX(B21:K21,MATCH(Календарь!$B$2,Календарь!$A$4:$J$4,)),INDEX(B21:K21,MATCH(Календарь!$B$2,Календарь!$A$4:$J$4,))>0,Q21=\"\"),MAX($A$1:A20)+1,\"\")","v":""},16,"Индикатор напряж.ПИН90-2М",7,"Выпрям.","LOC100422167","2019-11-25","2020-11-25","2020-09-25","2020-02-20","2020-05-20","2020-08-15","2020-11-10"]
[{"$f":"IF(AND(EOMONTH(1&Календарь!$D$2,0)>=INDEX(B22:K22,MATCH(Календарь!$B$2,Календарь!$A$4:$J$4,)),INDEX(B22:K22,MATCH(Календарь!$B$2,Календарь!$A$4:$J$4,))>0,Q22=\"\"),MAX($A$1:A21)+1,\"\")","v":""},17]
[{"$f":"IF(AND(EOMONTH(1&Календарь!$D$2,0)>=INDEX(B23:K23,MATCH(Календарь!$B$2,Календарь!$A$4:$J$4,)),INDEX(B23:K23,MATCH(Календарь!$B$2,Календарь!$A$4:$J$4,))>0,Q23=\"\"),MAX($A$1:A22)+1,\"\")","v":""},18,"Ковер диэлектрический  ","1-7","ЛАЗ",null,null,null,null,"2020-06-25",{"$f":"J23+175","v":"2020-12-17"},{"$f":"K23+175","v":"2021-06-10"},"2021-12-02","2022-05-26","2022-11-17","Осмотр 1 раз в 6 месяца"]
[{"$f":"IF(AND(EOMONTH(1&Календарь!$D$2,0)>=INDEX(B24:K24,MATCH(Календарь!$B$2,Календарь!$A$4:$J$4,)),INDEX(B24:K24,MATCH(Календарь!$B$2,Календарь!$A$4:$J$4,))>0,Q24=\"\"),MAX($A$1:A23)+1,\"\")","v":""},19,"Ковер диэлектрический  ","8-9","АТС",null,null,null,null,"2020-06-25",{"$f":"J24+175","v":"2020-12-17"},"2021-06-10","2021-12-02","2022-05-26","2022-11-17"]
[{"$f":"IF(AND(EOMONTH(1&Календарь!$D$2,0)>=INDEX(B25:K25,MATCH(Календарь!$B$2,Календарь!$A$4:$J$4,)),INDEX(B25:K25,MATCH(Календарь!$B$2,Календарь!$A$4:$J$4,))>0,Q25=\"\"),MAX($A$1:A24)+1,\"\")","v":""},20,"Ковер диэлектрический  ","10-14","Выпрям.",null,null,null,null,"2020-06-25","2020-12-17","2021-06-10","2021-12-02","2022-05-26","2022-11-17"]
[{"$f":"IF(AND(EOMONTH(1&Календарь!$D$2,0)>=INDEX(B26:K26,MATCH(Календарь!$B$2,Календарь!$A$4:$J$4,)),INDEX(B26:K26,MATCH(Календарь!$B$2,Календарь!$A$4:$J$4,))>0,Q26=\"\"),MAX($A$1:A25)+1,\"\")","v":""},21,"Набор отверток № 1 (резерв)"]
[{"$f":"IF(AND(EOMONTH(1&Календарь!$D$2,0)>=INDEX(B27:K27,MATCH(Календарь!$B$2,Календарь!$A$4:$J$4,)),INDEX(B27:K27,MATCH(Календарь!$B$2,Календарь!$A$4:$J$4,))>0,Q27=\"\"),MAX($A$1:A26)+1,\"\")","v":""},22,"Отвертка","1-1","КАЗ №2","LOC100431335","2019-11-25",{"$f":"IF(EDATE(G27,12)>91,EDATE(G27,12),-50)","v":"2020-11-25"},{"$f":"IF(EDATE(G27,10)>91,EDATE(G27,10),-50)","v":"2020-09-25"},{"$f":"G27+87","v":"2020-02-20"},{"$f":"J27+87","v":"2020-05-17"},{"$f":"K27+87","v":"2020-08-12"},{"$f":"L27+87","v":"2020-11-07"},null,null,"Испытание 1 раз в год осмотр 1 раз в 3 месяца"]
[{"$f":"IF(AND(EOMONTH(1&Календарь!$D$2,0)>=INDEX(B28:K28,MATCH(Календарь!$B$2,Календарь!$A$4:$J$4,)),INDEX(B28:K28,MATCH(Календарь!$B$2,Календарь!$A$4:$J$4,))>0,Q28=\"\"),MAX($A$1:A27)+1,\"\")","v":""},23,"Отвертка","1-2","КАЗ №2","LOC100431335","2019-11-25","2020-11-25","2020-09-25",{"$f":"J27","v":"2020-02-20"},{"$f":"J28+87","v":"2020-05-17"},"2020-08-12","2020-11-07"]
[{"$f":"IF(AND(EOMONTH(1&Календарь!$D$2,0)>=INDEX(B29:K29,MATCH(Календарь!$B$2,Календарь!$A$4:$J$4,)),INDEX(B29:K29,MATCH(Календарь!$B$2,Календарь!$A$4:$J$4,))>0,Q29=\"\"),MAX($A$1:A28)+1,\"\")","v":""},24,"Отвертка","1-3","КАЗ №2","LOC100431335","2019-11-25","2020-11-25","2020-09-25",{"$f":"J27","v":"2020-02-20"},"2020-05-17","2020-08-12","2020-11-07"]
[{"$f":"IF(AND(EOMONTH(1&Календарь!$D$2,0)>=INDEX(B30:K30,MATCH(Календарь!$B$2,Календарь!$A$4:$J$4,)),INDEX(B30:K30,MATCH(Календарь!$B$2,Календарь!$A$4:$J$4,))>0,Q30=\"\"),MAX($A$1:A29)+1,\"\")","v":""},25,"Отвертка","1-4","КАЗ №2","LOC100431335","2019-11-25","2020-11-25","2020-09-25",{"$f":"J27","v":"2020-02-20"},"2020-05-17","2020-08-12","2020-11-07"]
[{"$f":"IF(AND(EOMONTH(1&Календарь!$D$2,0)>=INDEX(B31:K31,MATCH(Календарь!$B$2,Календарь!$A$4:$J$4,)),INDEX(B31:K31,MATCH(Календарь!$B$2,Календарь!$A$4:$J$4,))>0,Q31=\"\"),MAX($A$1:A30)+1,\"\")","v":""},26,"Отвертка","1-5","КАЗ №2","LOC100431335","2019-11-25","2020-11-25","2020-09-25",{"$f":"J27","v":"2020-02-20"},"2020-05-17","2020-08-12","2020-11-07"]
[{"$f":"IF(AND(EOMONTH(1&Календарь!$D$2,0)>=INDEX(B32:K32,MATCH(Календарь!$B$2,Календарь!$A$4:$J$4,)),INDEX(B32:K32,MATCH(Календарь!$B$2,Календарь!$A$4:$J$4,))>0,Q32=\"\"),MAX($A$1:A31)+1,\"\")","v":""},27,"Отвертка","1-6","КАЗ №2","LOC100431335","2019-11-25","2020-11-25","2020-09-25",{"$f":"J27","v":"2020-02-20"},"2020-05-17","2020-08-12","2020-11-07"]
[{"$f":"IF(AND(EOMONTH(1&Календарь!$D$2,0)>=INDEX(B33:K33,MATCH(Календарь!$B$2,Календарь!$A$4:$J$4,)),INDEX(B33:K33,MATCH(Календарь!$B$2,Календарь!$A$4:$J$4,))>0,Q33=\"\"),MAX($A$1:A32)+1,\"\")","v":""},28,"Пассатижи","1-1","КАЗ №2","LOC100433506","2019-11-25","2020-11-25","2020-09-25",{"$f":"G33+87","v":"2020-02-20"},"2020-05-17","2020-08-12","2020-11-07"]
[{"$f":"IF(AND(EOMONTH(1&Календарь!$D$2,0)>=INDEX(B34:K34,MATCH(Календарь!$B$2,Календарь!$A$4:$J$4,)),INDEX(B34:K34,MATCH(Календарь!$B$2,Календарь!$A$4:$J$4,))>0,Q34=\"\"),MAX($A$1:A33)+1,\"\")","v":""},29,"Круглогубцы","1-2","КАЗ №2","LOC100427548","2019-11-25","2020-11-25","2020-09-25","2020-02-20","2020-05-17","2020-08-12","2020-11-07"]
[{"$f":"IF(AND(EOMONTH(1&Календарь!$D$2,0)>=INDEX(B35:K35,MATCH(Календарь!$B$2,Календарь!$A$4:$J$4,)),INDEX(B35:K35,MATCH(Календарь!$B$2,Календарь!$A$4:$J$4,))>0,Q35=\"\"),MAX($A$1:A34)+1,\"\")","v":""},30,"Бокорезы","1-3","КАЗ №2","LOC100415755","2019-11-25","2020-11-25","2020-09-25","2020-02-20","2020-05-17","2020-08-12","2020-11-07"]
[{"$f":"IF(AND(EOMONTH(1&Календарь!$D$2,0)>=INDEX(B36:K36,MATCH(Календарь!$B$2,Календарь!$A$4:$J$4,)),INDEX(B36:K36,MATCH(Календарь!$B$2,Календарь!$A$4:$J$4,))>0,Q36=\"\"),MAX($A$1:A35)+1,\"\")","v":""},31,"Набор отверток № 2"]
[{"$f":"IF(AND(EOMONTH(1&Календарь!$D$2,0)>=INDEX(B37:K37,MATCH(Календарь!$B$2,Календарь!$A$4:$J$4,)),INDEX(B37:K37,MATCH(Календарь!$B$2,Календарь!$A$4:$J$4,))>0,Q37=\"\"),MAX($A$1:A36)+1,\"\")","v":7},32,"Отвертка","2-1","Выпрям.","LOC100431335","2019-08-23",{"$f":"IF(EDATE(G37,12)>91,EDATE(G37,12),-50)","v":"2020-08-23"},{"$f":"IF(EDATE(G37,10)>91,EDATE(G37,10),-50)","v":"2020-06-23"},"2020-02-13",{"$f":"J37+87","v":"2020-05-10"},{"$f":"K37+87","v":"2020-08-05"},{"$f":"L37+87","v":"2020-10-31"},null,null,"Испытание 1 раз в год осмотр 1 раз в 3 месяца"]
[{"$f":"IF(AND(EOMONTH(1&Календарь!$D$2,0)>=INDEX(B38:K38,MATCH(Календарь!$B$2,Календарь!$A$4:$J$4,)),INDEX(B38:K38,MATCH(Календарь!$B$2,Календарь!$A$4:$J$4,))>0,Q38=\"\"),MAX($A$1:A37)+1,\"\")","v":8},33,"Отвертка","2-2","Выпрям.","LOC100431335","2019-08-23","2020-08-23",{"$f":"IF(EDATE(G38,10)>91,EDATE(G38,10),-50)","v":"2020-06-23"},{"$f":"J37","v":"2020-02-13"},{"$f":"J38+87","v":"2020-05-10"},"2020-08-05","2020-10-31"]
[{"$f":"IF(AND(EOMONTH(1&Календарь!$D$2,0)>=INDEX(B39:K39,MATCH(Календарь!$B$2,Календарь!$A$4:$J$4,)),INDEX(B39:K39,MATCH(Календарь!$B$2,Календарь!$A$4:$J$4,))>0,Q39=\"\"),MAX($A$1:A38)+1,\"\")","v":9},34,"Отвертка","2-3","Выпрям.","LOC100431335","2019-08-23","2020-08-23","2020-06-23",{"$f":"J37","v":"2020-02-13"},{"$f":"J39+87","v":"2020-05-10"},"2020-08-05","2020-10-31"]
[{"$f":"IF(AND(EOMONTH(1&Календарь!$D$2,0)>=INDEX(B40:K40,MATCH(Календарь!$B$2,Календарь!$A$4:$J$4,)),INDEX(B40:K40,MATCH(Календарь!$B$2,Календарь!$A$4:$J$4,))>0,Q40=\"\"),MAX($A$1:A39)+1,\"\")","v":10},35,"Отвертка","2-4","Выпрям.","LOC100431335","2019-08-23","2020-08-23","2020-06-23",{"$f":"J37","v":"2020-02-13"},{"$f":"J40+87","v":"2020-05-10"},"2020-08-05","2020-10-31"]
[{"$f":"IF(AND(EOMONTH(1&Календарь!$D$2,0)>=INDEX(B41:K41,MATCH(Календарь!$B$2,Календарь!$A$4:$J$4,)),INDEX(B41:K41,MATCH(Календарь!$B$2,Календарь!$A$4:$J$4,))>0,Q41=\"\"),MAX($A$1:A40)+1,\"\")","v":11},36,"Отвертка","2-5","Выпрям.","LOC100431335","2019-08-23","2020-08-23","2020-06-23",{"$f":"J37","v":"2020-02-13"},{"$f":"J41+87","v":"2020-05-10"},"2020-08-05","2020-10-31"]
[{"$f":"IF(AND(EOMONTH(1&Календарь!$D$2,0)>=INDEX(B42:K42,MATCH(Календарь!$B$2,Календарь!$A$4:$J$4,)),INDEX(B42:K42,MATCH(Календарь!$B$2,Календарь!$A$4:$J$4,))>0,Q42=\"\"),MAX($A$1:A41)+1,\"\")","v":12},37,"Отвертка","2-6","Выпрям.","LOC100431335","2019-08-23","2020-08-23","2020-06-23",{"$f":"J37","v":"2020-02-13"},{"$f":"J42+87","v":"2020-05-10"},"2020-08-05","2020-10-31"]
[{"$f":"IF(AND(EOMONTH(1&Календарь!$D$2,0)>=INDEX(B43:K43,MATCH(Календарь!$B$2,Календарь!$A$4:$J$4,)),INDEX(B43:K43,MATCH(Календарь!$B$2,Календарь!$A$4:$J$4,))>0,Q43=\"\"),MAX($A$1:A42)+1,\"\")","v":13},38,"Пассатижи","2-1","Выпрям.","LOC100433506","2019-08-23","2020-08-23",{"$f":"IF(EDATE(G43,10)>91,EDATE(G43,10),-50)","v":"2020-06-23"},{"$f":"G43+87","v":"2019-11-18"},{"$f":"J43+87","v":"2020-02-13"},"2020-05-10","2020-08-05"]
[{"$f":"IF(AND(EOMONTH(1&Календарь!$D$2,0)>=INDEX(B44:K44,MATCH(Календарь!$B$2,Календарь!$A$4:$J$4,)),INDEX(B44:K44,MATCH(Календарь!$B$2,Календарь!$A$4:$J$4,))>0,Q44=\"\"),MAX($A$1:A43)+1,\"\")","v":14},39,"Круглогубцы","2-2","Выпрям.","LOC100427548","2019-08-23","2020-08-23",{"$f":"IF(EDATE(G44,10)>91,EDATE(G44,10),-50)","v":"2020-06-23"},"2019-11-18",{"$f":"J44+87","v":"2020-02-13"},"2020-05-10","2020-08-05"]
[{"$f":"IF(AND(EOMONTH(1&Календарь!$D$2,0)>=INDEX(B45:K45,MATCH(Календарь!$B$2,Календарь!$A$4:$J$4,)),INDEX(B45:K45,MATCH(Календарь!$B$2,Календарь!$A$4:$J$4,))>0,Q45=\"\"),MAX($A$1:A44)+1,\"\")","v":15},40,"Бокорезы","2-3","Выпрям.","LOC100415755","2019-08-23","2020-08-23","2020-06-23","2019-11-18",{"$f":"J45+87","v":"2020-02-13"},"2020-05-10","2020-08-05"]
[{"$f":"IF(AND(EOMONTH(1&Календарь!$D$2,0)>=INDEX(B46:K46,MATCH(Календарь!$B$2,Календарь!$A$4:$J$4,)),INDEX(B46:K46,MATCH(Календарь!$B$2,Календарь!$A$4:$J$4,))>0,Q46=\"\"),MAX($A$1:A45)+1,\"\")","v":""},41,"Набор отверток № 3"]
[{"$f":"IF(AND(EOMONTH(1&Календарь!$D$2,0)>=INDEX(B47:K47,MATCH(Календарь!$B$2,Календарь!$A$4:$J$4,)),INDEX(B47:K47,MATCH(Календарь!$B$2,Календарь!$A$4:$J$4,))>0,Q47=\"\"),MAX($A$1:A46)+1,\"\")","v":16},42,"Отвертка","3-1","АТС","LOC100431348","2019-08-19",{"$f":"IF(EDATE(G47,12)>91,EDATE(G47,12),-50)","v":"2020-08-19"},{"$f":"IF(EDATE(G47,10)>91,EDATE(G47,10),-50)","v":"2020-06-19"},"2020-02-09",{"$f":"J47+87","v":"2020-05-06"},{"$f":"K47+87","v":"2020-08-01"},{"$f":"L47+87","v":"2020-10-27"},null,null,"Испытание 1 раз в год осмотр 1 раз в 3 месяца"]
[{"$f":"IF(AND(EOMONTH(1&Календарь!$D$2,0)>=INDEX(B48:K48,MATCH(Календарь!$B$2,Календарь!$A$4:$J$4,)),INDEX(B48:K48,MATCH(Календарь!$B$2,Календарь!$A$4:$J$4,))>0,Q48=\"\"),MAX($A$1:A47)+1,\"\")","v":17},43,"Отвертка","3-2","АТС","LOC100431348","2019-08-19","2020-08-19",{"$f":"IF(EDATE(G48,10)>91,EDATE(G48,10),-50)","v":"2020-06-19"},{"$f":"J47","v":"2020-02-09"},{"$f":"J48+87","v":"2020-05-06"},"2020-08-01","2020-10-27"]
[{"$f":"IF(AND(EOMONTH(1&Календарь!$D$2,0)>=INDEX(B49:K49,MATCH(Календарь!$B$2,Календарь!$A$4:$J$4,)),INDEX(B49:K49,MATCH(Календарь!$B$2,Календарь!$A$4:$J$4,))>0,Q49=\"\"),MAX($A$1:A48)+1,\"\")","v":18},44,"Отвертка","3-3","АТС","LOC100431348","2019-08-19","2020-08-19","2020-06-19",{"$f":"J47","v":"2020-02-09"},"2020-05-06","2020-08-01","2020-10-27"]
[{"$f":"IF(AND(EOMONTH(1&Календарь!$D$2,0)>=INDEX(B50:K50,MATCH(Календарь!$B$2,Календарь!$A$4:$J$4,)),INDEX(B50:K50,MATCH(Календарь!$B$2,Календарь!$A$4:$J$4,))>0,Q50=\"\"),MAX($A$1:A49)+1,\"\")","v":19},45,"Отвертка","3-4","АТС","LOC100431348","2019-08-19","2020-08-19","2020-06-19",{"$f":"J47","v":"2020-02-09"},"2020-05-06","2020-08-01","2020-10-27"]
[{"$f":"IF(AND(EOMONTH(1&Календарь!$D$2,0)>=INDEX(B51:K51,MATCH(Календарь!$B$2,Календарь!$A$4:$J$4,)),INDEX(B51:K51,MATCH(Календарь!$B$2,Календарь!$A$4:$J$4,))>0,Q51=\"\"),MAX($A$1:A50)+1,\"\")","v":20},46,"Отвертка","3-5","АТС","LOC100431348","2019-08-19","2020-08-19","2020-06-19",{"$f":"J47","v":"2020-02-09"},"2020-05-06","2020-08-01","2020-10-27"]
[{"$f":"IF(AND(EOMONTH(1&Календарь!$D$2,0)>=INDEX(B52:K52,MATCH(Календарь!$B$2,Календарь!$A$4:$J$4,)),INDEX(B52:K52,MATCH(Календарь!$B$2,Календарь!$A$4:$J$4,))>0,Q52=\"\"),MAX($A$1:A51)+1,\"\")","v":21},47,"Отвертка","3-6","АТС","LOC100431348","2019-08-19","2020-08-19","2020-06-19",{"$f":"J47","v":"2020-02-09"},"2020-05-06","2020-08-01","2020-10-27"]
[{"$f":"IF(AND(EOMONTH(1&Календарь!$D$2,0)>=INDEX(B53:K53,MATCH(Календарь!$B$2,Календарь!$A$4:$J$4,)),INDEX(B53:K53,MATCH(Календарь!$B$2,Календарь!$A$4:$J$4,))>0,Q53=\"\"),MAX($A$1:A52)+1,\"\")","v":""},48,"Набор отверток № 4"]
[{"$f":"IF(AND(EOMONTH(1&Календарь!$D$2,0)>=INDEX(B54:K54,MATCH(Календарь!$B$2,Календарь!$A$4:$J$4,)),INDEX(B54:K54,MATCH(Календарь!$B$2,Календарь!$A$4:$J$4,))>0,Q54=\"\"),MAX($A$1:A53)+1,\"\")","v":22},49,"Отвертка","4-1","ВБ","LOC100431348","2019-08-19",{"$f":"IF(EDATE(G54,12)>91,EDATE(G54,12),-50)","v":"2020-08-19"},{"$f":"IF(EDATE(G54,10)>91,EDATE(G54,10),-50)","v":"2020-06-19"},"2020-02-09",{"$f":"J54+87","v":"2020-05-06"},{"$f":"K54+87","v":"2020-08-01"},{"$f":"L54+87","v":"2020-10-27"},null,null,"Испытание 1 раз в год осмотр 1 раз в 3 месяца"]
[{"$f":"IF(AND(EOMONTH(1&Календарь!$D$2,0)>=INDEX(B55:K55,MATCH(Календарь!$B$2,Календарь!$A$4:$J$4,)),INDEX(B55:K55,MATCH(Календарь!$B$2,Календарь!$A$4:$J$4,))>0,Q55=\"\"),MAX($A$1:A54)+1,\"\")","v":23},50,"Отвертка","4-2","ВБ","LOC100431348","2019-08-19","2020-08-19",{"$f":"IF(EDATE(G55,10)>91,EDATE(G55,10),-50)","v":"2020-06-19"},{"$f":"J54","v":"2020-02-09"},{"$f":"J55+87","v":"2020-05-06"},"2020-08-01","2020-10-27"]
[{"$f":"IF(AND(EOMONTH(1&Календарь!$D$2,0)>=INDEX(B56:K56,MATCH(Календарь!$B$2,Календарь!$A$4:$J$4,)),INDEX(B56:K56,MATCH(Календарь!$B$2,Календарь!$A$4:$J$4,))>0,Q56=\"\"),MAX($A$1:A55)+1,\"\")","v":24},51,"Отвертка","4-3","ВБ","LOC100431348","2019-08-19","2020-08-19","2020-06-19",{"$f":"J54","v":"2020-02-09"},{"$f":"J56+87","v":"2020-05-06"},"2020-08-01","2020-10-27"]
[{"$f":"IF(AND(EOMONTH(1&Календарь!$D$2,0)>=INDEX(B57:K57,MATCH(Календарь!$B$2,Календарь!$A$4:$J$4,)),INDEX(B57:K57,MATCH(Календарь!$B$2,Календарь!$A$4:$J$4,))>0,Q57=\"\"),MAX($A$1:A56)+1,\"\")","v":25},52,"Отвертка","4-4","ВБ","LOC100431348","2019-08-19","2020-08-19","2020-06-19",{"$f":"J54","v":"2020-02-09"},{"$f":"J57+87","v":"2020-05-06"},"2020-08-01","2020-10-27"]
[{"$f":"IF(AND(EOMONTH(1&Календарь!$D$2,0)>=INDEX(B58:K58,MATCH(Календарь!$B$2,Календарь!$A$4:$J$4,)),INDEX(B58:K58,MATCH(Календарь!$B$2,Календарь!$A$4:$J$4,))>0,Q58=\"\"),MAX($A$1:A57)+1,\"\")","v":26},53,"Отвертка","4-5","ВБ","LOC100431348","2019-08-19","2020-08-19","2020-06-19",{"$f":"J54","v":"2020-02-09"},{"$f":"J58+87","v":"2020-05-06"},"2020-08-01","2020-10-27"]
[{"$f":"IF(AND(EOMONTH(1&Календарь!$D$2,0)>=INDEX(B59:K59,MATCH(Календарь!$B$2,Календарь!$A$4:$J$4,)),INDEX(B59:K59,MATCH(Календарь!$B$2,Календарь!$A$4:$J$4,))>0,Q59=\"\"),MAX($A$1:A58)+1,\"\")","v":27},54,"Отвертка","4-6","ВБ","LOC100431348","2019-08-19","2020-08-19","2020-06-19",{"$f":"J54","v":"2020-02-09"},{"$f":"J59+87","v":"2020-05-06"},"2020-08-01","2020-10-27"]
[{"$f":"IF(AND(EOMONTH(1&Календарь!$D$2,0)>=INDEX(B60:K60,MATCH(Календарь!$B$2,Календарь!$A$4:$J$4,)),INDEX(B60:K60,MATCH(Календарь!$B$2,Календарь!$A$4:$J$4,))>0,Q60=\"\"),MAX($A$1:A59)+1,\"\")","v":""},55]
[{"$f":"IF(AND(EOMONTH(1&Календарь!$D$2,0)>=INDEX(B61:K61,MATCH(Календарь!$B$2,Календарь!$A$4:$J$4,)),INDEX(B61:K61,MATCH(Календарь!$B$2,Календарь!$A$4:$J$4,))>0,Q61=\"\"),MAX($A$1:A60)+1,\"\")","v":""},56,"Лестница-стремян.Elkop ALW 403 3х56,5",1,"КАЗ №2","LOC100834072","2020-01-28",{"$f":"IF(EDATE(G61,12)>91,EDATE(G61,12),-50)","v":"2021-01-28"},{"$f":"IF(EDATE(G61,10)>91,EDATE(G61,10),-50)","v":"2020-11-28"},null,null,null,null,null,null,"Испытание 1 раз в год"]
[{"$f":"IF(AND(EOMONTH(1&Календарь!$D$2,0)>=INDEX(B62:K62,MATCH(Календарь!$B$2,Календарь!$A$4:$J$4,)),INDEX(B62:K62,MATCH(Календарь!$B$2,Календарь!$A$4:$J$4,))>0,Q62=\"\"),MAX($A$1:A61)+1,\"\")","v":28},57,"Лестница-стремян.Elkop ALW 506 6х121",2,"КАЗ №2","LOC100834073",null,null,"2020-07-01"]
[{"$f":"IF(AND(EOMONTH(1&Календарь!$D$2,0)>=INDEX(B63:K63,MATCH(Календарь!$B$2,Календарь!$A$4:$J$4,)),INDEX(B63:K63,MATCH(Календарь!$B$2,Календарь!$A$4:$J$4,))>0,Q63=\"\"),MAX($A$1:A62)+1,\"\")","v":""},58]
[{"$f":"IF(AND(EOMONTH(1&Календарь!$D$2,0)>=INDEX(B64:K64,MATCH(Календарь!$B$2,Календарь!$A$4:$J$4,)),INDEX(B64:K64,MATCH(Календарь!$B$2,Календарь!$A$4:$J$4,))>0,Q64=\"\"),MAX($A$1:A63)+1,\"\")","v":29},59,"Электропаяльник ЭПСИ-40/220В",1,"КАЗ №2","LOC100448622","2020-03-11",{"$f":"IF(EDATE(G64,6)>91,EDATE(G64,6),-50)","v":"2020-09-11"},{"$f":"IF(EDATE(G64,4)>91,EDATE(G64,4),-50)","v":"2020-07-11"},null,null,null,null,null,null,"Испытание 1 раз в 6 месяцев"]
[{"$f":"IF(AND(EOMONTH(1&Календарь!$D$2,0)>=INDEX(B65:K65,MATCH(Календарь!$B$2,Календарь!$A$4:$J$4,)),INDEX(B65:K65,MATCH(Календарь!$B$2,Календарь!$A$4:$J$4,))>0,Q65=\"\"),MAX($A$1:A64)+1,\"\")","v":30},60,"Электропаяльник ЭПСИ-40/220В",2,"КАЗ №2","LOC100448622","2020-03-11",{"$f":"IF(EDATE(G65,6)>91,EDATE(G65,6),-50)","v":"2020-09-11"},{"$f":"IF(EDATE(G65,4)>91,EDATE(G65,4),-50)","v":"2020-07-11"}]
[{"$f":"IF(AND(EOMONTH(1&Календарь!$D$2,0)>=INDEX(B66:K66,MATCH(Календарь!$B$2,Календарь!$A$4:$J$4,)),INDEX(B66:K66,MATCH(Календарь!$B$2,Календарь!$A$4:$J$4,))>0,Q66=\"\"),MAX($A$1:A65)+1,\"\")","v":31},61,"Электропаяльник ЭПСИ-40/220В",3,"КАЗ №2","LOC100448622","2020-03-11","2020-09-11","2020-07-11"]
[{"$f":"IF(AND(EOMONTH(1&Календарь!$D$2,0)>=INDEX(B67:K67,MATCH(Календарь!$B$2,Календарь!$A$4:$J$4,)),INDEX(B67:K67,MATCH(Календарь!$B$2,Календарь!$A$4:$J$4,))>0,Q67=\"\"),MAX($A$1:A66)+1,\"\")","v":32},62,"Электропаяльник ЭПСИ-40/220В",4,"КАЗ №2","LOC100448622","2020-03-11","2020-09-11","2020-07-11"]
[{"$f":"IF(AND(EOMONTH(1&Календарь!$D$2,0)>=INDEX(B68:K68,MATCH(Календарь!$B$2,Календарь!$A$4:$J$4,)),INDEX(B68:K68,MATCH(Календарь!$B$2,Календарь!$A$4:$J$4,))>0,Q68=\"\"),MAX($A$1:A67)+1,\"\")","v":33},63,"Электропаяльник ЭПСН-100/220В",1,"КАЗ №2","LOC100448624","2020-03-11","2020-09-11","2020-07-11"]
[{"$f":"IF(AND(EOMONTH(1&Календарь!$D$2,0)>=INDEX(B69:K69,MATCH(Календарь!$B$2,Календарь!$A$4:$J$4,)),INDEX(B69:K69,MATCH(Календарь!$B$2,Календарь!$A$4:$J$4,))>0,Q69=\"\"),MAX($A$1:A68)+1,\"\")","v":34},64,"Электропаяльник ЭПСН-100/220В",2,"КАЗ №2","LOC100448624","2020-03-11","2020-09-11","2020-07-11"]
[{"$f":"IF(AND(EOMONTH(1&Календарь!$D$2,0)>=INDEX(B70:K70,MATCH(Календарь!$B$2,Календарь!$A$4:$J$4,)),INDEX(B70:K70,MATCH(Календарь!$B$2,Календарь!$A$4:$J$4,))>0,Q70=\"\"),MAX($A$1:A69)+1,\"\")","v":35},66,"Машина шлифовальная  МА 2001",null,"КАЗ №2","350000043351","2020-03-11",{"$f":"IF(EDATE(G70,6)>91,EDATE(G70,6),-50)","v":"2020-09-11"},{"$f":"IF(EDATE(G70,4)>91,EDATE(G70,4),-50)","v":"2020-07-11"}]
[{"$f":"IF(AND(EOMONTH(1&Календарь!$D$2,0)>=INDEX(B71:K71,MATCH(Календарь!$B$2,Календарь!$A$4:$J$4,)),INDEX(B71:K71,MATCH(Календарь!$B$2,Календарь!$A$4:$J$4,))>0,Q71=\"\"),MAX($A$1:A70)+1,\"\")","v":36},67,"Машина электрическая перфорационная МЭП-500 ЭРУ",null,"КАЗ №2","350000043521","2020-03-11",{"$f":"IF(EDATE(G71,6)>91,EDATE(G71,6),-50)","v":"2020-09-11"},{"$f":"IF(EDATE(G71,4)>91,EDATE(G71,4),-50)","v":"2020-07-11"}]
[{"$f":"IF(AND(EOMONTH(1&Календарь!$D$2,0)>=INDEX(B72:K72,MATCH(Календарь!$B$2,Календарь!$A$4:$J$4,)),INDEX(B72:K72,MATCH(Календарь!$B$2,Календарь!$A$4:$J$4,))>0,Q72=\"\"),MAX($A$1:A71)+1,\"\")","v":37},68,"Дрель Интерскол Д-16/1050Р2 безударная",null,"КАЗ №2","LOC100733042","2020-03-11",{"$f":"IF(EDATE(G72,6)>91,EDATE(G72,6),-50)","v":"2020-09-11"},{"$f":"IF(EDATE(G72,4)>91,EDATE(G72,4),-50)","v":"2020-07-11"}]
[{"$f":"IF(AND(EOMONTH(1&Календарь!$D$2,0)>=INDEX(B73:K73,MATCH(Календарь!$B$2,Календарь!$A$4:$J$4,)),INDEX(B73:K73,MATCH(Календарь!$B$2,Календарь!$A$4:$J$4,))>0,Q73=\"\"),MAX($A$1:A72)+1,\"\")","v":""},69,"Удлинитель EKF Эксперт UBA16-310-4-05 5м",null,"КАЗ №2","LOC100715318","на испытании"]
[{"$f":"IF(AND(EOMONTH(1&Календарь!$D$2,0)>=INDEX(B74:K74,MATCH(Календарь!$B$2,Календарь!$A$4:$J$4,)),INDEX(B74:K74,MATCH(Календарь!$B$2,Календарь!$A$4:$J$4,))>0,Q74=\"\"),MAX($A$1:A73)+1,\"\")","v":""},70,"Удлинитель UNIVersal У10-555 5м 4гн",null,"Каб.нач.","LOC100443989","на испытании"]
[null,null,"Фильтр сетев.ZIS Pilot-PRO( 5роз)+1 3м",2,"КАЗ №2","LOC100444829","2020-03-11",{"$f":"IF(EDATE(G75,6)>91,EDATE(G75,6),-50)","v":"2020-09-11"},{"$f":"IF(EDATE(G75,4)>91,EDATE(G75,4),-50)","v":"2020-07-11"}]
[{"$f":"IF(AND(EOMONTH(1&Календарь!$D$2,0)>=INDEX(B76:K76,MATCH(Календарь!$B$2,Календарь!$A$4:$J$4,)),INDEX(B76:K76,MATCH(Календарь!$B$2,Календарь!$A$4:$J$4,))>0,Q76=\"\"),MAX($A$1:A74)+1,\"\")","v":38},71,"Фильтр сетев.ZIS Pilot-PRO( 5роз)+1 3м",1,"Каб.нач.","LOC100444829","2019-11-25","2020-05-25","2020-03-25"]

{"sheet":"Календарь","index":2,"n_rows":62,"n_cols":10,"rows_kept":62,"cut":false,"hidden":false,"merged":[[2,0,3,0],[0,1,0,4],[0,5,0,6],[2,5,3,5],[2,4,3,4],[2,3,3,3],[2,2,3,2],[2,1,3,1]]}
[null,"СПИСОК СИЗ на",null,null,null,{"$f":"TODAY()","v":"2020-05-30"}]
[null,"отправки на испытание",null,"июль"]
["№ п/п","Наименование СИЗ","Поряд. № СИЗ","Место нахождения","Инв. №","Дата последней годовой проверки","Дата следующей","Дата ","Дата ","Дата следующего "]
[null,null,null,null,null,null,"годовой проверки","отправки на испытание","периодического осмотра","квартального осмотра"]
[null,1,2,3,4,5,6,7,9,10]
[{"$f":"IFERROR(VLOOKUP(ROW()-5,Таблица!$A:$P,COLUMN()+1,0),\"\")","v":1},{"$f":"IFERROR(VLOOKUP(ROW()-5,Таблица!$A:$P,COLUMN()+1,0),\"\")","v":"Перчатки диэлектрические"},{"$f":"IFERROR(VLOOKUP(ROW()-5,Таблица!$A:$P,COLUMN()+1,0),\"\")","v":4},{"$f":"IFERROR(VLOOKUP(ROW()-5,Таблица!$A:$P,COLUMN()+1,0),\"\")","v":"Выпрям."},{"$f":"IFERROR(VLOOKUP(ROW()-5,Таблица!$A:$P,COLUMN()+1,0),\"\")","v":"LOC100433954"},{"$f":"IFERROR(VLOOKUP(ROW()-5,Таблица!$A:$P,COLUMN()+1,0),\"\")","v":"2020-03-11"},{"$f":"IFERROR(VLOOKUP(ROW()-5,Таблица!$A:$P,COLUMN()+1,0),\"\")","v":"2020-09-11"},{"$f":"IFERROR(VLOOKUP(ROW()-5,Таблица!$A:$P,COLUMN()+1,0),\"\")","v":"2020-07-11"},{"$f":"IFERROR(VLOOKUP(ROW()-5,Таблица!$A:$P,COLUMN()+1,0),\"\")","v":"2020-06-06"},{"$f":"IFERROR(VLOOKUP(ROW()-5,Таблица!$A:$P,COLUMN()+1,0),\"\")","v":"2020-09-01"}]
[{"$f":"IFERROR(VLOOKUP(ROW()-5,Таблица!$A:$P,COLUMN()+1,0),\"\")","v":2},{"$f":"IFERROR(VLOOKUP(ROW()-5,Таблица!$A:$P,COLUMN()+1,0),\"\")","v":"Перчатки диэлектрические"},{"$f":"IFERROR(VLOOKUP(ROW()-5,Таблица!$A:$P,COLUMN()+1,0),\"\")","v":5},{"$f":"IFERROR(VLOOKUP(ROW()-5,Таблица!$A:$P,COLUMN()+1,0),\"\")","v":"ВБ"},{"$f":"IFERROR(VLOOKUP(ROW()-5,Таблица!$A:$P,COLUMN()+1,0),\"\")","v":"LOC100433954"},{"$f":"IFERROR(VLOOKUP(ROW()-5,Таблица!$A:$P,COLUMN()+1,0),\"\")","v":"2020-03-11"},{"$f":"IFERROR(VLOOKUP(ROW()-5,Таблица!$A:$P,COLUMN()+1,0),\"\")","v":"2020-09-11"},{"$f":"IFERROR(VLOOKUP(ROW()-5,Таблица!$A:$P,COLUMN()+1,0),\"\")","v":"2020-07-11"},{"$f":"IFERROR(VLOOKUP(ROW()-5,Таблица!$A:$P,COLUMN()+1,0),\"\")","v":"2020-06-06"},{"$f":"IFERROR(VLOOKUP(ROW()-5,Таблица!$A:$P,COLUMN()+1,0),\"\")","v":"2020-09-01"}]
[{"$f":"IFERROR(VLOOKUP(ROW()-5,Таблица!$A:$P,COLUMN()+1,0),\"\")","v":3},{"$f":"IFERROR(VLOOKUP(ROW()-5,Таблица!$A:$P,COLUMN()+1,0),\"\")","v":"Перчатки диэлектрические"},{"$f":"IFERROR(VLOOKUP(ROW()-5,Таблица!$A:$P,COLUMN()+1,0),\"\")","v":31},{"$f":"IFERROR(VLOOKUP(ROW()-5,Таблица!$A:$P,COLUMN()+1,0),\"\")","v":"АТС"},{"$f":"IFERROR(VLOOKUP(ROW()-5,Таблица!$A:$P,COLUMN()+1,0),\"\")","v":"LOC100433954"},{"$f":"IFERROR(VLOOKUP(ROW()-5,Таблица!$A:$P,COLUMN()+1,0),\"\")","v":"2020-03-11"},{"$f":"IFERROR(VLOOKUP(ROW()-5,Таблица!$A:$P,COLUMN()+1,0),\"\")","v":"2020-09-11"},{"$f":"IFERROR(VLOOKUP(ROW()-5,Таблица!$A:$P,COLUMN()+1,0),\"\")","v":"2020-07-11"},{"$f":"IFERROR(VLOOKUP(ROW()-5,Таблица!$A:$P,COLUMN()+1,0),\"\")","v":"2020-06-06"},{"$f":"IFERROR(VLOOKUP(ROW()-5,Таблица!$A:$P,COLUMN()+1,0),\"\")","v":"2020-09-01"}]
[{"$f":"IFERROR(VLOOKUP(ROW()-5,Таблица!$A:$P,COLUMN()+1,0),\"\")","v":11},{"$f":"IFERROR(VLOOKUP(ROW()-5,Таблица!$A:$P,COLUMN()+1,0),\"\")","v":"Индикатор напряж.ПИН90-2М"},{"$f":"IFERROR(VLOOKUP(ROW()-5,Таблица!$A:$P,COLUMN()+1,0),\"\")","v":5},{"$f":"IFERROR(VLOOKUP(ROW()-5,Таблица!$A:$P,COLUMN()+1,0),\"\")","v":"Выпрям."},{"$f":"IFERROR(VLOOKUP(ROW()-5,Таблица!$A:$P,COLUMN()+1,0),\"\")","v":"LOC100422167"},{"$f":"IFERROR(VLOOKUP(ROW()-5,Таблица!$A:$P,COLUMN()+1,0),\"\")","v":"2019-08-20"},{"$f":"IFERROR(VLOOKUP(ROW()-5,Таблица!$A:$P,COLUMN()+1,0),\"\")","v":"2020-08-20"},{"$f":"IFERROR(VLOOKUP(ROW()-5,Таблица!$A:$P,COLUMN()+1,0),\"\")","v":"2020-06-20"},{"$f":"IFERROR(VLOOKUP(ROW()-5,Таблица!$A:$P,COLUMN()+1,0),\"\")","v":"2019-11-15"},{"$f":"IFERROR(VLOOKUP(ROW()-5,Таблица!$A:$P,COLUMN()+1,0),\"\")","v":"2020-02-10"}]
[{"$f":"IFERROR(VLOOKUP(ROW()-5,Таблица!$A:$P,COLUMN()+1,0),\"\")","v":12},{"$f":"IFERROR(VLOOKUP(ROW()-5,Таблица!$A:$P,COLUMN()+1,0),\"\")","v":"Индикатор ИНО-500 напряжения-отвертк"},{"$f":"IFERROR(VLOOKUP(ROW()-5,Таблица!$A:$P,COLUMN()+1,0),\"\")","v":6},{"$f":"IFERROR(VLOOKUP(ROW()-5,Таблица!$A:$P,COLUMN()+1,0),\"\")","v":"АТС"},{"$f":"IFERROR(VLOOKUP(ROW()-5,Таблица!$A:$P,COLUMN()+1,0),\"\")","v":"LOC100422159"},{"$f":"IFERROR(VLOOKUP(ROW()-5,Таблица!$A:$P,COLUMN()+1,0),\"\")","v":"2019-08-20"},{"$f":"IFERROR(VLOOKUP(ROW()-5,Таблица!$A:$P,COLUMN()+1,0),\"\")","v":"2020-08-20"},{"$f":"IFERROR(VLOOKUP(ROW()-5,Таблица!$A:$P,COLUMN()+1,0),\"\")","v":"2020-06-20"},{"$f":"IFERROR(VLOOKUP(ROW()-5,Таблица!$A:$P,COLUMN()+1,0),\"\")","v":"2019-11-15"},{"$f":"IFERROR(VLOOKUP(ROW()-5,Таблица!$A:$P,COLUMN()+1,0),\"\")","v":"2020-02-10"}]
[{"$f":"IFERROR(VLOOKUP(ROW()-5,Таблица!$A:$P,COLUMN()+1,0),\"\")","v":13},{"$f":"IFERROR(VLOOKUP(ROW()-5,Таблица!$A:$P,COLUMN()+1,0),\"\")","v":"Индикатор ИНО-500 напряжения-отвертк"},{"$f":"IFERROR(VLOOKUP(ROW()-5,Таблица!$A:$P,COLUMN()+1,0),\"\")","v":10},{"$f":"IFERROR(VLOOKUP(ROW()-5,Таблица!$A:$P,COLUMN()+1,0),\"\")","v":"ВБ"},{"$f":"IFERROR(VLOOKUP(ROW()-5,Таблица!$A:$P,COLUMN()+1,0),\"\")","v":"LOC100422159"},{"$f":"IFERROR(VLOOKUP(ROW()-5,Таблица!$A:$P,COLUMN()+1,0),\"\")","v":"2019-08-20"},{"$f":"IFERROR(VLOOKUP(ROW()-5,Таблица!$A:$P,COLUMN()+1,0),\"\")","v":"2020-08-20"},{"$f":"IFERROR(VLOOKUP(ROW()-5,Таблица!$A:$P,COLUMN()+1,0),\"\")","v":"2020-06-20"},{"$f":"IFERROR(VLOOKUP(ROW()-5,Таблица!$A:$P,COLUMN()+1,0),\"\")","v":"2019-11-15"},{"$f":"IFERROR(VLOOKUP(ROW()-5,Таблица!$A:$P,COLUMN()+1,0),\"\")","v":"2020-02-10"}]
[{"$f":"IFERROR(VLOOKUP(ROW()-5,Таблица!$A:$P,COLUMN()+1,0),\"\")","v":32},{"$f":"IFERROR(VLOOKUP(ROW()-5,Таблица!$A:$P,COLUMN()+1,0),\"\")","v":"Отвертка"},{"$f":"IFERROR(VLOOKUP(ROW()-5,Таблица!$A:$P,COLUMN()+1,0),\"\")","v":"2-1"},{"$f":"IFERROR(VLOOKUP(ROW()-5,Таблица!$A:$P,COLUMN()+1,0),\"\")","v":"Выпрям."},{"$f":"IFERROR(VLOOKUP(ROW()-5,Таблица!$A:$P,COLUMN()+1,0),\"\")","v":"LOC100431335"},{"$f":"IFERROR(VLOOKUP(ROW()-5,Таблица!$A:$P,COLUMN()+1,0),\"\")","v":"2019-08-23"},{"$f":"IFERROR(VLOOKUP(ROW()-5,Таблица!$A:$P,COLUMN()+1,0),\"\")","v":"2020-08-23"},{"$f":"IFERROR(VLOOKUP(ROW()-5,Таблица!$A:$P,COLUMN()+1,0),\"\")","v":"2020-06-23"},{"$f":"IFERROR(VLOOKUP(ROW()-5,Таблица!$A:$P,COLUMN()+1,0),\"\")","v":"2020-02-13"},{"$f":"IFERROR(VLOOKUP(ROW()-5,Таблица!$A:$P,COLUMN()+1,0),\"\")","v":"2020-05-10"}]
[{"$f":"IFERROR(VLOOKUP(ROW()-5,Таблица!$A:$P,COLUMN()+1,0),\"\")","v":33},{"$f":"IFERROR(VLOOKUP(ROW()-5,Таблица!$A:$P,COLUMN()+1,0),\"\")","v":"Отвертка"},{"$f":"IFERROR(VLOOKUP(ROW()-5,Таблица!$A:$P,COLUMN()+1,0),\"\")","v":"2-2"},{"$f":"IFERROR(VLOOKUP(ROW()-5,Таблица!$A:$P,COLUMN()+1,0),\"\")","v":"Выпрям."},{"$f":"IFERROR(VLOOKUP(ROW()-5,Таблица!$A:$P,COLUMN()+1,0),\"\")","v":"LOC100431335"},{"$f":"IFERROR(VLOOKUP(ROW()-5,Таблица!$A:$P,COLUMN()+1,0),\"\")","v":"2019-08-23"},{"$f":"IFERROR(VLOOKUP(ROW()-5,Таблица!$A:$P,COLUMN()+1,0),\"\")","v":"2020-08-23"},{"$f":"IFERROR(VLOOKUP(ROW()-5,Таблица!$A:$P,COLUMN()+1,0),\"\")","v":"2020-06-23"},{"$f":"IFERROR(VLOOKUP(ROW()-5,Таблица!$A:$P,COLUMN()+1,0),\"\")","v":"2020-02-13"},{"$f":"IFERROR(VLOOKUP(ROW()-5,Таблица!$A:$P,COLUMN()+1,0),\"\")","v":"2020-05-10"}]
[{"$f":"IFERROR(VLOOKUP(ROW()-5,Таблица!$A:$P,COLUMN()+1,0),\"\")","v":34},{"$f":"IFERROR(VLOOKUP(ROW()-5,Таблица!$A:$P,COLUMN()+1,0),\"\")","v":"Отвертка"},{"$f":"IFERROR(VLOOKUP(ROW()-5,Таблица!$A:$P,COLUMN()+1,0),\"\")","v":"2-3"},{"$f":"IFERROR(VLOOKUP(ROW()-5,Таблица!$A:$P,COLUMN()+1,0),\"\")","v":"Выпрям."},{"$f":"IFERROR(VLOOKUP(ROW()-5,Таблица!$A:$P,COLUMN()+1,0),\"\")","v":"LOC100431335"},{"$f":"IFERROR(VLOOKUP(ROW()-5,Таблица!$A:$P,COLUMN()+1,0),\"\")","v":"2019-08-23"},{"$f":"IFERROR(VLOOKUP(ROW()-5,Таблица!$A:$P,COLUMN()+1,0),\"\")","v":"2020-08-23"},{"$f":"IFERROR(VLOOKUP(ROW()-5,Таблица!$A:$P,COLUMN()+1,0),\"\")","v":"2020-06-23"},{"$f":"IFERROR(VLOOKUP(ROW()-5,Таблица!$A:$P,COLUMN()+1,0),\"\")","v":"2020-02-13"},{"$f":"IFERROR(VLOOKUP(ROW()-5,Таблица!$A:$P,COLUMN()+1,0),\"\")","v":"2020-05-10"}]
[{"$f":"IFERROR(VLOOKUP(ROW()-5,Таблица!$A:$P,COLUMN()+1,0),\"\")","v":35},{"$f":"IFERROR(VLOOKUP(ROW()-5,Таблица!$A:$P,COLUMN()+1,0),\"\")","v":"Отвертка"},{"$f":"IFERROR(VLOOKUP(ROW()-5,Таблица!$A:$P,COLUMN()+1,0),\"\")","v":"2-4"},{"$f":"IFERROR(VLOOKUP(ROW()-5,Таблица!$A:$P,COLUMN()+1,0),\"\")","v":"Выпрям."},{"$f":"IFERROR(VLOOKUP(ROW()-5,Таблица!$A:$P,COLUMN()+1,0),\"\")","v":"LOC100431335"},{"$f":"IFERROR(VLOOKUP(ROW()-5,Таблица!$A:$P,COLUMN()+1,0),\"\")","v":"2019-08-23"},{"$f":"IFERROR(VLOOKUP(ROW()-5,Таблица!$A:$P,COLUMN()+1,0),\"\")","v":"2020-08-23"},{"$f":"IFERROR(VLOOKUP(ROW()-5,Таблица!$A:$P,COLUMN()+1,0),\"\")","v":"2020-06-23"},{"$f":"IFERROR(VLOOKUP(ROW()-5,Таблица!$A:$P,COLUMN()+1,0),\"\")","v":"2020-02-13"},{"$f":"IFERROR(VLOOKUP(ROW()-5,Таблица!$A:$P,COLUMN()+1,0),\"\")","v":"2020-05-10"}]
[{"$f":"IFERROR(VLOOKUP(ROW()-5,Таблица!$A:$P,COLUMN()+1,0),\"\")","v":36},{"$f":"IFERROR(VLOOKUP(ROW()-5,Таблица!$A:$P,COLUMN()+1,0),\"\")","v":"Отвертка"},{"$f":"IFERROR(VLOOKUP(ROW()-5,Таблица!$A:$P,COLUMN()+1,0),\"\")","v":"2-5"},{"$f":"IFERROR(VLOOKUP(ROW()-5,Таблица!$A:$P,COLUMN()+1,0),\"\")","v":"Выпрям."},{"$f":"IFERROR(VLOOKUP(ROW()-5,Таблица!$A:$P,COLUMN()+1,0),\"\")","v":"LOC100431335"},{"$f":"IFERROR(VLOOKUP(ROW()-5,Таблица!$A:$P,COLUMN()+1,0),\"\")","v":"2019-08-23"},{"$f":"IFERROR(VLOOKUP(ROW()-5,Таблица!$A:$P,COLUMN()+1,0),\"\")","v":"2020-08-23"},{"$f":"IFERROR(VLOOKUP(ROW()-5,Таблица!$A:$P,COLUMN()+1,0),\"\")","v":"2020-06-23"},{"$f":"IFERROR(VLOOKUP(ROW()-5,Таблица!$A:$P,COLUMN()+1,0),\"\")","v":"2020-02-13"},{"$f":"IFERROR(VLOOKUP(ROW()-5,Таблица!$A:$P,COLUMN()+1,0),\"\")","v":"2020-05-10"}]
[{"$f":"IFERROR(VLOOKUP(ROW()-5,Таблица!$A:$P,COLUMN()+1,0),\"\")","v":37},{"$f":"IFERROR(VLOOKUP(ROW()-5,Таблица!$A:$P,COLUMN()+1,0),\"\")","v":"Отвертка"},{"$f":"IFERROR(VLOOKUP(ROW()-5,Таблица!$A:$P,COLUMN()+1,0),\"\")","v":"2-6"},{"$f":"IFERROR(VLOOKUP(ROW()-5,Таблица!$A:$P,COLUMN()+1,0),\"\")","v":"Выпрям."},{"$f":"IFERROR(VLOOKUP(ROW()-5,Таблица!$A:$P,COLUMN()+1,0),\"\")","v":"LOC100431335"},{"$f":"IFERROR(VLOOKUP(ROW()-5,Таблица!$A:$P,COLUMN()+1,0),\"\")","v":"2019-08-23"},{"$f":"IFERROR(VLOOKUP(ROW()-5,Таблица!$A:$P,COLUMN()+1,0),\"\")","v":"2020-08-23"},{"$f":"IFERROR(VLOOKUP(ROW()-5,Таблица!$A:$P,COLUMN()+1,0),\"\")","v":"2020-06-23"},{"$f":"IFERROR(VLOOKUP(ROW()-5,Таблица!$A:$P,COLUMN()+1,0),\"\")","v":"2020-02-13"},{"$f":"IFERROR(VLOOKUP(ROW()-5,Таблица!$A:$P,COLUMN()+1,0),\"\")","v":"2020-05-10"}]
[{"$f":"IFERROR(VLOOKUP(ROW()-5,Таблица!$A:$P,COLUMN()+1,0),\"\")","v":38},{"$f":"IFERROR(VLOOKUP(ROW()-5,Таблица!$A:$P,COLUMN()+1,0),\"\")","v":"Пассатижи"},{"$f":"IFERROR(VLOOKUP(ROW()-5,Таблица!$A:$P,COLUMN()+1,0),\"\")","v":"2-1"},{"$f":"IFERROR(VLOOKUP(ROW()-5,Таблица!$A:$P,COLUMN()+1,0),\"\")","v":"Выпрям."},{"$f":"IFERROR(VLOOKUP(ROW()-5,Таблица!$A:$P,COLUMN()+1,0),\"\")","v":"LOC100433506"},{"$f":"IFERROR(VLOOKUP(ROW()-5,Таблица!$A:$P,COLUMN()+1,0),\"\")","v":"2019-08-23"},{"$f":"IFERROR(VLOOKUP(ROW()-5,Таблица!$A:$P,COLUMN()+1,0),\"\")","v":"2020-08-23"},{"$f":"IFERROR(VLOOKUP(ROW()-5,Таблица!$A:$P,COLUMN()+1,0),\"\")","v":"2020-06-23"},{"$f":"IFERROR(VLOOKUP(ROW()-5,Таблица!$A:$P,COLUMN()+1,0),\"\")","v":"2019-11-18"},{"$f":"IFERROR(VLOOKUP(ROW()-5,Таблица!$A:$P,COLUMN()+1,0),\"\")","v":"2020-02-13"}]
[{"$f":"IFERROR(VLOOKUP(ROW()-5,Таблица!$A:$P,COLUMN()+1,0),\"\")","v":39},{"$f":"IFERROR(VLOOKUP(ROW()-5,Таблица!$A:$P,COLUMN()+1,0),\"\")","v":"Круглогубцы"},{"$f":"IFERROR(VLOOKUP(ROW()-5,Таблица!$A:$P,COLUMN()+1,0),\"\")","v":"2-2"},{"$f":"IFERROR(VLOOKUP(ROW()-5,Таблица!$A:$P,COLUMN()+1,0),\"\")","v":"Выпрям."},{"$f":"IFERROR(VLOOKUP(ROW()-5,Таблица!$A:$P,COLUMN()+1,0),\"\")","v":"LOC100427548"},{"$f":"IFERROR(VLOOKUP(ROW()-5,Таблица!$A:$P,COLUMN()+1,0),\"\")","v":"2019-08-23"},{"$f":"IFERROR(VLOOKUP(ROW()-5,Таблица!$A:$P,COLUMN()+1,0),\"\")","v":"2020-08-23"},{"$f":"IFERROR(VLOOKUP(ROW()-5,Таблица!$A:$P,COLUMN()+1,0),\"\")","v":"2020-06-23"},{"$f":"IFERROR(VLOOKUP(ROW()-5,Таблица!$A:$P,COLUMN()+1,0),\"\")","v":"2019-11-18"},{"$f":"IFERROR(VLOOKUP(ROW()-5,Таблица!$A:$P,COLUMN()+1,0),\"\")","v":"2020-02-13"}]
[{"$f":"IFERROR(VLOOKUP(ROW()-5,Таблица!$A:$P,COLUMN()+1,0),\"\")","v":40},{"$f":"IFERROR(VLOOKUP(ROW()-5,Таблица!$A:$P,COLUMN()+1,0),\"\")","v":"Бокорезы"},{"$f":"IFERROR(VLOOKUP(ROW()-5,Таблица!$A:$P,COLUMN()+1,0),\"\")","v":"2-3"},{"$f":"IFERROR(VLOOKUP(ROW()-5,Таблица!$A:$P,COLUMN()+1,0),\"\")","v":"Выпрям."},{"$f":"IFERROR(VLOOKUP(ROW()-5,Таблица!$A:$P,COLUMN()+1,0),\"\")","v":"LOC100415755"},{"$f":"IFERROR(VLOOKUP(ROW()-5,Таблица!$A:$P,COLUMN()+1,0),\"\")","v":"2019-08-23"},{"$f":"IFERROR(VLOOKUP(ROW()-5,Таблица!$A:$P,COLUMN()+1,0),\"\")","v":"2020-08-23"},{"$f":"IFERROR(VLOOKUP(ROW()-5,Таблица!$A:$P,COLUMN()+1,0),\"\")","v":"2020-06-23"},{"$f":"IFERROR(VLOOKUP(ROW()-5,Таблица!$A:$P,COLUMN()+1,0),\"\")","v":"2019-11-18"},{"$f":"IFERROR(VLOOKUP(ROW()-5,Таблица!$A:$P,COLUMN()+1,0),\"\")","v":"2020-02-13"}]
[{"$f":"IFERROR(VLOOKUP(ROW()-5,Таблица!$A:$P,COLUMN()+1,0),\"\")","v":42},{"$f":"IFERROR(VLOOKUP(ROW()-5,Таблица!$A:$P,COLUMN()+1,0),\"\")","v":"Отвертка"},{"$f":"IFERROR(VLOOKUP(ROW()-5,Таблица!$A:$P,COLUMN()+1,0),\"\")","v":"3-1"},{"$f":"IFERROR(VLOOKUP(ROW()-5,Таблица!$A:$P,COLUMN()+1,0),\"\")","v":"АТС"},{"$f":"IFERROR(VLOOKUP(ROW()-5,Таблица!$A:$P,COLUMN()+1,0),\"\")","v":"LOC100431348"},{"$f":"IFERROR(VLOOKUP(ROW()-5,Таблица!$A:$P,COLUMN()+1,0),\"\")","v":"2019-08-19"},{"$f":"IFERROR(VLOOKUP(ROW()-5,Таблица!$A:$P,COLUMN()+1,0),\"\")","v":"2020-08-19"},{"$f":"IFERROR(VLOOKUP(ROW()-5,Таблица!$A:$P,COLUMN()+1,0),\"\")","v":"2020-06-19"},{"$f":"IFERROR(VLOOKUP(ROW()-5,Таблица!$A:$P,COLUMN()+1,0),\"\")","v":"2020-02-09"},{"$f":"IFERROR(VLOOKUP(ROW()-5,Таблица!$A:$P,COLUMN()+1,0),\"\")","v":"2020-05-06"}]
[{"$f":"IFERROR(VLOOKUP(ROW()-5,Таблица!$A:$P,COLUMN()+1,0),\"\")","v":43},{"$f":"IFERROR(VLOOKUP(ROW()-5,Таблица!$A:$P,COLUMN()+1,0),\"\")","v":"Отвертка"},{"$f":"IFERROR(VLOOKUP(ROW()-5,Таблица!$A:$P,COLUMN()+1,0),\"\")","v":"3-2"},{"$f":"IFERROR(VLOOKUP(ROW()-5,Таблица!$A:$P,COLUMN()+1,0),\"\")","v":"АТС"},{"$f":"IFERROR(VLOOKUP(ROW()-5,Таблица!$A:$P,COLUMN()+1,0),\"\")","v":"LOC100431348"},{"$f":"IFERROR(VLOOKUP(ROW()-5,Таблица!$A:$P,COLUMN()+1,0),\"\")","v":"2019-08-19"},{"$f":"IFERROR(VLOOKUP(ROW()-5,Таблица!$A:$P,COLUMN()+1,0),\"\")","v":"2020-08-19"},{"$f":"IFERROR(VLOOKUP(ROW()-5,Таблица!$A:$P,COLUMN()+1,0),\"\")","v":"2020-06-19"},{"$f":"IFERROR(VLOOKUP(ROW()-5,Таблица!$A:$P,COLUMN()+1,0),\"\")","v":"2020-02-09"},{"$f":"IFERROR(VLOOKUP(ROW()-5,Таблица!$A:$P,COLUMN()+1,0),\"\")","v":"2020-05-06"}]
[{"$f":"IFERROR(VLOOKUP(ROW()-5,Таблица!$A:$P,COLUMN()+1,0),\"\")","v":44},{"$f":"IFERROR(VLOOKUP(ROW()-5,Таблица!$A:$P,COLUMN()+1,0),\"\")","v":"Отвертка"},{"$f":"IFERROR(VLOOKUP(ROW()-5,Таблица!$A:$P,COLUMN()+1,0),\"\")","v":"3-3"},{"$f":"IFERROR(VLOOKUP(ROW()-5,Таблица!$A:$P,COLUMN()+1,0),\"\")","v":"АТС"},{"$f":"IFERROR(VLOOKUP(ROW()-5,Таблица!$A:$P,COLUMN()+1,0),\"\")","v":"LOC100431348"},{"$f":"IFERROR(VLOOKUP(ROW()-5,Таблица!$A:$P,COLUMN()+1,0),\"\")","v":"2019-08-19"},{"$f":"IFERROR(VLOOKUP(ROW()-5,Таблица!$A:$P,COLUMN()+1,0),\"\")","v":"2020-08-19"},{"$f":"IFERROR(VLOOKUP(ROW()-5,Таблица!$A:$P,COLUMN()+1,0),\"\")","v":"2020-06-19"},{"$f":"IFERROR(VLOOKUP(ROW()-5,Таблица!$A:$P,COLUMN()+1,0),\"\")","v":"2020-02-09"},{"$f":"IFERROR(VLOOKUP(ROW()-5,Таблица!$A:$P,COLUMN()+1,0),\"\")","v":"2020-05-06"}]
[{"$f":"IFERROR(VLOOKUP(ROW()-5,Таблица!$A:$P,COLUMN()+1,0),\"\")","v":45},{"$f":"IFERROR(VLOOKUP(ROW()-5,Таблица!$A:$P,COLUMN()+1,0),\"\")","v":"Отвертка"},{"$f":"IFERROR(VLOOKUP(ROW()-5,Таблица!$A:$P,COLUMN()+1,0),\"\")","v":"3-4"},{"$f":"IFERROR(VLOOKUP(ROW()-5,Таблица!$A:$P,COLUMN()+1,0),\"\")","v":"АТС"},{"$f":"IFERROR(VLOOKUP(ROW()-5,Таблица!$A:$P,COLUMN()+1,0),\"\")","v":"LOC100431348"},{"$f":"IFERROR(VLOOKUP(ROW()-5,Таблица!$A:$P,COLUMN()+1,0),\"\")","v":"2019-08-19"},{"$f":"IFERROR(VLOOKUP(ROW()-5,Таблица!$A:$P,COLUMN()+1,0),\"\")","v":"2020-08-19"},{"$f":"IFERROR(VLOOKUP(ROW()-5,Таблица!$A:$P,COLUMN()+1,0),\"\")","v":"2020-06-19"},{"$f":"IFERROR(VLOOKUP(ROW()-5,Таблица!$A:$P,COLUMN()+1,0),\"\")","v":"2020-02-09"},{"$f":"IFERROR(VLOOKUP(ROW()-5,Таблица!$A:$P,COLUMN()+1,0),\"\")","v":"2020-05-06"}]
[{"$f":"IFERROR(VLOOKUP(ROW()-5,Таблица!$A:$P,COLUMN()+1,0),\"\")","v":46},{"$f":"IFERROR(VLOOKUP(ROW()-5,Таблица!$A:$P,COLUMN()+1,0),\"\")","v":"Отвертка"},{"$f":"IFERROR(VLOOKUP(ROW()-5,Таблица!$A:$P,COLUMN()+1,0),\"\")","v":"3-5"},{"$f":"IFERROR(VLOOKUP(ROW()-5,Таблица!$A:$P,COLUMN()+1,0),\"\")","v":"АТС"},{"$f":"IFERROR(VLOOKUP(ROW()-5,Таблица!$A:$P,COLUMN()+1,0),\"\")","v":"LOC100431348"},{"$f":"IFERROR(VLOOKUP(ROW()-5,Таблица!$A:$P,COLUMN()+1,0),\"\")","v":"2019-08-19"},{"$f":"IFERROR(VLOOKUP(ROW()-5,Таблица!$A:$P,COLUMN()+1,0),\"\")","v":"2020-08-19"},{"$f":"IFERROR(VLOOKUP(ROW()-5,Таблица!$A:$P,COLUMN()+1,0),\"\")","v":"2020-06-19"},{"$f":"IFERROR(VLOOKUP(ROW()-5,Таблица!$A:$P,COLUMN()+1,0),\"\")","v":"2020-02-09"},{"$f":"IFERROR(VLOOKUP(ROW()-5,Таблица!$A:$P,COLUMN()+1,0),\"\")","v":"2020-05-06"}]
[{"$f":"IFERROR(VLOOKUP(ROW()-5,Таблица!$A:$P,COLUMN()+1,0),\"\")","v":47},{"$f":"IFERROR(VLOOKUP(ROW()-5,Таблица!$A:$P,COLUMN()+1,0),\"\")","v":"Отвертка"},{"$f":"IFERROR(VLOOKUP(ROW()-5,Таблица!$A:$P,COLUMN()+1,0),\"\")","v":"3-6"},{"$f":"IFERROR(VLOOKUP(ROW()-5,Таблица!$A:$P,COLUMN()+1,0),\"\")","v":"АТС"},{"$f":"IFERROR(VLOOKUP(ROW()-5,Таблица!$A:$P,COLUMN()+1,0),\"\")","v":"LOC100431348"},{"$f":"IFERROR(VLOOKUP(ROW()-5,Таблица!$A:$P,COLUMN()+1,0),\"\")","v":"2019-08-19"},{"$f":"IFERROR(VLOOKUP(ROW()-5,Таблица!$A:$P,COLUMN()+1,0),\"\")","v":"2020-08-19"},{"$f":"IFERROR(VLOOKUP(ROW()-5,Таблица!$A:$P,COLUMN()+1,0),\"\")","v":"2020-06-19"},{"$f":"IFERROR(VLOOKUP(ROW()-5,Таблица!$A:$P,COLUMN()+1,0),\"\")","v":"2020-02-09"},{"$f":"IFERROR(VLOOKUP(ROW()-5,Таблица!$A:$P,COLUMN()+1,0),\"\")","v":"2020-05-06"}]
[{"$f":"IFERROR(VLOOKUP(ROW()-5,Таблица!$A:$P,COLUMN()+1,0),\"\")","v":49},{"$f":"IFERROR(VLOOKUP(ROW()-5,Таблица!$A:$P,COLUMN()+1,0),\"\")","v":"Отвертка"},{"$f":"IFERROR(VLOOKUP(ROW()-5,Таблица!$A:$P,COLUMN()+1,0),\"\")","v":"4-1"},{"$f":"IFERROR(VLOOKUP(ROW()-5,Таблица!$A:$P,COLUMN()+1,0),\"\")","v":"ВБ"},{"$f":"IFERROR(VLOOKUP(ROW()-5,Таблица!$A:$P,COLUMN()+1,0),\"\")","v":"LOC100431348"},{"$f":"IFERROR(VLOOKUP(ROW()-5,Таблица!$A:$P,COLUMN()+1,0),\"\")","v":"2019-08-19"},{"$f":"IFERROR(VLOOKUP(ROW()-5,Таблица!$A:$P,COLUMN()+1,0),\"\")","v":"2020-08-19"},{"$f":"IFERROR(VLOOKUP(ROW()-5,Таблица!$A:$P,COLUMN()+1,0),\"\")","v":"2020-06-19"},{"$f":"IFERROR(VLOOKUP(ROW()-5,Таблица!$A:$P,COLUMN()+1,0),\"\")","v":"2020-02-09"},{"$f":"IFERROR(VLOOKUP(ROW()-5,Таблица!$A:$P,COLUMN()+1,0),\"\")","v":"2020-05-06"}]
[{"$f":"IFERROR(VLOOKUP(ROW()-5,Таблица!$A:$P,COLUMN()+1,0),\"\")","v":50},{"$f":"IFERROR(VLOOKUP(ROW()-5,Таблица!$A:$P,COLUMN()+1,0),\"\")","v":"Отвертка"},{"$f":"IFERROR(VLOOKUP(ROW()-5,Таблица!$A:$P,COLUMN()+1,0),\"\")","v":"4-2"},{"$f":"IFERROR(VLOOKUP(ROW()-5,Таблица!$A:$P,COLUMN()+1,0),\"\")","v":"ВБ"},{"$f":"IFERROR(VLOOKUP(ROW()-5,Таблица!$A:$P,COLUMN()+1,0),\"\")","v":"LOC100431348"},{"$f":"IFERROR(VLOOKUP(ROW()-5,Таблица!$A:$P,COLUMN()+1,0),\"\")","v":"2019-08-19"},{"$f":"IFERROR(VLOOKUP(ROW()-5,Таблица!$A:$P,COLUMN()+1,0),\"\")","v":"2020-08-19"},{"$f":"IFERROR(VLOOKUP(ROW()-5,Таблица!$A:$P,COLUMN()+1,0),\"\")","v":"2020-06-19"},{"$f":"IFERROR(VLOOKUP(ROW()-5,Таблица!$A:$P,COLUMN()+1,0),\"\")","v":"2020-02-09"},{"$f":"IFERROR(VLOOKUP(ROW()-5,Таблица!$A:$P,COLUMN()+1,0),\"\")","v":"2020-05-06"}]
[{"$f":"IFERROR(VLOOKUP(ROW()-5,Таблица!$A:$P,COLUMN()+1,0),\"\")","v":51},{"$f":"IFERROR(VLOOKUP(ROW()-5,Таблица!$A:$P,COLUMN()+1,0),\"\")","v":"Отвертка"},{"$f":"IFERROR(VLOOKUP(ROW()-5,Таблица!$A:$P,COLUMN()+1,0),\"\")","v":"4-3"},{"$f":"IFERROR(VLOOKUP(ROW()-5,Таблица!$A:$P,COLUMN()+1,0),\"\")","v":"ВБ"},{"$f":"IFERROR(VLOOKUP(ROW()-5,Таблица!$A:$P,COLUMN()+1,0),\"\")","v":"LOC100431348"},{"$f":"IFERROR(VLOOKUP(ROW()-5,Таблица!$A:$P,COLUMN()+1,0),\"\")","v":"2019-08-19"},{"$f":"IFERROR(VLOOKUP(ROW()-5,Таблица!$A:$P,COLUMN()+1,0),\"\")","v":"2020-08-19"},{"$f":"IFERROR(VLOOKUP(ROW()-5,Таблица!$A:$P,COLUMN()+1,0),\"\")","v":"2020-06-19"},{"$f":"IFERROR(VLOOKUP(ROW()-5,Таблица!$A:$P,COLUMN()+1,0),\"\")","v":"2020-02-09"},{"$f":"IFERROR(VLOOKUP(ROW()-5,Таблица!$A:$P,COLUMN()+1,0),\"\")","v":"2020-05-06"}]
[{"$f":"IFERROR(VLOOKUP(ROW()-5,Таблица!$A:$P,COLUMN()+1,0),\"\")","v":52},{"$f":"IFERROR(VLOOKUP(ROW()-5,Таблица!$A:$P,COLUMN()+1,0),\"\")","v":"Отвертка"},{"$f":"IFERROR(VLOOKUP(ROW()-5,Таблица!$A:$P,COLUMN()+1,0),\"\")","v":"4-4"},{"$f":"IFERROR(VLOOKUP(ROW()-5,Таблица!$A:$P,COLUMN()+1,0),\"\")","v":"ВБ"},{"$f":"IFERROR(VLOOKUP(ROW()-5,Таблица!$A:$P,COLUMN()+1,0),\"\")","v":"LOC100431348"},{"$f":"IFERROR(VLOOKUP(ROW()-5,Таблица!$A:$P,COLUMN()+1,0),\"\")","v":"2019-08-19"},{"$f":"IFERROR(VLOOKUP(ROW()-5,Таблица!$A:$P,COLUMN()+1,0),\"\")","v":"2020-08-19"},{"$f":"IFERROR(VLOOKUP(ROW()-5,Таблица!$A:$P,COLUMN()+1,0),\"\")","v":"2020-06-19"},{"$f":"IFERROR(VLOOKUP(ROW()-5,Таблица!$A:$P,COLUMN()+1,0),\"\")","v":"2020-02-09"},{"$f":"IFERROR(VLOOKUP(ROW()-5,Таблица!$A:$P,COLUMN()+1,0),\"\")","v":"2020-05-06"}]
[{"$f":"IFERROR(VLOOKUP(ROW()-5,Таблица!$A:$P,COLUMN()+1,0),\"\")","v":53},{"$f":"IFERROR(VLOOKUP(ROW()-5,Таблица!$A:$P,COLUMN()+1,0),\"\")","v":"Отвертка"},{"$f":"IFERROR(VLOOKUP(ROW()-5,Таблица!$A:$P,COLUMN()+1,0),\"\")","v":"4-5"},{"$f":"IFERROR(VLOOKUP(ROW()-5,Таблица!$A:$P,COLUMN()+1,0),\"\")","v":"ВБ"},{"$f":"IFERROR(VLOOKUP(ROW()-5,Таблица!$A:$P,COLUMN()+1,0),\"\")","v":"LOC100431348"},{"$f":"IFERROR(VLOOKUP(ROW()-5,Таблица!$A:$P,COLUMN()+1,0),\"\")","v":"2019-08-19"},{"$f":"IFERROR(VLOOKUP(ROW()-5,Таблица!$A:$P,COLUMN()+1,0),\"\")","v":"2020-08-19"},{"$f":"IFERROR(VLOOKUP(ROW()-5,Таблица!$A:$P,COLUMN()+1,0),\"\")","v":"2020-06-19"},{"$f":"IFERROR(VLOOKUP(ROW()-5,Таблица!$A:$P,COLUMN()+1,0),\"\")","v":"2020-02-09"},{"$f":"IFERROR(VLOOKUP(ROW()-5,Таблица!$A:$P,COLUMN()+1,0),\"\")","v":"2020-05-06"}]
[{"$f":"IFERROR(VLOOKUP(ROW()-5,Таблица!$A:$P,COLUMN()+1,0),\"\")","v":54},{"$f":"IFERROR(VLOOKUP(ROW()-5,Таблица!$A:$P,COLUMN()+1,0),\"\")","v":"Отвертка"},{"$f":"IFERROR(VLOOKUP(ROW()-5,Таблица!$A:$P,COLUMN()+1,0),\"\")","v":"4-6"},{"$f":"IFERROR(VLOOKUP(ROW()-5,Таблица!$A:$P,COLUMN()+1,0),\"\")","v":"ВБ"},{"$f":"IFERROR(VLOOKUP(ROW()-5,Таблица!$A:$P,COLUMN()+1,0),\"\")","v":"LOC100431348"},{"$f":"IFERROR(VLOOKUP(ROW()-5,Таблица!$A:$P,COLUMN()+1,0),\"\")","v":"2019-08-19"},{"$f":"IFERROR(VLOOKUP(ROW()-5,Таблица!$A:$P,COLUMN()+1,0),\"\")","v":"2020-08-19"},{"$f":"IFERROR(VLOOKUP(ROW()-5,Таблица!$A:$P,COLUMN()+1,0),\"\")","v":"2020-06-19"},{"$f":"IFERROR(VLOOKUP(ROW()-5,Таблица!$A:$P,COLUMN()+1,0),\"\")","v":"2020-02-09"},{"$f":"IFERROR(VLOOKUP(ROW()-5,Таблица!$A:$P,COLUMN()+1,0),\"\")","v":"2020-05-06"}]
[{"$f":"IFERROR(VLOOKUP(ROW()-5,Таблица!$A:$P,COLUMN()+1,0),\"\")","v":57},{"$f":"IFERROR(VLOOKUP(ROW()-5,Таблица!$A:$P,COLUMN()+1,0),\"\")","v":"Лестница-стремян.Elkop ALW 506 6х121"},{"$f":"IFERROR(VLOOKUP(ROW()-5,Таблица!$A:$P,COLUMN()+1,0),\"\")","v":2},{"$f":"IFERROR(VLOOKUP(ROW()-5,Таблица!$A:$P,COLUMN()+1,0),\"\")","v":"КАЗ №2"},{"$f":"IFERROR(VLOOKUP(ROW()-5,Таблица!$A:$P,COLUMN()+1,0),\"\")","v":"LOC100834073"},{"$f":"IFERROR(VLOOKUP(ROW()-5,Таблица!$A:$P,COLUMN()+1,0),\"\")","v":"00:00:00"},{"$f":"IFERROR(VLOOKUP(ROW()-5,Таблица!$A:$P,COLUMN()+1,0),\"\")","v":"00:00:00"},{"$f":"IFERROR(VLOOKUP(ROW()-5,Таблица!$A:$P,COLUMN()+1,0),\"\")","v":"2020-07-01"},{"$f":"IFERROR(VLOOKUP(ROW()-5,Таблица!$A:$P,COLUMN()+1,0),\"\")","v":"00:00:00"},{"$f":"IFERROR(VLOOKUP(ROW()-5,Таблица!$A:$P,COLUMN()+1,0),\"\")","v":"00:00:00"}]
[{"$f":"IFERROR(VLOOKUP(ROW()-5,Таблица!$A:$P,COLUMN()+1,0),\"\")","v":59},{"$f":"IFERROR(VLOOKUP(ROW()-5,Таблица!$A:$P,COLUMN()+1,0),\"\")","v":"Электропаяльник ЭПСИ-40/220В"},{"$f":"IFERROR(VLOOKUP(ROW()-5,Таблица!$A:$P,COLUMN()+1,0),\"\")","v":1},{"$f":"IFERROR(VLOOKUP(ROW()-5,Таблица!$A:$P,COLUMN()+1,0),\"\")","v":"КАЗ №2"},{"$f":"IFERROR(VLOOKUP(ROW()-5,Таблица!$A:$P,COLUMN()+1,0),\"\")","v":"LOC100448622"},{"$f":"IFERROR(VLOOKUP(ROW()-5,Таблица!$A:$P,COLUMN()+1,0),\"\")","v":"2020-03-11"},{"$f":"IFERROR(VLOOKUP(ROW()-5,Таблица!$A:$P,COLUMN()+1,0),\"\")","v":"2020-09-11"},{"$f":"IFERROR(VLOOKUP(ROW()-5,Таблица!$A:$P,COLUMN()+1,0),\"\")","v":"2020-07-11"},{"$f":"IFERROR(VLOOKUP(ROW()-5,Таблица!$A:$P,COLUMN()+1,0),\"\")","v":"00:00:00"},{"$f":"IFERROR(VLOOKUP(ROW()-5,Таблица!$A:$P,COLUMN()+1,0),\"\")","v":"00:00:00"}]
[{"$f":"IFERROR(VLOOKUP(ROW()-5,Таблица!$A:$P,COLUMN()+1,0),\"\")","v":60},{"$f":"IFERROR(VLOOKUP(ROW()-5,Таблица!$A:$P,COLUMN()+1,0),\"\")","v":"Электропаяльник ЭПСИ-40/220В"},{"$f":"IFERROR(VLOOKUP(ROW()-5,Таблица!$A:$P,COLUMN()+1,0),\"\")","v":2},{"$f":"IFERROR(VLOOKUP(ROW()-5,Таблица!$A:$P,COLUMN()+1,0),\"\")","v":"КАЗ №2"},{"$f":"IFERROR(VLOOKUP(ROW()-5,Таблица!$A:$P,COLUMN()+1,0),\"\")","v":"LOC100448622"},{"$f":"IFERROR(VLOOKUP(ROW()-5,Таблица!$A:$P,COLUMN()+1,0),\"\")","v":"2020-03-11"},{"$f":"IFERROR(VLOOKUP(ROW()-5,Таблица!$A:$P,COLUMN()+1,0),\"\")","v":"2020-09-11"},{"$f":"IFERROR(VLOOKUP(ROW()-5,Таблица!$A:$P,COLUMN()+1,0),\"\")","v":"2020-07-11"},{"$f":"IFERROR(VLOOKUP(ROW()-5,Таблица!$A:$P,COLUMN()+1,0),\"\")","v":"00:00:00"},{"$f":"IFERROR(VLOOKUP(ROW()-5,Таблица!$A:$P,COLUMN()+1,0),\"\")","v":"00:00:00"}]
[{"$f":"IFERROR(VLOOKUP(ROW()-5,Таблица!$A:$P,COLUMN()+1,0),\"\")","v":61},{"$f":"IFERROR(VLOOKUP(ROW()-5,Таблица!$A:$P,COLUMN()+1,0),\"\")","v":"Электропаяльник ЭПСИ-40/220В"},{"$f":"IFERROR(VLOOKUP(ROW()-5,Таблица!$A:$P,COLUMN()+1,0),\"\")","v":3},{"$f":"IFERROR(VLOOKUP(ROW()-5,Таблица!$A:$P,COLUMN()+1,0),\"\")","v":"КАЗ №2"},{"$f":"IFERROR(VLOOKUP(ROW()-5,Таблица!$A:$P,COLUMN()+1,0),\"\")","v":"LOC100448622"},{"$f":"IFERROR(VLOOKUP(ROW()-5,Таблица!$A:$P,COLUMN()+1,0),\"\")","v":"2020-03-11"},{"$f":"IFERROR(VLOOKUP(ROW()-5,Таблица!$A:$P,COLUMN()+1,0),\"\")","v":"2020-09-11"},{"$f":"IFERROR(VLOOKUP(ROW()-5,Таблица!$A:$P,COLUMN()+1,0),\"\")","v":"2020-07-11"},{"$f":"IFERROR(VLOOKUP(ROW()-5,Таблица!$A:$P,COLUMN()+1,0),\"\")","v":"00:00:00"},{"$f":"IFERROR(VLOOKUP(ROW()-5,Таблица!$A:$P,COLUMN()+1,0),\"\")","v":"00:00:00"}]
[{"$f":"IFERROR(VLOOKUP(ROW()-5,Таблица!$A:$P,COLUMN()+1,0),\"\")","v":62},{"$f":"IFERROR(VLOOKUP(ROW()-5,Таблица!$A:$P,COLUMN()+1,0),\"\")","v":"Электропаяльник ЭПСИ-40/220В"},{"$f":"IFERROR(VLOOKUP(ROW()-5,Таблица!$A:$P,COLUMN()+1,0),\"\")","v":4},{"$f":"IFERROR(VLOOKUP(ROW()-5,Таблица!$A:$P,COLUMN()+1,0),\"\")","v":"КАЗ №2"},{"$f":"IFERROR(VLOOKUP(ROW()-5,Таблица!$A:$P,COLUMN()+1,0),\"\")","v":"LOC100448622"},{"$f":"IFERROR(VLOOKUP(ROW()-5,Таблица!$A:$P,COLUMN()+1,0),\"\")","v":"2020-03-11"},{"$f":"IFERROR(VLOOKUP(ROW()-5,Таблица!$A:$P,COLUMN()+1,0),\"\")","v":"2020-09-11"},{"$f":"IFERROR(VLOOKUP(ROW()-5,Таблица!$A:$P,COLUMN()+1,0),\"\")","v":"2020-07-11"},{"$f":"IFERROR(VLOOKUP(ROW()-5,Таблица!$A:$P,COLUMN()+1,0),\"\")","v":"00:00:00"},{"$f":"IFERROR(VLOOKUP(ROW()-5,Таблица!$A:$P,COLUMN()+1,0),\"\")","v":"00:00:00"}]
[{"$f":"IFERROR(VLOOKUP(ROW()-5,Таблица!$A:$P,COLUMN()+1,0),\"\")","v":63},{"$f":"IFERROR(VLOOKUP(ROW()-5,Таблица!$A:$P,COLUMN()+1,0),\"\")","v":"Электропаяльник ЭПСН-100/220В"},{"$f":"IFERROR(VLOOKUP(ROW()-5,Таблица!$A:$P,COLUMN()+1,0),\"\")","v":1},{"$f":"IFERROR(VLOOKUP(ROW()-5,Таблица!$A:$P,COLUMN()+1,0),\"\")","v":"КАЗ №2"},{"$f":"IFERROR(VLOOKUP(ROW()-5,Таблица!$A:$P,COLUMN()+1,0),\"\")","v":"LOC100448624"},{"$f":"IFERROR(VLOOKUP(ROW()-5,Таблица!$A:$P,COLUMN()+1,0),\"\")","v":"2020-03-11"},{"$f":"IFERROR(VLOOKUP(ROW()-5,Таблица!$A:$P,COLUMN()+1,0),\"\")","v":"2020-09-11"},{"$f":"IFERROR(VLOOKUP(ROW()-5,Таблица!$A:$P,COLUMN()+1,0),\"\")","v":"2020-07-11"},{"$f":"IFERROR(VLOOKUP(ROW()-5,Таблица!$A:$P,COLUMN()+1,0),\"\")","v":"00:00:00"},{"$f":"IFERROR(VLOOKUP(ROW()-5,Таблица!$A:$P,COLUMN()+1,0),\"\")","v":"00:00:00"}]
[{"$f":"IFERROR(VLOOKUP(ROW()-5,Таблица!$A:$P,COLUMN()+1,0),\"\")","v":64},{"$f":"IFERROR(VLOOKUP(ROW()-5,Таблица!$A:$P,COLUMN()+1,0),\"\")","v":"Электропаяльник ЭПСН-100/220В"},{"$f":"IFERROR(VLOOKUP(ROW()-5,Таблица!$A:$P,COLUMN()+1,0),\"\")","v":2},{"$f":"IFERROR(VLOOKUP(ROW()-5,Таблица!$A:$P,COLUMN()+1,0),\"\")","v":"КАЗ №2"},{"$f":"IFERROR(VLOOKUP(ROW()-5,Таблица!$A:$P,COLUMN()+1,0),\"\")","v":"LOC100448624"},{"$f":"IFERROR(VLOOKUP(ROW()-5,Таблица!$A:$P,COLUMN()+1,0),\"\")","v":"2020-03-11"},{"$f":"IFERROR(VLOOKUP(ROW()-5,Таблица!$A:$P,COLUMN()+1,0),\"\")","v":"2020-09-11"},{"$f":"IFERROR(VLOOKUP(ROW()-5,Таблица!$A:$P,COLUMN()+1,0),\"\")","v":"2020-07-11"},{"$f":"IFERROR(VLOOKUP(ROW()-5,Таблица!$A:$P,COLUMN()+1,0),\"\")","v":"00:00:00"},{"$f":"IFERROR(VLOOKUP(ROW()-5,Таблица!$A:$P,COLUMN()+1,0),\"\")","v":"00:00:00"}]
[{"$f":"IFERROR(VLOOKUP(ROW()-5,Таблица!$A:$P,COLUMN()+1,0),\"\")","v":66},{"$f":"IFERROR(VLOOKUP(ROW()-5,Таблица!$A:$P,COLUMN()+1,0),\"\")","v":"Машина шлифовальная  МА 2001"},{"$f":"IFERROR(VLOOKUP(ROW()-5,Таблица!$A:$P,COLUMN()+1,0),\"\")","v":0},{"$f":"IFERROR(VLOOKUP(ROW()-5,Таблица!$A:$P,COLUMN()+1,0),\"\")","v":"КАЗ №2"},{"$f":"IFERROR(VLOOKUP(ROW()-5,Таблица!$A:$P,COLUMN()+1,0),\"\")","v":"350000043351"},{"$f":"IFERROR(VLOOKUP(ROW()-5,Таблица!$A:$P,COLUMN()+1,0),\"\")","v":"2020-03-11"},{"$f":"IFERROR(VLOOKUP(ROW()-5,Таблица!$A:$P,COLUMN()+1,0),\"\")","v":"2020-09-11"},{"$f":"IFERROR(VLOOKUP(ROW()-5,Таблица!$A:$P,COLUMN()+1,0),\"\")","v":"2020-07-11"},{"$f":"IFERROR(VLOOKUP(ROW()-5,Таблица!$A:$P,COLUMN()+1,0),\"\")","v":"00:00:00"},{"$f":"IFERROR(VLOOKUP(ROW()-5,Таблица!$A:$P,COLUMN()+1,0),\"\")","v":"00:00:00"}]
[{"$f":"IFERROR(VLOOKUP(ROW()-5,Таблица!$A:$P,COLUMN()+1,0),\"\")","v":67},{"$f":"IFERROR(VLOOKUP(ROW()-5,Таблица!$A:$P,COLUMN()+1,0),\"\")","v":"Машина электрическая перфорационная МЭП-500 ЭРУ"},{"$f":"IFERROR(VLOOKUP(ROW()-5,Таблица!$A:$P,COLUMN()+1,0),\"\")","v":0},{"$f":"IFERROR(VLOOKUP(ROW()-5,Таблица!$A:$P,COLUMN()+1,0),\"\")","v":"КАЗ №2"},{"$f":"IFERROR(VLOOKUP(ROW()-5,Таблица!$A:$P,COLUMN()+1,0),\"\")","v":"350000043521"},{"$f":"IFERROR(VLOOKUP(ROW()-5,Таблица!$A:$P,COLUMN()+1,0),\"\")","v":"2020-03-11"},{"$f":"IFERROR(VLOOKUP(ROW()-5,Таблица!$A:$P,COLUMN()+1,0),\"\")","v":"2020-09-11"},{"$f":"IFERROR(VLOOKUP(ROW()-5,Таблица!$A:$P,COLUMN()+1,0),\"\")","v":"2020-07-11"},{"$f":"IFERROR(VLOOKUP(ROW()-5,Таблица!$A:$P,COLUMN()+1,0),\"\")","v":"00:00:00"},{"$f":"IFERROR(VLOOKUP(ROW()-5,Таблица!$A:$P,COLUMN()+1,0),\"\")","v":"00:00:00"}]
[{"$f":"IFERROR(VLOOKUP(ROW()-5,Таблица!$A:$P,COLUMN()+1,0),\"\")","v":68},{"$f":"IFERROR(VLOOKUP(ROW()-5,Таблица!$A:$P,COLUMN()+1,0),\"\")","v":"Дрель Интерскол Д-16/1050Р2 безударная"},{"$f":"IFERROR(VLOOKUP(ROW()-5,Таблица!$A:$P,COLUMN()+1,0),\"\")","v":0},{"$f":"IFERROR(VLOOKUP(ROW()-5,Таблица!$A:$P,COLUMN()+1,0),\"\")","v":"КАЗ №2"},{"$f":"IFERROR(VLOOKUP(ROW()-5,Таблица!$A:$P,COLUMN()+1,0),\"\")","v":"LOC100733042"},{"$f":"IFERROR(VLOOKUP(ROW()-5,Таблица!$A:$P,COLUMN()+1,0),\"\")","v":"2020-03-11"},{"$f":"IFERROR(VLOOKUP(ROW()-5,Таблица!$A:$P,COLUMN()+1,0),\"\")","v":"2020-09-11"},{"$f":"IFERROR(VLOOKUP(ROW()-5,Таблица!$A:$P,COLUMN()+1,0),\"\")","v":"2020-07-11"},{"$f":"IFERROR(VLOOKUP(ROW()-5,Таблица!$A:$P,COLUMN()+1,0),\"\")","v":"00:00:00"},{"$f":"IFERROR(VLOOKUP(ROW()-5,Таблица!$A:$P,COLUMN()+1,0),\"\")","v":"00:00:00"}]
[{"$f":"IFERROR(VLOOKUP(ROW()-5,Таблица!$A:$P,COLUMN()+1,0),\"\")","v":71},{"$f":"IFERROR(VLOOKUP(ROW()-5,Таблица!$A:$P,COLUMN()+1,0),\"\")","v":"Фильтр сетев.ZIS Pilot-PRO( 5роз)+1 3м"},{"$f":"IFERROR(VLOOKUP(ROW()-5,Таблица!$A:$P,COLUMN()+1,0),\"\")","v":1},{"$f":"IFERROR(VLOOKUP(ROW()-5,Таблица!$A:$P,COLUMN()+1,0),\"\")","v":"Каб.нач."},{"$f":"IFERROR(VLOOKUP(ROW()-5,Таблица!$A:$P,COLUMN()+1,0),\"\")","v":"LOC100444829"},{"$f":"IFERROR(VLOOKUP(ROW()-5,Таблица!$A:$P,COLUMN()+1,0),\"\")","v":"2019-11-25"},{"$f":"IFERROR(VLOOKUP(ROW()-5,Таблица!$A:$P,COLUMN()+1,0),\"\")","v":"2020-05-25"},{"$f":"IFERROR(VLOOKUP(ROW()-5,Таблица!$A:$P,COLUMN()+1,0),\"\")","v":"2020-03-25"},{"$f":"IFERROR(VLOOKUP(ROW()-5,Таблица!$A:$P,COLUMN()+1,0),\"\")","v":"00:00:00"},{"$f":"IFERROR(VLOOKUP(ROW()-5,Таблица!$A:$P,COLUMN()+1,0),\"\")","v":"00:00:00"}]
[{"$f":"IFERROR(VLOOKUP(ROW()-5,Таблица!$A:$P,COLUMN()+1,0),\"\")","v":""},{"$f":"IFERROR(VLOOKUP(ROW()-5,Таблица!$A:$P,COLUMN()+1,0),\"\")","v":""},{"$f":"IFERROR(VLOOKUP(ROW()-5,Таблица!$A:$P,COLUMN()+1,0),\"\")","v":""},{"$f":"IFERROR(VLOOKUP(ROW()-5,Таблица!$A:$P,COLUMN()+1,0),\"\")","v":""},{"$f":"IFERROR(VLOOKUP(ROW()-5,Таблица!$A:$P,COLUMN()+1,0),\"\")","v":""},{"$f":"IFERROR(VLOOKUP(ROW()-5,Таблица!$A:$P,COLUMN()+1,0),\"\")","v":""},{"$f":"IFERROR(VLOOKUP(ROW()-5,Таблица!$A:$P,COLUMN()+1,0),\"\")","v":""},{"$f":"IFERROR(VLOOKUP(ROW()-5,Таблица!$A:$P,COLUMN()+1,0),\"\")","v":""},{"$f":"IFERROR(VLOOKUP(ROW()-5,Таблица!$A:$P,COLUMN()+1,0),\"\")","v":""},{"$f":"IFERROR(VLOOKUP(ROW()-5,Таблица!$A:$P,COLUMN()+1,0),\"\")","v":""}]
[{"$f":"IFERROR(VLOOKUP(ROW()-5,Таблица!$A:$P,COLUMN()+1,0),\"\")","v":""},{"$f":"IFERROR(VLOOKUP(ROW()-5,Таблица!$A:$P,COLUMN()+1,0),\"\")","v":""},{"$f":"IFERROR(VLOOKUP(ROW()-5,Таблица!$A:$P,COLUMN()+1,0),\"\")","v":""},{"$f":"IFERROR(VLOOKUP(ROW()-5,Таблица!$A:$P,COLUMN()+1,0),\"\")","v":""},{"$f":"IFERROR(VLOOKUP(ROW()-5,Таблица!$A:$P,COLUMN()+1,0),\"\")","v":""},{"$f":"IFERROR(VLOOKUP(ROW()-5,Таблица!$A:$P,COLUMN()+1,0),\"\")","v":""},{"$f":"IFERROR(VLOOKUP(ROW()-5,Таблица!$A:$P,COLUMN()+1,0),\"\")","v":""},{"$f":"IFERROR(VLOOKUP(ROW()-5,Таблица!$A:$P,COLUMN()+1,0),\"\")","v":""},{"$f":"IFERROR(VLOOKUP(ROW()-5,Таблица!$A:$P,COLUMN()+1,0),\"\")","v":""},{"$f":"IFERROR(VLOOKUP(ROW()-5,Таблица!$A:$P,COLUMN()+1,0),\"\")","v":""}]
[{"$f":"IFERROR(VLOOKUP(ROW()-5,Таблица!$A:$P,COLUMN()+1,0),\"\")","v":""},{"$f":"IFERROR(VLOOKUP(ROW()-5,Таблица!$A:$P,COLUMN()+1,0),\"\")","v":""},{"$f":"IFERROR(VLOOKUP(ROW()-5,Таблица!$A:$P,COLUMN()+1,0),\"\")","v":""},{"$f":"IFERROR(VLOOKUP(ROW()-5,Таблица!$A:$P,COLUMN()+1,0),\"\")","v":""},{"$f":"IFERROR(VLOOKUP(ROW()-5,Таблица!$A:$P,COLUMN()+1,0),\"\")","v":""},{"$f":"IFERROR(VLOOKUP(ROW()-5,Таблица!$A:$P,COLUMN()+1,0),\"\")","v":""},{"$f":"IFERROR(VLOOKUP(ROW()-5,Таблица!$A:$P,COLUMN()+1,0),\"\")","v":""},{"$f":"IFERROR(VLOOKUP(ROW()-5,Таблица!$A:$P,COLUMN()+1,0),\"\")","v":""},{"$f":"IFERROR(VLOOKUP(ROW()-5,Таблица!$A:$P,COLUMN()+1,0),\"\")","v":""},{"$f":"IFERROR(VLOOKUP(ROW()-5,Таблица!$A:$P,COLUMN()+1,0),\"\")","v":""}]
[{"$f":"IFERROR(VLOOKUP(ROW()-5,Таблица!$A:$P,COLUMN()+1,0),\"\")","v":""},{"$f":"IFERROR(VLOOKUP(ROW()-5,Таблица!$A:$P,COLUMN()+1,0),\"\")","v":""},{"$f":"IFERROR(VLOOKUP(ROW()-5,Таблица!$A:$P,COLUMN()+1,0),\"\")","v":""},{"$f":"IFERROR(VLOOKUP(ROW()-5,Таблица!$A:$P,COLUMN()+1,0),\"\")","v":""},{"$f":"IFERROR(VLOOKUP(ROW()-5,Таблица!$A:$P,COLUMN()+1,0),\"\")","v":""},{"$f":"IFERROR(VLOOKUP(ROW()-5,Таблица!$A:$P,COLUMN()+1,0),\"\")","v":""},{"$f":"IFERROR(VLOOKUP(ROW()-5,Таблица!$A:$P,COLUMN()+1,0),\"\")","v":""},{"$f":"IFERROR(VLOOKUP(ROW()-5,Таблица!$A:$P,COLUMN()+1,0),\"\")","v":""},{"$f":"IFERROR(VLOOKUP(ROW()-5,Таблица!$A:$P,COLUMN()+1,0),\"\")","v":""},{"$f":"IFERROR(VLOOKUP(ROW()-5,Таблица!$A:$P,COLUMN()+1,0),\"\")","v":""}]
[{"$f":"IFERROR(VLOOKUP(ROW()-5,Таблица!$A:$P,COLUMN()+1,0),\"\")","v":""},{"$f":"IFERROR(VLOOKUP(ROW()-5,Таблица!$A:$P,COLUMN()+1,0),\"\")","v":""},{"$f":"IFERROR(VLOOKUP(ROW()-5,Таблица!$A:$P,COLUMN()+1,0),\"\")","v":""},{"$f":"IFERROR(VLOOKUP(ROW()-5,Таблица!$A:$P,COLUMN()+1,0),\"\")","v":""},{"$f":"IFERROR(VLOOKUP(ROW()-5,Таблица!$A:$P,COLUMN()+1,0),\"\")","v":""},{"$f":"IFERROR(VLOOKUP(ROW()-5,Таблица!$A:$P,COLUMN()+1,0),\"\")","v":""},{"$f":"IFERROR(VLOOKUP(ROW()-5,Таблица!$A:$P,COLUMN()+1,0),\"\")","v":""},{"$f":"IFERROR(VLOOKUP(ROW()-5,Таблица!$A:$P,COLUMN()+1,0),\"\")","v":""},{"$f":"IFERROR(VLOOKUP(ROW()-5,Таблица!$A:$P,COLUMN()+1,0),\"\")","v":""},{"$f":"IFERROR(VLOOKUP(ROW()-5,Таблица!$A:$P,COLUMN()+1,0),\"\")","v":""}]
[{"$f":"IFERROR(VLOOKUP(ROW()-5,Таблица!$A:$P,COLUMN()+1,0),\"\")","v":""},{"$f":"IFERROR(VLOOKUP(ROW()-5,Таблица!$A:$P,COLUMN()+1,0),\"\")","v":""},{"$f":"IFERROR(VLOOKUP(ROW()-5,Таблица!$A:$P,COLUMN()+1,0),\"\")","v":""},{"$f":"IFERROR(VLOOKUP(ROW()-5,Таблица!$A:$P,COLUMN()+1,0),\"\")","v":""},{"$f":"IFERROR(VLOOKUP(ROW()-5,Таблица!$A:$P,COLUMN()+1,0),\"\")","v":""},{"$f":"IFERROR(VLOOKUP(ROW()-5,Таблица!$A:$P,COLUMN()+1,0),\"\")","v":""},{"$f":"IFERROR(VLOOKUP(ROW()-5,Таблица!$A:$P,COLUMN()+1,0),\"\")","v":""},{"$f":"IFERROR(VLOOKUP(ROW()-5,Таблица!$A:$P,COLUMN()+1,0),\"\")","v":""},{"$f":"IFERROR(VLOOKUP(ROW()-5,Таблица!$A:$P,COLUMN()+1,0),\"\")","v":""},{"$f":"IFERROR(VLOOKUP(ROW()-5,Таблица!$A:$P,COLUMN()+1,0),\"\")","v":""}]
[]
[null,"январь",null,"годовой проверки"]
[null,"февраль",null,"отправки на испытание"]
[null,"март",null,"периодического осмотра"]
[null,"апрель",null,"квартального осмотра"]
[null,"май"]
[null,"июнь"]
[null,"июль"]
[null,"август"]
[null,"сентябрь"]
[null,"октябрь"]
[null,"ноябрь"]
[null,"декабрь"]

{"sheet":"123","index":3,"n_rows":50,"n_cols":10,"rows_kept":50,"cut":false,"hidden":false,"merged":[[2,9,17,9],[35,0,40,0],[41,0,49,0],[0,3,0,6],[0,0,0,2],[2,0,14,0],[15,0,24,0],[25,0,34,0]]}
["Наличие СИЗ на",null,null,{"$f":"TODAY()","v":"2020-05-30"}]
["Место нахождения","№ п/п","Наименование СИЗ","Поряд. № СИЗ","Инв. №","Дата последней годовой проверки","Дата следующей годовой проверки"]
["АТС",1,{"$f":"INDEX(Таблица!$C$4:$H$76,MATCH($A$3,Таблица!$E$4:$E$76,0),1)","v":"Перчатки диэлектрические"},{"$f":"INDEX(Таблица!$C$4:$H$76,MATCH($A$3,Таблица!$E$4:$E$76,0),2)","v":31},{"$f":"INDEX(Таблица!$C$4:$H$76,MATCH($A$3,Таблица!$E$4:$E$76,0),4)","v":"LOC100433954"},{"$f":"INDEX(Таблица!$C$4:$H$76,MATCH($A$3,Таблица!$E$4:$E$76,0),6)","v":"2020-09-11"},{"$f":"INDEX(Таблица!$C$4:$H$76,MATCH($A$3,Таблица!$E$4:$E$76,0),5)","v":"2020-03-11"},null,null,"Здравствуйте, подскажите, пожалуйста!В желтую строку вставила формулу. Она работает. То есть из таблицы берет данные, сравнивая место нахождения. То есть мне надо, чтобы все  СИЗ, которые находятся , например в АТС в таблице в первом файле собирались в ячейках АТС в файле 123. При изменении в Таблице, менялось и в 123"]
[null,2,{"$f":"INDEX(Таблица!$C$4:$H$76,MATCH($A$3,Таблица!$E$4:$E$76,0),1)","v":"Перчатки диэлектрические"},{"$f":"INDEX(Таблица!$C$4:$H$76,MATCH($A$3,Таблица!$E$4:$E$76,0),2)","v":31},{"$f":"INDEX(Таблица!$C$4:$H$76,MATCH($A$3,Таблица!$E$4:$E$76,0),4)","v":"LOC100433954"},{"$f":"INDEX(Таблица!$C$4:$H$76,MATCH($A$3,Таблица!$E$4:$E$76,0),6)","v":"2020-09-11"},{"$f":"INDEX(Таблица!$C$4:$H$76,MATCH($A$3,Таблица!$E$4:$E$76,0),5)","v":"2020-03-11"}]
[null,3,"Боты диэлектрические",12,"LOC100416152","2020-03-11","2023-03-11"]
[null,4,"Боты диэлектрические",9,"350010000716","2019-11-25","2022-11-25"]
[null,5,"Индикатор ИНО-500 напряжения-отвертк",6,"LOC100422159","2019-08-20","2020-08-20"]
[null,6,"Индикатор ИНО-500 напряжения-отвертк",8,"LOC100422159","2019-11-25","2020-11-25"]
[null,7,"Ковер диэлектрический  ","8-9"]
[null,8,"Отвертка","3-1","LOC100431348","2019-08-19","2020-08-19"]
[null,9,"Отвертка","3-2","LOC100431348","2019-08-19","2020-08-19"]
[null,10,"Отвертка","3-3","LOC100431348","2019-08-19","2020-08-19"]
[null,11,"Отвертка","3-4","LOC100431348","2019-08-19","2020-08-19"]
[null,12,"Отвертка","3-5","LOC100431348","2019-08-19","2020-08-19"]
[null,13,"Отвертка","3-6","LOC100431348","2019-08-19","2020-08-19"]
["ВБ",1,{"$f":"INDEX(Таблица!$C$4:$H$76,MATCH($A$16,Таблица!$E$4:$E$76,0),1)","v":"Перчатки диэлектрические"},{"$f":"INDEX(Таблица!$C$4:$H$76,MATCH($A$16,Таблица!$E$4:$E$76,0),2)","v":5},{"$f":"INDEX(Таблица!$C$4:$H$76,MATCH($A$16,Таблица!$E$4:$E$76,0),4)","v":"LOC100433954"},{"$f":"INDEX(Таблица!$C$4:$H$76,MATCH($A$16,Таблица!$E$4:$E$76,0),6)","v":"2020-09-11"},{"$f":"INDEX(Таблица!$C$4:$H$76,MATCH($A$16,Таблица!$E$4:$E$76,0),5)","v":"2020-03-11"}]
[null,2,"Перчатки диэлектрические",9,"LOC100433954","на испытании"]
[null,3,"Индикатор ИНО-500 напряжения-отвертк",10,"LOC100422159","2019-08-20","2020-08-20"]
[null,4,"Индикатор ИНО-500 напряжения-отвертк",9,"LOC100422159","2019-11-25","2020-11-25"]
[null,5,"Отвертка","4-1","LOC100431348","2019-08-19","2020-08-19"]
[null,6,"Отвертка","4-2","LOC100431348","2019-08-19","2020-08-19"]
[null,7,"Отвертка","4-3","LOC100431348","2019-08-19","2020-08-19"]
[null,8,"Отвертка","4-4","LOC100431348","2019-08-19","2020-08-19"]
[null,9,"Отвертка","4-5","LOC100431348","2019-08-19","2020-08-19"]
[null,10,"Отвертка","4-6","LOC100431348","2019-08-19","2020-08-19"]
["Выпрям.",1,"Перчатки диэлектрические",4,"LOC100433954","2020-03-11","2020-09-11"]
[null,2,"Перчатки диэлектрические (новые)",11,"LOC100828099","на испытании"]
[null,3,"Боты диэлектрические",11,"350010000715","2019-02-19","2022-02-19"]
[null,4,"Боты диэлектрические (новые)",10,"LOC100827944","на испытании"]
[null,5,"Индикатор напряж.ПИН90-2М",5,"LOC100422167","2019-08-20","2020-08-20"]
[null,6,"Индикатор напряж.ПИН90-2М",7,"LOC100422167","2019-11-25","2020-11-25"]
[null,7,"Ковер диэлектрический  ","10-14"]
[null,8,"Отвертка","2-1","LOC100431335","2019-08-23","2020-08-23"]
[null,9,"Отвертка","2-2","LOC100431335","2019-08-23","2020-08-23"]
[null,10,"Отвертка","2-3","LOC100431335","2019-08-23","2020-08-23"]
["Выпрям.",11,"Отвертка","2-4","LOC100431335","2019-08-23","2020-08-23"]
[null,12,"Отвертка","2-5","LOC100431335","2019-08-23","2020-08-23"]
[null,13,"Отвертка","2-6","LOC100431335","2019-08-23","2020-08-23"]
[null,14,"Пассатижи","2-1","LOC100433506","2019-08-23","2020-08-23"]
[null,15,"Круглогубцы","2-2","LOC100427548","2019-08-23","2020-08-23"]
[null,16,"Бокорезы","2-3","LOC100415755","2019-08-23","2020-08-23"]
["КАЗ №2",1,"Отвертка","1-1","LOC100431335","2019-11-25","2020-11-25"]
[null,2,"Отвертка","1-2","LOC100431335","2019-11-25","2020-11-25"]
[null,3,"Отвертка","1-3","LOC100431335","2019-11-25","2020-11-25"]
[null,4,"Отвертка","1-4","LOC100431335","2019-11-25","2020-11-25"]
[null,5,"Отвертка","1-5","LOC100431335","2019-11-25","2020-11-25"]
[null,6,"Отвертка","1-6","LOC100431335","2019-11-25","2020-11-25"]
[null,7,"Пассатижи","1-1","LOC100433506","2019-11-25","2020-11-25"]
[null,8,"Круглогубцы","1-2","LOC100427548","2019-11-25","2020-11-25"]
[null,9,"Бокорезы","1-3","LOC100415755","2019-11-25","2020-11-25"]

{"sheet":"Перчатки","index":4,"n_rows":27,"n_cols":14,"rows_kept":27,"cut":false,"hidden":true,"merged":[[23,5,23,6],[25,1,25,2],[25,5,25,6],[25,8,25,10],[26,5,26,6],[14,2,14,6],[14,9,14,10],[16,2,16,6],[16,9,16,10],[22,1,22,2],[22,5,22,6],[22,8,22,10],[15,2,15,6],[15,9,15,10],[12,2,12,6],[12,8,12,10],[13,2,13,6],[13,9,13,10],[10,1,10,10],[9,1,9,5],[9,6,9,7],[9,8,9,9],[2,1,2,9],[3,1,3,9],[8,1,8,3],[6,0,6,10],[5,0,5,10]]}
[null,null,null,null,null,null,null,null,null,null,null,null,"А.А. Шаврин","начальник участка связи №5"]
[null,null,null,null,null,null,null,null,null,null,null,null,"В.И. Алмакаев","инженер участка связи №5"]
[null,"НОЯБРЬСКИЙ ЦЕХ СВЯЗИ",null,null,null,null,null,null,null,null,null,null,"Д.А. Глазовский","инженер участка связи №5"]
[null,"Участок связи №5"]
[]
["АКТ"]
["приема – передачи "]
[]
[null,{"$f":"TODAY()","v":"2020-05-30"}]
[null,"Настоящий акт составлен о том, что",null,null,null,null,{"$f":"VLOOKUP(I10,M$1:N$3,2,B$1)","v":"инженер участка связи №5"},null,"В.И. Алмакаев",null,"передал"]
[null,"а представитель АПГ №1 получил следующие СИЗ:"]
[]
[null,"№ п/п","Наименование ",null,null,null,null,"Кол-во","Инвентарный номер"]
[null,1,"Перчатки диэлектрические № 4",null,null,null,null,1,"№",{"$f":"VLOOKUP(C14,Лист1!A$1:B$41,2,B$1)","v":"LOC100433954"}]
[null,2,"Перчатки диэлектрические № 5",null,null,null,null,1,"№",{"$f":"VLOOKUP(C15,Лист1!A$1:B$41,2,B$1)","v":"LOC100433954"}]
[null,3,"Перчатки диэлектрические № 31",null,null,null,null,1,"№",{"$f":"VLOOKUP(C16,Лист1!A$1:B$41,2,B$1)","v":"LOC100433954"}]
[null,null,"Итого",null,null,null,null,{"$f":"SUM(H14:H16)","v":3}]
[]
[null,"Настоящий акт составлен в одном экземпляре:"]
[]
[]
[]
[null,"Сдал:",null,null,null,null,null,null,{"$f":"I10","v":"В.И. Алмакаев"}]
[null,null,null,null,null,"(подпись)"]
[]
[null,"Принял:"]
[null,null,null,null,null,"(подпись)"]

{"sheet":"Электроинструмент","index":5,"n_rows":29,"n_cols":14,"rows_kept":29,"cut":false,"hidden":true,"merged":[[28,5,28,6],[24,1,24,2],[24,5,24,6],[24,8,24,10],[25,5,25,6],[27,1,27,2],[27,5,27,6],[27,8,27,10],[15,2,15,6],[15,9,15,10],[17,2,17,6],[17,9,17,10],[18,2,18,6],[18,9,18,10],[16,2,16,6],[16,9,16,10],[12,2,12,6],[12,8,12,10],[13,2,13,6],[13,9,13,10],[14,2,14,6],[14,9,14,10],[2,1,2,9],[3,1,3,9],[8,1,8,3],[10,1,10,5],[10,7,10,10],[9,1,9,5],[9,6,9,7],[9,8,9,9],[5,0,5,10],[6,0,6,10]]}
[null,null,null,null,null,null,null,null,null,null,null,null,"А.А. Шаврин","начальник участка связи №5"]
[null,null,null,null,null,null,null,null,null,null,null,null,"В.И. Алмакаев","инженер участка связи №5"]
[null,"НОЯБРЬСКИЙ ЦЕХ СВЯЗИ",null,null,null,null,null,null,null,null,null,null,"Д.А. Глазовский","инженер участка связи №5"]
[null,"Участок связи №5"]
[]
["АКТ"]
["приема – передачи электроинструмента и такелажных средств"]
[]
[null,{"$f":"TODAY()","v":"2020-05-30"}]
[null,"Настоящий акт составлен о том, что",null,null,null,null,{"$f":"VLOOKUP(I10,M$1:N$3,2,B$1)","v":"инженер участка связи №5"},null,"В.И. Алмакаев",null,"передал"]
[null,"а инженер Ноябрьского цеха связи    ",null,null,null,null,"Б.Н. Хмельницкий","принял на испытания:"]
[]
[null,"№ п/п","Наименование ",null,null,null,null,"Кол-во","Инвентарный номер"]
[null,1,"Электропаяльник ЭПСИ-40/220В",null,null,null,null,4,"№",{"$f":"VLOOKUP(C14,Лист1!A$1:B$41,2,B$1)","v":"LOC100448622"}]
[null,3,"Электропаяльник ЭПСН-100/220В",null,null,null,null,2,"№",{"$f":"VLOOKUP(C15,Лист1!A$1:B$41,2,B$1)","v":"LOC100448624"}]
[null,4,"Машина шлифовальная  МА 2001",null,null,null,null,1,"№",{"$f":"VLOOKUP(C16,Лист1!A$1:B$41,2,B$1)","v":"350000043351"}]
[null,5,"Машина электрическая перфорационная МЭП-500 ЭРУ",null,null,null,null,1,"№",{"$f":"VLOOKUP(C17,Лист1!A$1:B$41,2,B$1)","v":"350000043521"}]
[null,6,"Дрель Интерскол Д-16/1050Р2 безударная",null,null,null,null,1,"№",{"$f":"VLOOKUP(C18,Лист1!A$1:B$41,2,B$1)","v":"LOC100733042"}]
[null,null,"Итого",null,null,null,null,{"$f":"SUM(H14:H18)","v":9}]
[]
[null,"Настоящий акт составлен в двух экземплярах:"]
[null,"1 экз. для участка связи № 5 НЦС УС"]
[null,"2 экз. для НЦС"]
[]
[null,"Сдал:",null,null,null,null,null,null,{"$f":"I10","v":"В.И. Алмакаев"}]
[null,null,null,null,null,"(подпись)"]
[]
[null,"Принял:",null,null,null,null,null,null,{"$f":"G11","v":"Б.Н. Хмельницкий"}]
[null,null,null,null,null,"(подпись)"]

{"sheet":"Руч.инструм.","index":6,"n_rows":33,"n_cols":14,"rows_kept":33,"cut":false,"hidden":true,"merged":[[17,2,17,6],[15,9,15,10],[16,9,16,10],[17,9,17,10],[29,5,29,6],[21,2,21,6],[20,9,20,10],[21,9,21,10],[18,2,18,6],[18,9,18,10],[19,2,19,6],[19,9,19,10],[20,2,20,6],[15,2,15,6],[16,2,16,6],[31,1,31,2],[31,5,31,6],[31,8,31,10],[32,5,32,6],[22,2,22,6],[22,9,22,10],[28,1,28,2],[28,5,28,6],[28,8,28,10],[12,2,12,6],[12,8,12,10],[13,2,13,6],[13,9,13,10],[14,2,14,6],[14,9,14,10],[2,1,2,9],[3,1,3,9],[8,1,8,3],[10,1,10,5],[10,7,10,10],[9,1,9,5],[9,6,9,7],[9,8,9,9],[6,0,6,10],[5,0,5,10]]}
[null,null,null,null,null,null,null,null,null,null,null,null,"А.А. Шаврин","начальник участка связи №5"]
[null,null,null,null,null,null,null,null,null,null,null,null,"В.И. Алмакаев","инженер участка связи №5"]
[null,"НОЯБРЬСКИЙ ЦЕХ СВЯЗИ",null,null,null,null,null,null,null,null,null,null,"Д.А. Глазовский","инженер участка связи №5"]
[null,"Участок связи №5"]
[]
["АКТ"]
["приема – передачи ручного электроинструмента"]
[]
[null,{"$f":"TODAY()","v":"2020-05-30"}]
[null,"Настоящий акт составлен о том, что",null,null,null,null,{"$f":"VLOOKUP(I10,M$1:N$3,2,B$1)","v":"инженер участка связи №5"},null,"В.И. Алмакаев",null,"передал"]
[null,"а инженер Ноябрьского цеха связи    ",null,null,null,null,"Б.Н. Хмельницкий","принял на испытания:"]
[]
[null,"№ п/п","Наименование ",null,null,null,null,"Кол-во","Инвентарный номер"]
[null,1,"Индикатор напряж.ПИН90-2М № 5",null,null,null,null,1,"№",{"$f":"VLOOKUP(C14,Лист1!A$1:B$41,2,B$1)","v":"LOC100422167"}]
[null,2,"Индикатор ИНО-500 напряжения-отвертк № 6",null,null,null,null,1,"№",{"$f":"VLOOKUP(C15,Лист1!A$1:B$41,2,B$1)","v":"LOC100422159"}]
[null,3,"Перчатки диэлектрические № 10",null,null,null,null,1,"№",{"$f":"VLOOKUP(C16,Лист1!A$1:B$41,2,B$1)","v":"LOC100433954"}]
[null,4,"Набор отверток № 2",null,null,null,null,6,"№",{"$f":"VLOOKUP(C17,Лист1!A$1:B$41,2,B$1)","v":"LOC100431335"}]
[null,5,"Пассатижи 2-1",null,null,null,null,1,"№",{"$f":"VLOOKUP(C18,Лист1!A$1:B$41,2,B$1)","v":"LOC100433506"}]
[null,6,"Круглогубцы 2-2",null,null,null,null,1,"№",{"$f":"VLOOKUP(C19,Лист1!A$1:B$41,2,B$1)","v":"LOC100427548"}]
[null,7,"Бокорезы 2-3",null,null,null,null,1,"№",{"$f":"VLOOKUP(C20,Лист1!A$1:B$41,2,B$1)","v":"LOC100415755"}]
[null,8,"Набор отверток № 3",null,null,null,null,6,"№",{"$f":"VLOOKUP(C21,Лист1!A$1:B$41,2,B$1)","v":"LOC100431348"}]
[null,9,"Набор отверток № 4",null,null,null,null,6,"№",{"$f":"VLOOKUP(C22,Лист1!A$1:B$41,2,B$1)","v":"LOC100431348"}]
[null,null,"Итого",null,null,null,null,{"$f":"SUM(H14:H22)","v":24}]
[]
[null,"Настоящий акт составлен в двух экземплярах:"]
[null,"1 экз. для участка связи № 5 НЦС УС"]
[null,"2 экз. для НЦС"]
[]
[null,"Сдал:",null,null,null,null,null,null,{"$f":"I10","v":"В.И. Алмакаев"}]
[null,null,null,null,null,"(подпись)"]
[]
[null,"Принял:",null,null,null,null,null,null,{"$f":"G11","v":"Б.Н. Хмельницкий"}]
[null,null,null,null,null,"(подпись)"]

{"sheet":"Лист1","index":7,"n_rows":41,"n_cols":2,"rows_kept":41,"cut":false,"hidden":true,"merged":[]}
["Перчатки диэлектрические № 4","LOC100433954"]
["Перчатки диэлектрические № 5","LOC100433954"]
["Перчатки диэлектрические № 9","LOC100433954"]
["Перчатки диэлектрические № 10","LOC100433954"]
["Перчатки диэлектрические № 11","LOC100828099"]
["Перчатки диэлектрические № 31","LOC100433954"]
["Боты диэлектрические № 9","350010000716"]
["Боты диэлектрические № 10","LOC100827944"]
["Боты диэлектрические № 11","350010000715"]
["Боты диэлектрические № 12","LOC100416152"]
["Набор отверток № 1 ","LOC100431335"]
["Пассатижи 1-1","LOC100433506"]
["Круглогубцы 1-2","LOC100427548"]
["Бокорезы 1-3","LOC100415755"]
["Набор отверток № 2","LOC100431335"]
["Пассатижи 2-1","LOC100433506"]
["Круглогубцы 2-2","LOC100427548"]
["Бокорезы 2-3","LOC100415755"]
["Набор отверток № 3","LOC100431348"]
["Набор отверток № 4","LOC100431348"]
["Индикатор ИНО-500 напряжения-отвертк № 6","LOC100422159"]
["Индикатор ИНО-500 напряжения-отвертк № 8","LOC100422159"]
["Индикатор ИНО-500 напряжения-отвертк № 9","LOC100422159"]
["Индикатор ИНО-500 напряжения-отвертк № 10","LOC100422159"]
["Индикатор напряж.ПИН90-2М № 5","LOC100422167"]
["Индикатор напряж.ПИН90-2М № 7","LOC100422167"]
["Лестница-стремян.Elkop ALW 403 3х56,5","LOC100834072"]
["Лестница-стремян.Elkop ALW 506 6х121","LOC100834073"]
["Электропаяльник ЭПСИ-40/220В","LOC100448622"]
["Электропаяльник ЭПСИ-40/220В","LOC100448622"]
["Электропаяльник ЭПСИ-40/220В","LOC100448622"]
["Электропаяльник ЭПСИ-40/220В","LOC100448622"]
["Электропаяльник ЭПСН-100/220В","LOC100448624"]
["Электропаяльник ЭПСН-100/220В","LOC100448624"]
["Машина шлифовальная  МА 2001","350000043351"]
["Машина электрическая перфорационная МЭП-500 ЭРУ","350000043521"]
["Дрель Интерскол Д-16/1050Р2 безударная","LOC100733042"]
["Удлинитель EKF Эксперт UBA16-310-4-05 5м","LOC100715318"]
["Удлинитель UNIVersal У10-555 5м 4гн","LOC100443989"]
["Фильтр сетев.ZIS Pilot-PRO( 5роз)+1 3м №1","LOC100444829"]
["Фильтр сетев.ZIS Pilot-PRO( 5роз)+1 3м №2","LOC100444829"]