{"text_format":"1","workbook":"xlsx","n_sheets":3,"sheets":["ТЗ","Рецептуры","Скелет"],"not_rendered":{"charts":0,"images":0,"macros":1,"external_links":0,"defined_names":1,"comments":0,"pivot_tables":0},"unopened":[],"bounds":{"document_bytes":16777216,"sheet_cells":100000,"rows_first":2000,"rows_last":500,"rows_between":2000,"halvings":0,"cell_chars":16384,"cell_head_chars":4096},"cells_cut":0,"cells_raw":0,"read":"whole","date_system":"1900"}

{"sheet":"ТЗ","index":0,"n_rows":45,"n_cols":12,"rows_kept":45,"cut":false,"hidden":false,"merged":[[0,0,0,11],[7,3,7,5],[3,1,3,2],[4,1,4,2],[25,1,25,2],[24,1,24,2],[25,8,25,9],[24,8,24,9],[4,8,4,9],[3,8,3,9],[6,3,6,5],[5,3,5,5],[4,3,4,5],[3,3,3,5],[2,3,2,5],[11,3,11,5],[2,10,2,12],[13,10,20,12],[10,10,10,12],[9,10,9,12],[8,10,8,12],[7,10,7,12],[6,10,6,12],[12,10,12,12],[11,10,11,12],[4,10,4,12],[3,10,3,12],[5,10,5,12],[23,10,23,12],[10,3,10,5],[12,3,12,5],[13,3,20,5],[27,3,27,5],[26,3,26,5],[25,3,25,5],[24,3,24,5],[23,3,23,5],[9,3,9,5],[8,3,8,5],[27,10,27,12],[33,3,33,5],[34,3,41,5],[34,10,41,12],[33,10,33,12],[32,10,32,12],[32,3,32,5],[31,3,31,5],[30,3,30,5],[29,3,29,5],[28,3,28,5],[26,10,26,12],[25,10,25,12],[24,10,24,12],[44,11,44,12],[31,10,31,12],[30,10,30,12],[29,10,29,12],[28,10,28,12]]}
[]
[]
[1,"Дата запуска:",null,null,null,null,null,2,"Дата запуска:"]
["Марка сплава",{"$f":"IFERROR(VLOOKUP(Скелет!A1,Скелет!B1:C51,2,FALSE),0)","v":7},null,{"$f":"IFERROR(VLOOKUP(B$4,IF(Рецептуры!$B$2:$B$151=B$5,Рецептуры!$A$2:$T$151,\"OOPS\"),18,0),\"0\")","v":"0"},null,null,null,"Марка сплава",{"$f":"IFERROR(VLOOKUP(Скелет!A3,Скелет!B1:C51,2,FALSE),0)","v":"-"},null,{"$f":"IFERROR(VLOOKUP(I$4,IF(Рецептуры!$B$2:$B$151=I$5,Рецептуры!$A$2:$T$151,\"OOPS\"),18,0),\"0\")","v":"0"}]
["Мельница",{"$f":"IFERROR(VLOOKUP(Скелет!E1,Скелет!F1:G7,2,FALSE),0)","v":"номер 100-2"},null,null,null,null,null,"Мельница",{"$f":"IFERROR(VLOOKUP(Скелет!E3,Скелет!F1:G7,2,FALSE),0)","v":"-"}]
["Компонент","Комментарий","Масса, кг",{"$f":"SUM(C7:C15)","v":0},null,null,null,"Компонент","Комментарий","Масса, кг",{"$f":"SUM(J7:J15)","v":0}]
[{"$f":"IFERROR(VLOOKUP(B$4,Рецептуры!$A$154:$S$204,2,FALSE),\"-\")","v":"-"},{"$f":"IFERROR(VLOOKUP(B$4,Рецептуры!$A$208:$E$257,2,FALSE),\"-\")","v":"-"},{"$f":"IFERROR(VLOOKUP(B$4,IF(Рецептуры!$B$2:$B$151=B$5,Рецептуры!$A$2:$T$151,\"OOPS\"),3,0),\"-\")","v":"-"},null,null,null,null,{"$f":"IFERROR(VLOOKUP(I$4,Рецептуры!$A$154:$S$204,2,FALSE),\"-\")","v":"-"},{"$f":"IFERROR(VLOOKUP(I$4,Рецептуры!$A$208:$E$257,2,FALSE),\"-\")","v":"-"},{"$f":"IFERROR(VLOOKUP(I$4,IF(Рецептуры!$B$2:$B$151=I$5,Рецептуры!$A$2:$T$151,\"OOPS\"),3,0),\"-\")","v":"-"}]
[{"$f":"IFERROR(VLOOKUP(B$4,Рецептуры!$A$154:$S$204,3,FALSE),\"-\")","v":"-"},{"$f":"IFERROR(VLOOKUP(B$4,Рецептуры!$A$208:$E$257,3,FALSE),\"-\")","v":"-"},{"$f":"IFERROR(VLOOKUP(B$4,IF(Рецептуры!$B$2:$B$151=B$5,Рецептуры!$A$2:$T$151,\"OOPS\"),4,0),\"-\")","v":"-"},{"$f":"SUM(C7:C17)","v":0},null,null,null,{"$f":"IFERROR(VLOOKUP(I$4,Рецептуры!$A$154:$S$204,3,FALSE),\"-\")","v":"-"},{"$f":"IFERROR(VLOOKUP(I$4,Рецептуры!$A$208:$E$257,3,FALSE),\"-\")","v":"-"},{"$f":"IFERROR(VLOOKUP(I$4,IF(Рецептуры!$B$2:$B$151=I$5,Рецептуры!$A$2:$T$151,\"OOPS\"),4,0),\"-\")","v":"-"},{"$f":"SUM(J7:J17)","v":0}]
[{"$f":"IFERROR(VLOOKUP(B$4,Рецептуры!$A$154:$S$204,4,FALSE),\"-\")","v":"-"},{"$f":"IFERROR(VLOOKUP(B$4,Рецептуры!$A$208:$E$257,4,FALSE),\"-\")","v":"-"},{"$f":"IFERROR(VLOOKUP(B$4,IF(Рецептуры!$B$2:$B$151=B$5,Рецептуры!$A$2:$T$151,\"OOPS\"),5,0),\"-\")","v":"-"},null,null,null,null,{"$f":"IFERROR(VLOOKUP(I$4,Рецептуры!$A$154:$S$204,4,FALSE),\"-\")","v":"-"},{"$f":"IFERROR(VLOOKUP(I$4,Рецептуры!$A$208:$E$257,4,FALSE),\"-\")","v":"-"},{"$f":"IFERROR(VLOOKUP(I$4,IF(Рецептуры!$B$2:$B$151=I$5,Рецептуры!$A$2:$T$151,\"OOPS\"),5,0),\"-\")","v":"-"}]
[{"$f":"IFERROR(VLOOKUP(B$4,Рецептуры!$A$154:$S$204,5,FALSE),\"-\")","v":"-"},null,{"$f":"IFERROR(VLOOKUP(B$4,IF(Рецептуры!$B$2:$B$151=B$5,Рецептуры!$A$2:$T$151,\"OOPS\"),6,0),\"-\")","v":"-"},{"$f":"SUM(C7:C19)","v":0},null,null,null,{"$f":"IFERROR(VLOOKUP(I$4,Рецептуры!$A$154:$S$204,5,FALSE),\"-\")","v":"-"},null,{"$f":"IFERROR(VLOOKUP(I$4,IF(Рецептуры!$B$2:$B$151=I$5,Рецептуры!$A$2:$T$151,\"OOPS\"),6,0),\"-\")","v":"-"},{"$f":"SUM(J7:J19)","v":0}]
[{"$f":"IFERROR(VLOOKUP(B$4,Рецептуры!$A$154:$S$204,6,FALSE),\"-\")","v":"-"},null,{"$f":"IFERROR(VLOOKUP(B$4,IF(Рецептуры!$B$2:$B$151=B$5,Рецептуры!$A$2:$T$151,\"OOPS\"),7,0),\"-\")","v":"-"},null,null,null,null,{"$f":"IFERROR(VLOOKUP(I$4,Рецептуры!$A$154:$S$204,6,FALSE),\"-\")","v":"-"},null,{"$f":"IFERROR(VLOOKUP(I$4,IF(Рецептуры!$B$2:$B$151=I$5,Рецептуры!$A$2:$T$151,\"OOPS\"),7,0),\"-\")","v":"-"}]
[{"$f":"IFERROR(VLOOKUP(B$4,Рецептуры!$A$154:$S$204,7,FALSE),\"-\")","v":"-"},null,{"$f":"IFERROR(VLOOKUP(B$4,IF(Рецептуры!$B$2:$B$151=B$5,Рецептуры!$A$2:$T$151,\"OOPS\"),8,0),\"-\")","v":"-"},{"$f":"SUM(C7:C19)+C21*D4","v":0},null,null,null,{"$f":"IFERROR(VLOOKUP(I$4,Рецептуры!$A$154:$S$204,7,FALSE),\"-\")","v":"-"},null,{"$f":"IFERROR(VLOOKUP(I$4,IF(Рецептуры!$B$2:$B$151=I$5,Рецептуры!$A$2:$T$151,\"OOPS\"),8,0),\"-\")","v":"-"},{"$f":"SUM(J7:J19)+J21*K4","v":0}]
[{"$f":"IFERROR(VLOOKUP(B$4,Рецептуры!$A$154:$S$204,8,FALSE),\"-\")","v":"-"},null,{"$f":"IFERROR(VLOOKUP(B$4,IF(Рецептуры!$B$2:$B$151=B$5,Рецептуры!$A$2:$T$151,\"OOPS\"),9,0),\"-\")","v":"-"},"Комментарий",null,null,null,{"$f":"IFERROR(VLOOKUP(I$4,Рецептуры!$A$154:$S$204,8,FALSE),\"-\")","v":"-"},null,{"$f":"IFERROR(VLOOKUP(I$4,IF(Рецептуры!$B$2:$B$151=I$5,Рецептуры!$A$2:$T$151,\"OOPS\"),9,0),\"-\")","v":"-"},"Комментарий"]
[{"$f":"IFERROR(VLOOKUP(B$4,Рецептуры!$A$154:$S$204,9,FALSE),\"-\")","v":"-"},null,{"$f":"IFERROR(VLOOKUP(B$4,IF(Рецептуры!$B$2:$B$151=B$5,Рецептуры!$A$2:$T$151,\"OOPS\"),10,0),\"-\")","v":"-"},{"$f":"IFERROR(VLOOKUP(B$4,Рецептуры!$A$208:$G$257,7,FALSE),\"-\")","v":"-"},null,null,null,{"$f":"IFERROR(VLOOKUP(I$4,Рецептуры!$A$154:$S$204,9,FALSE),\"-\")","v":"-"},null,{"$f":"IFERROR(VLOOKUP(I$4,IF(Рецептуры!$B$2:$B$151=I$5,Рецептуры!$A$2:$T$151,\"OOPS\"),10,0),\"-\")","v":"-"},{"$f":"IFERROR(VLOOKUP(I$4,Рецептуры!$A$208:$G$257,7,FALSE),\"-\")","v":"-"}]
[{"$f":"IFERROR(VLOOKUP(B$4,Рецептуры!$A$154:$S$204,13,FALSE),\"-\")","v":"-"},{"$f":"IFERROR(VLOOKUP(B$4,Рецептуры!$A$208:$F$257,6,FALSE),\"-\")","v":"-"},{"$f":"IFERROR(VLOOKUP(B$4,IF(Рецептуры!$B$2:$B$151=B$5,Рецептуры!$A$2:$T$151,\"OOPS\"),11,0),\"-\")","v":"-"},null,null,null,null,{"$f":"IFERROR(VLOOKUP(I$4,Рецептуры!$A$154:$S$204,13,FALSE),\"-\")","v":"-"},{"$f":"IFERROR(VLOOKUP(I$4,Рецептуры!$A$208:$F$257,6,FALSE),\"-\")","v":"-"},{"$f":"IFERROR(VLOOKUP(I$4,IF(Рецептуры!$B$2:$B$151=I$5,Рецептуры!$A$2:$T$151,\"OOPS\"),11,0),\"-\")","v":"-"}]
[{"$f":"IFERROR(VLOOKUP(B$4,Рецептуры!$A$154:$S$204,10,FALSE),\"-\")","v":"-"},null,{"$f":"IFERROR(VLOOKUP(B$4,IF(Рецептуры!$B$2:$B$151=B$5,Рецептуры!$A$2:$T$151,\"OOPS\"),12,0),\"-\")","v":"-"},null,null,null,null,{"$f":"IFERROR(VLOOKUP(I$4,Рецептуры!$A$154:$S$204,10,FALSE),\"-\")","v":"-"},null,{"$f":"IFERROR(VLOOKUP(I$4,IF(Рецептуры!$B$2:$B$151=I$5,Рецептуры!$A$2:$T$151,\"OOPS\"),12,0),\"-\")","v":"-"}]
[{"$f":"IFERROR(VLOOKUP(B$4,Рецептуры!$A$154:$S$204,14,FALSE),\"-\")","v":"-"},null,{"$f":"IFERROR(VLOOKUP(B$4,IF(Рецептуры!$B$2:$B$151=B$5,Рецептуры!$A$2:$T$151,\"OOPS\"),13,0),\"-\")","v":"-"},null,null,null,null,{"$f":"IFERROR(VLOOKUP(I$4,Рецептуры!$A$154:$S$204,14,FALSE),\"-\")","v":"-"},null,{"$f":"IFERROR(VLOOKUP(I$4,IF(Рецептуры!$B$2:$B$151=I$5,Рецептуры!$A$2:$T$151,\"OOPS\"),13,0),\"-\")","v":"-"}]
[{"$f":"IFERROR(VLOOKUP(B$4,Рецептуры!$A$154:$S$204,11,FALSE),\"oops\")","v":"oops"},null,{"$f":"IFERROR(VLOOKUP(B$4,IF(Рецептуры!$B$2:$B$151=B$5,Рецептуры!$A$2:$T$151,\"OOPS\"),14,0),\"-\")","v":"-"},null,null,null,null,{"$f":"IFERROR(VLOOKUP(I$4,Рецептуры!$A$154:$S$204,11,FALSE),\"oops\")","v":"oops"},null,{"$f":"IFERROR(VLOOKUP(I$4,IF(Рецептуры!$B$2:$B$151=I$5,Рецептуры!$A$2:$T$151,\"OOPS\"),14,0),\"-\")","v":"-"}]
[{"$f":"IFERROR(VLOOKUP(B$4,Рецептуры!$A$154:$S$204,12,FALSE),\"oops\")","v":"oops"},null,{"$f":"IFERROR(VLOOKUP(B$4,IF(Рецептуры!$B$2:$B$151=B$5,Рецептуры!$A$2:$T$151,\"OOPS\"),15,0),\"-\")","v":"-"},null,null,null,null,{"$f":"IFERROR(VLOOKUP(I$4,Рецептуры!$A$154:$S$204,12,FALSE),\"oops\")","v":"oops"},null,{"$f":"IFERROR(VLOOKUP(I$4,IF(Рецептуры!$B$2:$B$151=I$5,Рецептуры!$A$2:$T$151,\"OOPS\"),15,0),\"-\")","v":"-"}]
["Мелющие тела",{"$f":"IFERROR(VLOOKUP(B$4,Рецептуры!$A$208:$E$257,5,FALSE),\"-\")","v":"-"},{"$f":"IFERROR(VLOOKUP(B$4,IF(Рецептуры!$B$2:$B$151=B$5,Рецептуры!$A$2:$T$151,\"OOPS\"),16,0),\"-\")","v":"-"},null,null,null,null,"Мелющие тела",{"$f":"IFERROR(VLOOKUP(I$4,Рецептуры!$A$208:$E$257,5,FALSE),\"-\")","v":"-"},{"$f":"IFERROR(VLOOKUP(I$4,IF(Рецептуры!$B$2:$B$151=I$5,Рецептуры!$A$2:$T$151,\"OOPS\"),16,0),\"-\")","v":"-"}]
["Время помола, ч",null,{"$f":"IFERROR(VLOOKUP(B$4,IF(Рецептуры!$B$2:$B$151=B$5,Рецептуры!$A$2:$T$151,\"OOPS\"),17,0),\"0\")","v":"0"},null,null,null,null,"Время помола, ч",null,{"$f":"IFERROR(VLOOKUP(I$4,IF(Рецептуры!$B$2:$B$151=I$5,Рецептуры!$A$2:$T$151,\"OOPS\"),17,0),\"0\")","v":"0"}]
[]
[]
[3,"Дата запуска:",null,null,null,null,null,4,"Дата запуска:"]
["Марка сплава",{"$f":"IFERROR(VLOOKUP(Скелет!A2,Скелет!B1:C51,2,FALSE),0)","v":"-"},null,{"$f":"IFERROR(VLOOKUP(B$25,IF(Рецептуры!$B$2:$B$151=B$26,Рецептуры!$A$2:$T$151,\"OOPS\"),18,0),\"0\")","v":"0"},null,null,null,"Марка сплава",{"$f":"IFERROR(VLOOKUP(Скелет!A4,Скелет!B1:C51,2,FALSE),0)","v":"-"},null,{"$f":"IFERROR(VLOOKUP(I$25,IF(Рецептуры!$B$2:$B$151=I$26,Рецептуры!$A$2:$T$151,\"OOPS\"),18,0),\"0\")","v":"0"}]
["Мельница",{"$f":"IFERROR(VLOOKUP(Скелет!E2,Скелет!F1:G7,2,FALSE),0)","v":"-"},null,null,null,null,null,"Мельница",{"$f":"IFERROR(VLOOKUP(Скелет!E4,Скелет!F1:G7,2,FALSE),0)","v":"-"}]
["Компонент","Комментарий","Масса, кг",{"$f":"SUM(C28:C36)","v":0},null,null,null,"Компонент","Комментарий","Масса, кг",{"$f":"SUM(J28:J36)","v":0}]
[{"$f":"IFERROR(VLOOKUP(B$25,Рецептуры!$A$154:$S$204,2,FALSE),\"-\")","v":"-"},{"$f":"IFERROR(VLOOKUP(B$25,Рецептуры!$A$208:$E$257,2,FALSE),\"-\")","v":"-"},{"$f":"IFERROR(VLOOKUP(B$25,IF(Рецептуры!$B$2:$B$151=B$26,Рецептуры!$A$2:$T$151,\"OOPS\"),3,0),\"-\")","v":"-"},null,null,null,null,{"$f":"IFERROR(VLOOKUP(I$25,Рецептуры!$A$154:$S$204,2,FALSE),\"-\")","v":"-"},{"$f":"IFERROR(VLOOKUP(I$25,Рецептуры!$A$208:$E$257,2,FALSE),\"-\")","v":"-"},{"$f":"IFERROR(VLOOKUP(I$25,IF(Рецептуры!$B$2:$B$151=I$26,Рецептуры!$A$2:$T$151,\"OOPS\"),3,0),\"-\")","v":"-"}]
[{"$f":"IFERROR(VLOOKUP(B$25,Рецептуры!$A$154:$S$204,3,FALSE),\"-\")","v":"-"},{"$f":"IFERROR(VLOOKUP(B$25,Рецептуры!$A$208:$E$257,3,FALSE),\"-\")","v":"-"},{"$f":"IFERROR(VLOOKUP(B$25,IF(Рецептуры!$B$2:$B$151=B$26,Рецептуры!$A$2:$T$151,\"OOPS\"),4,0),\"-\")","v":"-"},{"$f":"SUM(C28:C38)","v":0},null,null,null,{"$f":"IFERROR(VLOOKUP(I$25,Рецептуры!$A$154:$S$204,3,FALSE),\"-\")","v":"-"},{"$f":"IFERROR(VLOOKUP(I$25,Рецептуры!$A$208:$E$257,3,FALSE),\"-\")","v":"-"},{"$f":"IFERROR(VLOOKUP(I$25,IF(Рецептуры!$B$2:$B$151=I$26,Рецептуры!$A$2:$T$151,\"OOPS\"),4,0),\"-\")","v":"-"},{"$f":"SUM(J28:J38)","v":0}]
[{"$f":"IFERROR(VLOOKUP(B$25,Рецептуры!$A$154:$S$204,4,FALSE),\"-\")","v":"-"},{"$f":"IFERROR(VLOOKUP(B$25,Рецептуры!$A$208:$E$257,4,FALSE),\"-\")","v":"-"},{"$f":"IFERROR(VLOOKUP(B$25,IF(Рецептуры!$B$2:$B$151=B$26,Рецептуры!$A$2:$T$151,\"OOPS\"),5,0),\"-\")","v":"-"},null,null,null,null,{"$f":"IFERROR(VLOOKUP(I$25,Рецептуры!$A$154:$S$204,4,FALSE),\"-\")","v":"-"},{"$f":"IFERROR(VLOOKUP(I$25,Рецептуры!$A$208:$E$257,4,FALSE),\"-\")","v":"-"},{"$f":"IFERROR(VLOOKUP(I$25,IF(Рецептуры!$B$2:$B$151=I$26,Рецептуры!$A$2:$T$151,\"OOPS\"),5,0),\"-\")","v":"-"}]
[{"$f":"IFERROR(VLOOKUP(B$25,Рецептуры!$A$154:$S$204,5,FALSE),\"-\")","v":"-"},null,{"$f":"IFERROR(VLOOKUP(B$25,IF(Рецептуры!$B$2:$B$151=B$26,Рецептуры!$A$2:$T$151,\"OOPS\"),6,0),\"-\")","v":"-"},{"$f":"SUM(C28:C40)","v":0},null,null,null,{"$f":"IFERROR(VLOOKUP(I$25,Рецептуры!$A$154:$S$204,5,FALSE),\"-\")","v":"-"},null,{"$f":"IFERROR(VLOOKUP(I$25,IF(Рецептуры!$B$2:$B$151=I$26,Рецептуры!$A$2:$T$151,\"OOPS\"),6,0),\"-\")","v":"-"},{"$f":"SUM(J28:J40)","v":0}]
[{"$f":"IFERROR(VLOOKUP(B$25,Рецептуры!$A$154:$S$204,6,FALSE),\"-\")","v":"-"},null,{"$f":"IFERROR(VLOOKUP(B$25,IF(Рецептуры!$B$2:$B$151=B$26,Рецептуры!$A$2:$T$151,\"OOPS\"),7,0),\"-\")","v":"-"},null,null,null,null,{"$f":"IFERROR(VLOOKUP(I$25,Рецептуры!$A$154:$S$204,6,FALSE),\"-\")","v":"-"},null,{"$f":"IFERROR(VLOOKUP(I$25,IF(Рецептуры!$B$2:$B$151=I$26,Рецептуры!$A$2:$T$151,\"OOPS\"),7,0),\"-\")","v":"-"}]
[{"$f":"IFERROR(VLOOKUP(B$25,Рецептуры!$A$154:$S$204,7,FALSE),\"-\")","v":"-"},null,{"$f":"IFERROR(VLOOKUP(B$25,IF(Рецептуры!$B$2:$B$151=B$26,Рецептуры!$A$2:$T$151,\"OOPS\"),8,0),\"-\")","v":"-"},{"$f":"SUM(C28:C40)+C42*D25","v":0},null,null,null,{"$f":"IFERROR(VLOOKUP(I$25,Рецептуры!$A$154:$S$204,7,FALSE),\"-\")","v":"-"},null,{"$f":"IFERROR(VLOOKUP(I$25,IF(Рецептуры!$B$2:$B$151=I$26,Рецептуры!$A$2:$T$151,\"OOPS\"),8,0),\"-\")","v":"-"},{"$f":"SUM(J28:J40)+J42*K25","v":0}]
[{"$f":"IFERROR(VLOOKUP(B$25,Рецептуры!$A$154:$S$204,8,FALSE),\"-\")","v":"-"},null,{"$f":"IFERROR(VLOOKUP(B$25,IF(Рецептуры!$B$2:$B$151=B$26,Рецептуры!$A$2:$T$151,\"OOPS\"),9,0),\"-\")","v":"-"},"Комментарий",null,null,null,{"$f":"IFERROR(VLOOKUP(I$25,Рецептуры!$A$154:$S$204,8,FALSE),\"-\")","v":"-"},null,{"$f":"IFERROR(VLOOKUP(I$25,IF(Рецептуры!$B$2:$B$151=I$26,Рецептуры!$A$2:$T$151,\"OOPS\"),9,0),\"-\")","v":"-"},"Комментарий"]
[{"$f":"IFERROR(VLOOKUP(B$25,Рецептуры!$A$154:$S$204,9,FALSE),\"-\")","v":"-"},null,{"$f":"IFERROR(VLOOKUP(B$25,IF(Рецептуры!$B$2:$B$151=B$26,Рецептуры!$A$2:$T$151,\"OOPS\"),10,0),\"-\")","v":"-"},{"$f":"IFERROR(VLOOKUP(B$25,Рецептуры!$A$208:$G$257,7,FALSE),\"-\")","v":"-"},null,null,null,{"$f":"IFERROR(VLOOKUP(I$25,Рецептуры!$A$154:$S$204,9,FALSE),\"-\")","v":"-"},null,{"$f":"IFERROR(VLOOKUP(I$25,IF(Рецептуры!$B$2:$B$151=I$26,Рецептуры!$A$2:$T$151,\"OOPS\"),10,0),\"-\")","v":"-"},{"$f":"IFERROR(VLOOKUP(I$25,Рецептуры!$A$208:$G$257,7,FALSE),\"-\")","v":"-"}]
[{"$f":"IFERROR(VLOOKUP(B$25,Рецептуры!$A$154:$S$204,13,FALSE),\"-\")","v":"-"},{"$f":"IFERROR(VLOOKUP(B$25,Рецептуры!$A$208:$F$257,6,FALSE),\"-\")","v":"-"},{"$f":"IFERROR(VLOOKUP(B$25,IF(Рецептуры!$B$2:$B$151=B$26,Рецептуры!$A$2:$T$151,\"OOPS\"),11,0),\"-\")","v":"-"},null,null,null,null,{"$f":"IFERROR(VLOOKUP(I$25,Рецептуры!$A$154:$S$204,13,FALSE),\"-\")","v":"-"},{"$f":"IFERROR(VLOOKUP(I$25,Рецептуры!$A$208:$F$257,6,FALSE),\"-\")","v":"-"},{"$f":"IFERROR(VLOOKUP(I$25,IF(Рецептуры!$B$2:$B$151=I$26,Рецептуры!$A$2:$T$151,\"OOPS\"),11,0),\"-\")","v":"-"}]
[{"$f":"IFERROR(VLOOKUP(B$25,Рецептуры!$A$154:$S$204,10,FALSE),\"-\")","v":"-"},null,{"$f":"IFERROR(VLOOKUP(B$25,IF(Рецептуры!$B$2:$B$151=B$26,Рецептуры!$A$2:$T$151,\"OOPS\"),12,0),\"-\")","v":"-"},null,null,null,null,{"$f":"IFERROR(VLOOKUP(I$25,Рецептуры!$A$154:$S$204,10,FALSE),\"-\")","v":"-"},null,{"$f":"IFERROR(VLOOKUP(I$25,IF(Рецептуры!$B$2:$B$151=I$26,Рецептуры!$A$2:$T$151,\"OOPS\"),12,0),\"-\")","v":"-"}]
[{"$f":"IFERROR(VLOOKUP(B$25,Рецептуры!$A$154:$S$204,14,FALSE),\"-\")","v":"-"},null,{"$f":"IFERROR(VLOOKUP(B$25,IF(Рецептуры!$B$2:$B$151=B$26,Рецептуры!$A$2:$T$151,\"OOPS\"),13,0),\"-\")","v":"-"},null,null,null,null,{"$f":"IFERROR(VLOOKUP(I$25,Рецептуры!$A$154:$S$204,14,FALSE),\"-\")","v":"-"},null,{"$f":"IFERROR(VLOOKUP(I$25,IF(Рецептуры!$B$2:$B$151=I$26,Рецептуры!$A$2:$T$151,\"OOPS\"),13,0),\"-\")","v":"-"}]
[{"$f":"IFERROR(VLOOKUP(B$25,Рецептуры!$A$154:$S$204,11,FALSE),\"oops\")","v":"oops"},null,{"$f":"IFERROR(VLOOKUP(B$25,IF(Рецептуры!$B$2:$B$151=B$26,Рецептуры!$A$2:$T$151,\"OOPS\"),14,0),\"-\")","v":"-"},null,null,null,null,{"$f":"IFERROR(VLOOKUP(I$25,Рецептуры!$A$154:$S$204,11,FALSE),\"oops\")","v":"oops"},null,{"$f":"IFERROR(VLOOKUP(I$25,IF(Рецептуры!$B$2:$B$151=I$26,Рецептуры!$A$2:$T$151,\"OOPS\"),14,0),\"-\")","v":"-"}]
[{"$f":"IFERROR(VLOOKUP(B$25,Рецептуры!$A$154:$S$204,12,FALSE),\"oops\")","v":"oops"},null,{"$f":"IFERROR(VLOOKUP(B$25,IF(Рецептуры!$B$2:$B$151=B$26,Рецептуры!$A$2:$T$151,\"OOPS\"),15,0),\"-\")","v":"-"},null,null,null,null,{"$f":"IFERROR(VLOOKUP(I$25,Рецептуры!$A$154:$S$204,12,FALSE),\"oops\")","v":"oops"},null,{"$f":"IFERROR(VLOOKUP(I$25,IF(Рецептуры!$B$2:$B$151=I$26,Рецептуры!$A$2:$T$151,\"OOPS\"),15,0),\"-\")","v":"-"}]
{"$rows_left_out":6}
{"sheet":"Рецептуры","index":1,"n_rows":257,"n_cols":19,"rows_kept":257,"cut":false,"hidden":false,"merged":[]}
[null,null,"пункт 1","пункт 1 72","пункт 1 120 ","пункт 2","пункт 3","пункт 1Пх","Tiпункт 15","пункт 4","пункт 5","пункт 6","пункт 7","пункт 8","пункт 9","пункт 10","пункт 11","пункт 12","сумма"]
["Имя 1","номер 100-2",39.78,28.17,12.06,9,0.54,0.45,"-","-","-","-","-",30,10,400,72,7.0000000000000007E-2,{"$f":"SUM(C2:K2)","v":90.000000000000014}]
["Имя 1","номер 200-2",79.56,56.34,24.12,18,1.08,0.9,"-","-","-","-","-",60,20,800,72,0.13100000000000001,{"$f":"SUM(C3:K3)","v":180.00000000000003}]
["Имя 1","номер 200-3",79.56,56.34,24.12,18,1.08,0.9,"-","-","-","-","-",60,20,800,72,0.06,180.00000000000003]
["Имя 2","номер 100-1",51.2,"-","-",6.4,"-","-",22.4,"-","-","-","-",30,15,400,48,3.5270000000000003E-2,80]
["Имя 2","номер 200-1",102.4,"-","-",12.8,"-","-",44.8,"-","-","-","-",60,30,800,48,8.0799999999999997E-2,160]
["Имя 2","номер 600-1",345.6,"-","-",43.2,"-","-",151.19999999999999,"-","-","-","-",150,70,2400,"атт",0.49625000000000002,540]
["Имя 3","номер 100-1",51.2,"-","-",4.8,"-","-",24,"-","-","-","-",30,15,400,36,3.5270000000000003E-2,80]
["Имя 3","номер 200-1",102.4,"-","-",9.6,"-","-",48,"-","-","-","-",60,30,800,36,8.0799999999999997E-2,160]
["Имя 3","номер 600-1",345.6,"-","-",32.4,"-","-",162,"-","-","-","-",150,70,2400,"атт",0.49625000000000002,540]
["Имя 4","номер 100-1",73,"-","-",4.76,"-","-",7.38,4.8600000000000003,"-","-","-",30,15,400,48,3.5270000000000003E-2,90]
["Имя 4","номер 200-1",146,"-","-",9.52,"-","-",14.76,9.7200000000000006,"-","-","-",60,30,800,48,8.0799999999999997E-2,180]
["Имя 4","номер 600-1",438,"-","-",28.56,"-","-",44.28,29.160000000000004,"-","-","-",150,70,2400,24,0.49625000000000002,540]
["Имя 5","номер 100-1",68.760000000000005,"-","-",5.4,"-","-",13.5,2.34,"-","-","-",30,15,400,60,3.5270000000000003E-2,90.000000000000014]
["Имя 5","номер 200-1",137.52000000000001,"-","-",10.8,"-","-",27,4.68,"-","-","-",60,30,800,60,8.0799999999999997E-2,180.00000000000003]
["Имя 5","номер 600-1",412.56,"-","-",32.400000000000006,"-","-",81,14.04,"-","-","-",150,70,2400,32,0.49625000000000002,540]
["Имя 6","номер 100-1",65.36,"-","-",5.2,"-","-",5.2,4.24,"-","-","-",30,15,400,36,3.5270000000000003E-2,80]
["Имя 6","номер 200-1",130.72,"-","-",10.4,"-","-",10.4,8.48,"-","-","-",60,30,800,36,8.0799999999999997E-2,160]
["Имя 6","номер 600-1",441.17999999999995,"-","-",35.1,"-","-",35.1,28.620000000000005,"-","-","-",150,70,2400,"атт",0.49625000000000002,540]
["Имя 7","номер 100-1",59.52,"-","-",5.6,"-","-",10.64,4.24,"-","-","-",30,15,400,48,3.5270000000000003E-2,80]
["Имя 7","номер 200-1",119.04,"-","-",11.2,"-","-",21.28,8.48,"-","-","-",60,30,800,48,8.0799999999999997E-2,160]
["Имя 7","номер 600-1",401.76,"-","-",37.799999999999997,"-","-",71.820000000000007,28.620000000000005,"-","-","-",150,70,2400,"атт",0.49625000000000002,540]
["Имя 8","номер 100-1",58.56,"-","-",8.8000000000000007,"-","-",7.04,5.6,"-","-","-",30,15,400,64,3.5270000000000003E-2,80]
["Имя 8","номер 200-1",117.12,"-","-",17.600000000000001,"-","-",14.08,11.2,"-","-","-",60,30,800,64,8.0799999999999997E-2,160]
["Имя 8","номер 600-1",395.28,"-","-",59.400000000000006,"-","-",47.519999999999996,37.799999999999997,"-","-","-",150,70,2400,"атт",0.49625000000000002,539.99999999999989]
["Имя 9","номер 100-1",59.2,"-","-",8.8000000000000007,"-","-",8,4,"-","-","-",30,15,400,48,3.5270000000000003E-2,80]
["Имя 9","номер 200-1",118.4,"-","-",17.600000000000001,"-","-",16,8,"-","-","-",60,30,800,48,8.0799999999999997E-2,160]
["Имя 9","номер 600-1",399.6,"-","-",59.400000000000006,"-","-",54,27,"-","-","-",150,70,2400,"атт",0.49625000000000002,540]
["Имя 10","номер 100-1",50.923226433430521,"-","-",7.7745383867832851,"-","-",9.3294460641399422,11.972789115646261,"-","-","-",30,15,400,48,3.5270000000000003E-2,80.000000000000014]
["Имя 10","номер 200-1",101.84645286686104,"-","-",15.54907677356657,"-","-",18.658892128279884,23.945578231292522,"-","-","-",60,30,800,48,8.0799999999999997E-2,160.00000000000003]
["Имя 10","номер 600-1",343.73177842565599,"-","-",52.478134110787174,"-","-",62.973760932944614,80.816326530612258,"-","-","-",150,70,2400,"атт",0.49625000000000002,540]
["Имя 1ПЭГ","номер 100-2",39.78,28.17,12.06,9,0.54,0.45,"-","-","-",2.25,2.3E-2,{"$f":"0.222*S32","v":19.980000000000004},{"$f":"0.083*S32","v":7.4700000000000015},400,72,7.0000000000000007E-2,90.000000000000014]
["Имя 1ПЭГ","номер 200-2",79.56,56.34,24.12,18,1.08,0.9,"-","-","-",4.5,4.4999999999999998E-2,{"$f":"0.222*S33","v":39.960000000000008},{"$f":"0.083*S33","v":14.940000000000003},800,72,0.13100000000000001,180.00000000000003]
["Имя 1ПЭГ","номер 200-3",79.56,56.34,24.12,18,1.08,0.9,"-","-","-",4.5,4.4999999999999998E-2,{"$f":"0.222*S34","v":39.960000000000008},{"$f":"0.083*S34","v":14.940000000000003},800,72,0.06,180.00000000000003]
["Имя 2ПЭГ","номер 100-1",51.2,"-","-",6.4,"-","-",22.4,"-","-",2,"-",{"$f":"0.2625*S35","v":21},{"$f":"0.1125*S35","v":9},400,48,3.5270000000000003E-2,80]
["Имя 2ПЭГ","номер 200-1",102.4,"-","-",12.8,"-","-",44.8,"-","-",4,"-",{"$f":"0.2625*S36","v":42},{"$f":"0.1125*S36","v":18},800,48,8.0799999999999997E-2,160]
["Имя 2ПЭГ","номер 600-1",345.6,"-","-",43.2,"-","-",151.19999999999999,"-","-",13.5,"-",130,40,2400,"атт",0.49625000000000002,540]
["Имя 3ПЭГ","номер 100-1",51.2,"-","-",4.8,"-","-",24,"-","-",2,"-",21,9,400,36,3.5270000000000003E-2,80]
["Имя 3ПЭГ","номер 200-1",102.4,"-","-",9.6,"-","-",48,"-","-",4,"-",42,18,800,36,8.0799999999999997E-2,160]
["Имя 3ПЭГ","номер 600-1",345.6,"-","-",32.4,"-","-",162,"-","-",13.5,"-",141.75,60.75,2400,"атт",0.49625000000000002,540]
{"$rows_left_out":218}
{"sheet":"Скелет","index":2,"n_rows":51,"n_cols":11,"rows_kept":51,"cut":false,"hidden":false,"merged":[]}
[8,1,"-",null,4,1,"-",null,2,1,"-"]
[1,2,1,null,1,2,"номер 100-1",null,null,2,"Петя"]
[1,3,2,null,1,3,"номер 200-1",null,null,3,"Вася"]
[1,4,3,null,1,4,"номер 100-2",null,null,4,"Дима"]
[null,5,4,null,null,5,"номер 200-2",null,null,5,"Леха"]
[null,6,5,null,null,6,"номер 200-3",null,null,6,"Макс"]
[null,7,6,null,null,7,"номер 600-1",null,null,7,"Витя"]
[null,8,7,null,null,null,null,null,null,8,"Андрюха"]
[null,9,8,null,null,null,null,null,null,9,"Рыба"]
[null,10,9,null,null,null,null,null,null,10,"Чук"]
[null,11,10]
[null,12,11]
[null,13,12]
[null,14,13]
[null,15,14]
[null,16,15]
[null,17,16]
[null,18,17]
[null,19,18]
[null,20,19]
[null,21,20]
[null,22,21]
[null,23,22]
[null,24,23]
[null,25,24]
[null,26,25]
[null,27,26]
[null,28,27]
[null,29,28]
[null,30,29]
[null,31,30]
[null,32,31]
[null,33,32]
[null,34,33]
[null,35,34]
[null,36,35]
[null,37,36]
[null,38,37]
[null,39,38]
[null,40,39]
{"$rows_left_out":11}