{"text_format":"1","workbook":"xlsx","n_sheets":4,"sheets":["Лист3","Лист1","Лист2","База"],"not_rendered":{"charts":0,"images":0,"macros":1,"external_links":0,"defined_names":0,"comments":1,"pivot_tables":0},"unopened":[],"bounds":{"document_bytes":16777216,"sheet_cells":100000,"rows_first":2000,"rows_last":500,"rows_between":2000,"halvings":0,"cell_chars":16384,"cell_head_chars":4096},"cells_cut":0,"cells_raw":0,"read":"whole","date_system":"1900"}

{"sheet":"Лист3","index":0,"n_rows":25,"n_cols":1,"rows_kept":25,"cut":false,"hidden":true,"merged":[]}
[12345678]
[12345679]
[12345680]
[12345681]
[12345682]
[12345683]
[12345684]
[12345685]
[12345686]
[12345687]
[12345688]
[12345689]
[12345690]
[12345691]
[12345692]
[12345693]
[12345694]
[12345695]
[12345696]
[12345697]
[12345698]
[12345699]
[12345700]
[12345701]
[12345702]

{"sheet":"Лист1","index":1,"n_rows":100,"n_cols":4,"rows_kept":100,"cut":false,"hidden":true,"merged":[]}
[{"$f":"Лист3!A1","v":12345678},"Отметка","Текст 1","Примечание 1"]
[{"$f":"Лист3!A2","v":12345679},null,"Текст 2","Примечание 2"]
[{"$f":"Лист3!A3","v":12345680},null,"Текст 3","Примечание 3"]
[{"$f":"Лист3!A4","v":12345681},null,"Текст 4","Примечание 4"]
[{"$f":"Лист3!A5","v":12345682},null,"Текст 5","Примечание 5"]
[{"$f":"Лист3!A6","v":12345683},"Отметка","Текст 6","Примечание 6"]
[{"$f":"Лист3!A7","v":12345684},"Отметка","Текст 7","Примечание 7"]
[{"$f":"Лист3!A8","v":12345685},null,"Текст 8","Примечание 8"]
[{"$f":"Лист3!A9","v":12345686},null,"Текст 9","Примечание 9"]
[{"$f":"Лист3!A10","v":12345687},null,"Текст 10","Примечание 10"]
[{"$f":"Лист3!A11","v":12345688},null,"Текст 11","Примечание 11"]
[{"$f":"Лист3!A12","v":12345689},null,"Текст 12","Примечание 12"]
[{"$f":"Лист3!A13","v":12345690},"Отметка","Текст 13","Примечание 13"]
[{"$f":"Лист3!A14","v":12345691},null,"Текст 14","Примечание 14"]
[{"$f":"Лист3!A15","v":12345692},null,"Текст 15","Примечание 15"]
[{"$f":"Лист3!A16","v":12345693},null,"Текст 16","Примечание 16"]
[{"$f":"Лист3!A17","v":12345694},null,"Текст 17","Примечание 17"]
[{"$f":"Лист3!A18","v":12345695},null,"Текст 18","Примечание 18"]
[{"$f":"Лист3!A19","v":12345696},null,"Текст 19","Примечание 19"]
[{"$f":"Лист3!A20","v":12345697},null,"Текст 20","Примечание 20"]
[{"$f":"Лист3!A21","v":12345698},null,"Текст 21","Примечание 21"]
[{"$f":"Лист3!A22","v":12345699},null,"Текст 22","Примечание 22"]
[{"$f":"Лист3!A23","v":12345700},null,"Текст 23","Примечание 23"]
[{"$f":"Лист3!A24","v":12345701},"Отметка","Текст 24","Примечание 24"]
[{"$f":"Лист3!A25","v":12345702},null,"Текст 25","Примечание 25"]
[{"$f":"Лист3!A26","v":0},null,"Текст 26","Примечание 26"]
[{"$f":"Лист3!A27","v":0},null,"Текст 27","Примечание 27"]
[{"$f":"Лист3!A28","v":0},null,"Текст 28","Примечание 28"]
[{"$f":"Лист3!A29","v":0},null,"Текст 29","Примечание 29"]
[{"$f":"Лист3!A30","v":0},null,"Текст 30","Примечание 30"]
[{"$f":"Лист3!A31","v":0},null,"Текст 31","Примечание 31"]
[{"$f":"Лист3!A32","v":0},null,"Текст 32","Примечание 32"]
[{"$f":"Лист3!A33","v":0},null,"Текст 33","Примечание 33"]
[{"$f":"Лист3!A34","v":0},null,"Текст 34","Примечание 34"]
[{"$f":"Лист3!A35","v":0},null,"Текст 35","Примечание 35"]
[{"$f":"Лист3!A36","v":0},null,"Текст 36","Примечание 36"]
[{"$f":"Лист3!A37","v":0},null,"Текст 37","Примечание 37"]
[{"$f":"Лист3!A38","v":0},null,"Текст 38","Примечание 38"]
[{"$f":"Лист3!A39","v":0},null,"Текст 39","Примечание 39"]
[{"$f":"Лист3!A40","v":0},null,"Текст 40","Примечание 40"]
[{"$f":"Лист3!A41","v":0},null,"Текст 41","Примечание 41"]
[{"$f":"Лист3!A42","v":0},null,"Текст 42","Примечание 42"]
[{"$f":"Лист3!A43","v":0},null,"Текст 43","Примечание 43"]
[{"$f":"Лист3!A44","v":0},null,"Текст 44","Примечание 44"]
[{"$f":"Лист3!A45","v":0},null,"Текст 45","Примечание 45"]
[{"$f":"Лист3!A46","v":0},null,"Текст 46","Примечание 46"]
[{"$f":"Лист3!A47","v":0},null,"Текст 47","Примечание 47"]
[{"$f":"Лист3!A48","v":0},null,"Текст 48","Примечание 48"]
[{"$f":"Лист3!A49","v":0},null,"Текст 49","Примечание 49"]
[{"$f":"Лист3!A50","v":0},null,"Текст 50","Примечание 50"]
[{"$f":"Лист3!A51","v":0},null,"Текст 51","Примечание 51"]
[{"$f":"Лист3!A52","v":0},null,"Текст 52","Примечание 52"]
[{"$f":"Лист3!A53","v":0},null,"Текст 53","Примечание 53"]
[{"$f":"Лист3!A54","v":0},null,"Текст 54","Примечание 54"]
[{"$f":"Лист3!A55","v":0},null,"Текст 55","Примечание 55"]
[{"$f":"Лист3!A56","v":0},null,"Текст 56","Примечание 56"]
[{"$f":"Лист3!A57","v":0},null,"Текст 57","Примечание 57"]
[{"$f":"Лист3!A58","v":0},null,"Текст 58","Примечание 58"]
[{"$f":"Лист3!A59","v":0},null,"Текст 59","Примечание 59"]
[{"$f":"Лист3!A60","v":0},null,"Текст 60","Примечание 60"]
[{"$f":"Лист3!A61","v":0},null,"Текст 61","Примечание 61"]
[{"$f":"Лист3!A62","v":0},null,"Текст 62","Примечание 62"]
[{"$f":"Лист3!A63","v":0},null,"Текст 63","Примечание 63"]
[{"$f":"Лист3!A64","v":0},null,"Текст 64","Примечание 64"]
[{"$f":"Лист3!A65","v":0},null,"Текст 65","Примечание 65"]
[{"$f":"Лист3!A66","v":0},null,"Текст 66","Примечание 66"]
[{"$f":"Лист3!A67","v":0},null,"Текст 67","Примечание 67"]
[{"$f":"Лист3!A68","v":0},null,"Текст 68","Примечание 68"]
[{"$f":"Лист3!A69","v":0},null,"Текст 69","Примечание 69"]
[{"$f":"Лист3!A70","v":0},null,"Текст 70","Примечание 70"]
[{"$f":"Лист3!A71","v":0},null,"Текст 71","Примечание 71"]
[{"$f":"Лист3!A72","v":0},null,"Текст 72","Примечание 72"]
[{"$f":"Лист3!A73","v":0},null,"Текст 73","Примечание 73"]
[{"$f":"Лист3!A74","v":0},null,"Текст 74","Примечание 74"]
[{"$f":"Лист3!A75","v":0},null,"Текст 75","Примечание 75"]
[{"$f":"Лист3!A76","v":0},null,"Текст 76","Примечание 76"]
[{"$f":"Лист3!A77","v":0},null,"Текст 77","Примечание 77"]
[{"$f":"Лист3!A78","v":0},null,"Текст 78","Примечание 78"]
[{"$f":"Лист3!A79","v":0},null,"Текст 79","Примечание 79"]
[{"$f":"Лист3!A80","v":0},null,"Текст 80","Примечание 80"]
[{"$f":"Лист3!A81","v":0},null,"Текст 81","Примечание 81"]
[{"$f":"Лист3!A82","v":0},null,"Текст 82","Примечание 82"]
[{"$f":"Лист3!A83","v":0},null,"Текст 83","Примечание 83"]
[{"$f":"Лист3!A84","v":0},null,"Текст 84","Примечание 84"]
[{"$f":"Лист3!A85","v":0},null,"Текст 85","Примечание 85"]
[{"$f":"Лист3!A86","v":0},null,"Текст 86","Примечание 86"]
[{"$f":"Лист3!A87","v":0},null,"Текст 87","Примечание 87"]
[{"$f":"Лист3!A88","v":0},null,"Текст 88","Примечание 88"]
[{"$f":"Лист3!A89","v":0},null,"Текст 89","Примечание 89"]
[{"$f":"Лист3!A90","v":0},null,"Текст 90","Примечание 90"]
[{"$f":"Лист3!A91","v":0},null,"Текст 91","Примечание 91"]
[{"$f":"Лист3!A92","v":0},null,"Текст 92","Примечание 92"]
[{"$f":"Лист3!A93","v":0},null,"Текст 93","Примечание 93"]
[{"$f":"Лист3!A94","v":0},null,"Текст 94","Примечание 94"]
[{"$f":"Лист3!A95","v":0},null,"Текст 95","Примечание 95"]
[{"$f":"Лист3!A96","v":0},null,"Текст 96","Примечание 96"]
[{"$f":"Лист3!A97","v":0},null,"Текст 97","Примечание 97"]
[{"$f":"Лист3!A98","v":0},null,"Текст 98","Примечание 98"]
[{"$f":"Лист3!A99","v":0},null,"Текст 99","Примечание 99"]
[{"$f":"Лист3!A100","v":0},null,"Текст 100","Примечание 100"]

{"sheet":"Лист2","index":2,"n_rows":25,"n_cols":4,"rows_kept":25,"cut":false,"hidden":false,"merged":[]}
[{"$f":"IFERROR(INDEX(Лист1!A$1:A$25,SMALL(IF(Лист1!B$1:B$25=\"Отметка\",ROW(Лист1!B$1:B$25)),ROW(A1))),\"\")","v":12345678},"Не копировать","с",{"$f":"INDEX(Лист1!$D$1:$D$25,MATCH(A1,Лист1!$A$1:$A$25,0),1)","v":"Примечание 1"}]
[{"$f":"IFERROR(INDEX(Лист1!A$1:A$25,SMALL(IF(Лист1!B$1:B$25=\"Отметка\",ROW(Лист1!B$1:B$25)),ROW(A2))),\"\")","v":12345683},"Не копировать",{"$f":"INDEX(Лист1!$C$1:$C$25,MATCH(A2,Лист1!$A$1:$A$25,0),1)","v":"Текст 6"},{"$f":"INDEX(Лист1!$D$1:$D$25,MATCH(A2,Лист1!$A$1:$A$25,0),1)","v":"Примечание 6"}]
[{"$f":"IFERROR(INDEX(Лист1!A$1:A$25,SMALL(IF(Лист1!B$1:B$25=\"Отметка\",ROW(Лист1!B$1:B$25)),ROW(A3))),\"\")","v":12345684},"Не копировать",{"$f":"INDEX(Лист1!$C$1:$C$25,MATCH(A3,Лист1!$A$1:$A$25,0),1)","v":"Текст 7"},{"$f":"INDEX(Лист1!$D$1:$D$25,MATCH(A3,Лист1!$A$1:$A$25,0),1)","v":"Примечание 7"}]
[{"$f":"IFERROR(INDEX(Лист1!A$1:A$25,SMALL(IF(Лист1!B$1:B$25=\"Отметка\",ROW(Лист1!B$1:B$25)),ROW(A4))),\"\")","v":12345690},"Не копировать",{"$f":"INDEX(Лист1!$C$1:$C$25,MATCH(A4,Лист1!$A$1:$A$25,0),1)","v":"Текст 13"},{"$f":"INDEX(Лист1!$D$1:$D$25,MATCH(A4,Лист1!$A$1:$A$25,0),1)","v":"Примечание 13"}]
[{"$f":"IFERROR(INDEX(Лист1!A$1:A$25,SMALL(IF(Лист1!B$1:B$25=\"Отметка\",ROW(Лист1!B$1:B$25)),ROW(A5))),\"\")","v":12345701},"Не копировать",{"$f":"INDEX(Лист1!$C$1:$C$25,MATCH(A5,Лист1!$A$1:$A$25,0),1)","v":"Текст 24"},{"$f":"INDEX(Лист1!$D$1:$D$25,MATCH(A5,Лист1!$A$1:$A$25,0),1)","v":"Примечание 24"}]
[{"$f":"IFERROR(INDEX(Лист1!A$1:A$25,SMALL(IF(Лист1!B$1:B$25=\"Отметка\",ROW(Лист1!B$1:B$25)),ROW(A6))),\"\")","v":""},null,{"$f":"INDEX(Лист1!$C$1:$C$25,MATCH(A6,Лист1!$A$1:$A$25,0),1)","v":{"$error":"#N/A"}},{"$f":"INDEX(Лист1!$D$1:$D$25,MATCH(A6,Лист1!$A$1:$A$25,0),1)","v":{"$error":"#N/A"}}]
[{"$f":"IFERROR(INDEX(Лист1!A$1:A$25,SMALL(IF(Лист1!B$1:B$25=\"Отметка\",ROW(Лист1!B$1:B$25)),ROW(A7))),\"\")","v":""},null,{"$f":"INDEX(Лист1!$C$1:$C$25,MATCH(A7,Лист1!$A$1:$A$25,0),1)","v":{"$error":"#N/A"}},{"$f":"INDEX(Лист1!$D$1:$D$25,MATCH(A7,Лист1!$A$1:$A$25,0),1)","v":{"$error":"#N/A"}}]
[{"$f":"IFERROR(INDEX(Лист1!A$1:A$25,SMALL(IF(Лист1!B$1:B$25=\"Отметка\",ROW(Лист1!B$1:B$25)),ROW(A8))),\"\")","v":""},null,{"$f":"INDEX(Лист1!$C$1:$C$25,MATCH(A8,Лист1!$A$1:$A$25,0),1)","v":{"$error":"#N/A"}},{"$f":"INDEX(Лист1!$D$1:$D$25,MATCH(A8,Лист1!$A$1:$A$25,0),1)","v":{"$error":"#N/A"}}]
[{"$f":"IFERROR(INDEX(Лист1!A$1:A$25,SMALL(IF(Лист1!B$1:B$25=\"Отметка\",ROW(Лист1!B$1:B$25)),ROW(A9))),\"\")","v":""},null,{"$f":"INDEX(Лист1!$C$1:$C$25,MATCH(A9,Лист1!$A$1:$A$25,0),1)","v":{"$error":"#N/A"}},{"$f":"INDEX(Лист1!$D$1:$D$25,MATCH(A9,Лист1!$A$1:$A$25,0),1)","v":{"$error":"#N/A"}}]
[{"$f":"IFERROR(INDEX(Лист1!A$1:A$25,SMALL(IF(Лист1!B$1:B$25=\"Отметка\",ROW(Лист1!B$1:B$25)),ROW(A10))),\"\")","v":""},null,{"$f":"INDEX(Лист1!$C$1:$C$25,MATCH(A10,Лист1!$A$1:$A$25,0),1)","v":{"$error":"#N/A"}},{"$f":"INDEX(Лист1!$D$1:$D$25,MATCH(A10,Лист1!$A$1:$A$25,0),1)","v":{"$error":"#N/A"}}]
[{"$f":"IFERROR(INDEX(Лист1!A$1:A$25,SMALL(IF(Лист1!B$1:B$25=\"Отметка\",ROW(Лист1!B$1:B$25)),ROW(A11))),\"\")","v":""},null,{"$f":"INDEX(Лист1!$C$1:$C$25,MATCH(A11,Лист1!$A$1:$A$25,0),1)","v":{"$error":"#N/A"}},{"$f":"INDEX(Лист1!$D$1:$D$25,MATCH(A11,Лист1!$A$1:$A$25,0),1)","v":{"$error":"#N/A"}}]
[{"$f":"IFERROR(INDEX(Лист1!A$1:A$25,SMALL(IF(Лист1!B$1:B$25=\"Отметка\",ROW(Лист1!B$1:B$25)),ROW(A12))),\"\")","v":""},null,{"$f":"INDEX(Лист1!$C$1:$C$25,MATCH(A12,Лист1!$A$1:$A$25,0),1)","v":{"$error":"#N/A"}},{"$f":"INDEX(Лист1!$D$1:$D$25,MATCH(A12,Лист1!$A$1:$A$25,0),1)","v":{"$error":"#N/A"}}]
[{"$f":"IFERROR(INDEX(Лист1!A$1:A$25,SMALL(IF(Лист1!B$1:B$25=\"Отметка\",ROW(Лист1!B$1:B$25)),ROW(A13))),\"\")","v":""},null,{"$f":"INDEX(Лист1!$C$1:$C$25,MATCH(A13,Лист1!$A$1:$A$25,0),1)","v":{"$error":"#N/A"}},{"$f":"INDEX(Лист1!$D$1:$D$25,MATCH(A13,Лист1!$A$1:$A$25,0),1)","v":{"$error":"#N/A"}}]
[{"$f":"IFERROR(INDEX(Лист1!A$1:A$25,SMALL(IF(Лист1!B$1:B$25=\"Отметка\",ROW(Лист1!B$1:B$25)),ROW(A14))),\"\")","v":""},null,{"$f":"INDEX(Лист1!$C$1:$C$25,MATCH(A14,Лист1!$A$1:$A$25,0),1)","v":{"$error":"#N/A"}},{"$f":"INDEX(Лист1!$D$1:$D$25,MATCH(A14,Лист1!$A$1:$A$25,0),1)","v":{"$error":"#N/A"}}]
[{"$f":"IFERROR(INDEX(Лист1!A$1:A$25,SMALL(IF(Лист1!B$1:B$25=\"Отметка\",ROW(Лист1!B$1:B$25)),ROW(A15))),\"\")","v":""},null,{"$f":"INDEX(Лист1!$C$1:$C$25,MATCH(A15,Лист1!$A$1:$A$25,0),1)","v":{"$error":"#N/A"}},{"$f":"INDEX(Лист1!$D$1:$D$25,MATCH(A15,Лист1!$A$1:$A$25,0),1)","v":{"$error":"#N/A"}}]
[{"$f":"IFERROR(INDEX(Лист1!A$1:A$25,SMALL(IF(Лист1!B$1:B$25=\"Отметка\",ROW(Лист1!B$1:B$25)),ROW(A16))),\"\")","v":""},null,{"$f":"INDEX(Лист1!$C$1:$C$25,MATCH(A16,Лист1!$A$1:$A$25,0),1)","v":{"$error":"#N/A"}},{"$f":"INDEX(Лист1!$D$1:$D$25,MATCH(A16,Лист1!$A$1:$A$25,0),1)","v":{"$error":"#N/A"}}]
[{"$f":"IFERROR(INDEX(Лист1!A$1:A$25,SMALL(IF(Лист1!B$1:B$25=\"Отметка\",ROW(Лист1!B$1:B$25)),ROW(A17))),\"\")","v":""},null,{"$f":"INDEX(Лист1!$C$1:$C$25,MATCH(A17,Лист1!$A$1:$A$25,0),1)","v":{"$error":"#N/A"}},{"$f":"INDEX(Лист1!$D$1:$D$25,MATCH(A17,Лист1!$A$1:$A$25,0),1)","v":{"$error":"#N/A"}}]
[{"$f":"IFERROR(INDEX(Лист1!A$1:A$25,SMALL(IF(Лист1!B$1:B$25=\"Отметка\",ROW(Лист1!B$1:B$25)),ROW(A18))),\"\")","v":""},null,{"$f":"INDEX(Лист1!$C$1:$C$25,MATCH(A18,Лист1!$A$1:$A$25,0),1)","v":{"$error":"#N/A"}},{"$f":"INDEX(Лист1!$D$1:$D$25,MATCH(A18,Лист1!$A$1:$A$25,0),1)","v":{"$error":"#N/A"}}]
[{"$f":"IFERROR(INDEX(Лист1!A$1:A$25,SMALL(IF(Лист1!B$1:B$25=\"Отметка\",ROW(Лист1!B$1:B$25)),ROW(A19))),\"\")","v":""},null,{"$f":"INDEX(Лист1!$C$1:$C$25,MATCH(A19,Лист1!$A$1:$A$25,0),1)","v":{"$error":"#N/A"}},{"$f":"INDEX(Лист1!$D$1:$D$25,MATCH(A19,Лист1!$A$1:$A$25,0),1)","v":{"$error":"#N/A"}}]
[{"$f":"IFERROR(INDEX(Лист1!A$1:A$25,SMALL(IF(Лист1!B$1:B$25=\"Отметка\",ROW(Лист1!B$1:B$25)),ROW(A20))),\"\")","v":""},null,{"$f":"INDEX(Лист1!$C$1:$C$25,MATCH(A20,Лист1!$A$1:$A$25,0),1)","v":{"$error":"#N/A"}},{"$f":"INDEX(Лист1!$D$1:$D$25,MATCH(A20,Лист1!$A$1:$A$25,0),1)","v":{"$error":"#N/A"}}]
[{"$f":"IFERROR(INDEX(Лист1!A$1:A$25,SMALL(IF(Лист1!B$1:B$25=\"Отметка\",ROW(Лист1!B$1:B$25)),ROW(A21))),\"\")","v":""},null,{"$f":"INDEX(Лист1!$C$1:$C$25,MATCH(A21,Лист1!$A$1:$A$25,0),1)","v":{"$error":"#N/A"}},{"$f":"INDEX(Лист1!$D$1:$D$25,MATCH(A21,Лист1!$A$1:$A$25,0),1)","v":{"$error":"#N/A"}}]
[{"$f":"IFERROR(INDEX(Лист1!A$1:A$25,SMALL(IF(Лист1!B$1:B$25=\"Отметка\",ROW(Лист1!B$1:B$25)),ROW(A22))),\"\")","v":""},null,{"$f":"INDEX(Лист1!$C$1:$C$25,MATCH(A22,Лист1!$A$1:$A$25,0),1)","v":{"$error":"#N/A"}},{"$f":"INDEX(Лист1!$D$1:$D$25,MATCH(A22,Лист1!$A$1:$A$25,0),1)","v":{"$error":"#N/A"}}]
[{"$f":"IFERROR(INDEX(Лист1!A$1:A$25,SMALL(IF(Лист1!B$1:B$25=\"Отметка\",ROW(Лист1!B$1:B$25)),ROW(A23))),\"\")","v":""},null,{"$f":"INDEX(Лист1!$C$1:$C$25,MATCH(A23,Лист1!$A$1:$A$25,0),1)","v":{"$error":"#N/A"}},{"$f":"INDEX(Лист1!$D$1:$D$25,MATCH(A23,Лист1!$A$1:$A$25,0),1)","v":{"$error":"#N/A"}}]
[{"$f":"IFERROR(INDEX(Лист1!A$1:A$25,SMALL(IF(Лист1!B$1:B$25=\"Отметка\",ROW(Лист1!B$1:B$25)),ROW(A24))),\"\")","v":""},null,{"$f":"INDEX(Лист1!$C$1:$C$25,MATCH(A24,Лист1!$A$1:$A$25,0),1)","v":{"$error":"#N/A"}},{"$f":"INDEX(Лист1!$D$1:$D$25,MATCH(A24,Лист1!$A$1:$A$25,0),1)","v":{"$error":"#N/A"}}]
[{"$f":"IFERROR(INDEX(Лист1!A$1:A$25,SMALL(IF(Лист1!B$1:B$25=\"Отметка\",ROW(Лист1!B$1:B$25)),ROW(A25))),\"\")","v":""},null,{"$f":"INDEX(Лист1!$C$1:$C$25,MATCH(A25,Лист1!$A$1:$A$25,0),1)","v":{"$error":"#N/A"}},{"$f":"INDEX(Лист1!$D$1:$D$25,MATCH(A25,Лист1!$A$1:$A$25,0),1)","v":{"$error":"#N/A"}}]

{"sheet":"База","index":3,"n_rows":19,"n_cols":3,"rows_kept":19,"cut":false,"hidden":false,"merged":[]}
[13479,"Текст 1234","Примечание 90"]
[13480,"Текст 1235","Примечание 91"]
[13481,"Текст 1236","Примечание 92"]
[13482,"Текст 1237","Примечание 93"]
[13483,"Текст 1238","Примечание 94"]
[13484,"Текст 1239","Примечание 95"]
[13485,"Текст 1240","Примечание 96"]
[13486,"Текст 1241","Примечание 97"]
[13487,"Текст 1242","Примечание 98"]
[13488,"Текст 1243","Примечание 99"]
[13489,"Текст 1244","Примечание 100"]
[13490,"Текст 1245","Примечание 101"]
[13491,"Текст 1246","Примечание 102"]
[13492,"Текст 1247","Примечание 103"]
[13493,"Текст 1248","Примечание 104"]
[13494,"Текст 1249","Примечание 105"]
[13495,"Текст 1250","Примечание 106"]
[13496,"Текст 1251","Примечание 107"]
[""]