{"text_format":"1","workbook":"xlsx","n_sheets":2,"sheets":["Перемещения","Склад"],"not_rendered":{"charts":0,"images":0,"macros":1,"external_links":1,"defined_names":0,"comments":0,"pivot_tables":0},"unopened":[],"bounds":{"document_bytes":16777216,"sheet_cells":100000,"rows_first":2000,"rows_last":500,"rows_between":2000,"halvings":0,"cell_chars":16384,"cell_head_chars":4096},"cells_cut":0,"cells_raw":0,"read":"whole","date_system":"1900"}

{"sheet":"Перемещения","index":0,"n_rows":27,"n_cols":11,"rows_kept":27,"cut":false,"hidden":false,"merged":[]}
["Дата","ФИО Сотрудника","Код товара","Наимемнование","Категория","Серийный номер","Операция","Кол-во","Цена","Сумма","Комментарий"]
[{"$f":"NOW()","v":"2020-07-14T17:28:27.710"},"Голубев А.В","1010-0001","Сим-карта ТЕЛЕ2 Мой онлайн","Сим-карты",224710180,"Приход",100,{"$f":"IF([1]!Таблица8[[#This Row],[Код товара]]=\"\",0,VLOOKUP([1]!Таблица8[[#This Row],[Код товара]],[1]!Таблица3[#Data],8,0))","v":{"$error":"#REF!"}},{"$f":"SUM([1]!Таблица8[[#This Row],[Цена]]*[1]!Таблица8[[#This Row],[Кол-во]])","v":{"$error":"#REF!"}}]
[null,null,null,{"$f":"IF([1]!Таблица8[[#This Row],[Код товара]]=\"\",\"-\",VLOOKUP([1]!Таблица8[[#This Row],[Код товара]],[1]!Таблица3[#Data],2,0))","v":{"$error":"#REF!"}},{"$f":"IF([1]!Таблица8[[#This Row],[Код товара]]=\"\",\"-\",VLOOKUP([1]!Таблица8[[#This Row],[Код товара]],[1]!Таблица3[#Data],3,0))","v":{"$error":"#REF!"}},null,null,null,{"$f":"IF([1]!Таблица8[[#This Row],[Код товара]]=\"\",0,VLOOKUP([1]!Таблица8[[#This Row],[Код товара]],[1]!Таблица3[#Data],8,0))","v":{"$error":"#REF!"}},{"$f":"SUM([1]!Таблица8[[#This Row],[Цена]]*[1]!Таблица8[[#This Row],[Кол-во]])","v":{"$error":"#REF!"}}]
[null,null,null,{"$f":"IF([1]!Таблица8[[#This Row],[Код товара]]=\"\",\"-\",VLOOKUP([1]!Таблица8[[#This Row],[Код товара]],[1]!Таблица3[#Data],2,0))","v":{"$error":"#REF!"}},{"$f":"IF([1]!Таблица8[[#This Row],[Код товара]]=\"\",\"-\",VLOOKUP([1]!Таблица8[[#This Row],[Код товара]],[1]!Таблица3[#Data],3,0))","v":{"$error":"#REF!"}},null,null,null,{"$f":"IF([1]!Таблица8[[#This Row],[Код товара]]=\"\",0,VLOOKUP([1]!Таблица8[[#This Row],[Код товара]],[1]!Таблица3[#Data],8,0))","v":{"$error":"#REF!"}},{"$f":"SUM([1]!Таблица8[[#This Row],[Цена]]*[1]!Таблица8[[#This Row],[Кол-во]])","v":{"$error":"#REF!"}}]
[null,null,null,{"$f":"IF([1]!Таблица8[[#This Row],[Код товара]]=\"\",\"-\",VLOOKUP([1]!Таблица8[[#This Row],[Код товара]],[1]!Таблица3[#Data],2,0))","v":{"$error":"#REF!"}},{"$f":"IF([1]!Таблица8[[#This Row],[Код товара]]=\"\",\"-\",VLOOKUP([1]!Таблица8[[#This Row],[Код товара]],[1]!Таблица3[#Data],3,0))","v":{"$error":"#REF!"}},null,null,null,{"$f":"IF([1]!Таблица8[[#This Row],[Код товара]]=\"\",0,VLOOKUP([1]!Таблица8[[#This Row],[Код товара]],[1]!Таблица3[#Data],8,0))","v":{"$error":"#REF!"}},{"$f":"SUM([1]!Таблица8[[#This Row],[Цена]]*[1]!Таблица8[[#This Row],[Кол-во]])","v":{"$error":"#REF!"}}]
[null,null,null,{"$f":"IF([1]!Таблица8[[#This Row],[Код товара]]=\"\",\"-\",VLOOKUP([1]!Таблица8[[#This Row],[Код товара]],[1]!Таблица3[#Data],2,0))","v":{"$error":"#REF!"}},{"$f":"IF([1]!Таблица8[[#This Row],[Код товара]]=\"\",\"-\",VLOOKUP([1]!Таблица8[[#This Row],[Код товара]],[1]!Таблица3[#Data],3,0))","v":{"$error":"#REF!"}},null,null,null,{"$f":"IF([1]!Таблица8[[#This Row],[Код товара]]=\"\",0,VLOOKUP([1]!Таблица8[[#This Row],[Код товара]],[1]!Таблица3[#Data],8,0))","v":{"$error":"#REF!"}},{"$f":"SUM([1]!Таблица8[[#This Row],[Цена]]*[1]!Таблица8[[#This Row],[Кол-во]])","v":{"$error":"#REF!"}}]
[null,null,null,{"$f":"IF([1]!Таблица8[[#This Row],[Код товара]]=\"\",\"-\",VLOOKUP([1]!Таблица8[[#This Row],[Код товара]],[1]!Таблица3[#Data],2,0))","v":{"$error":"#REF!"}},{"$f":"IF([1]!Таблица8[[#This Row],[Код товара]]=\"\",\"-\",VLOOKUP([1]!Таблица8[[#This Row],[Код товара]],[1]!Таблица3[#Data],3,0))","v":{"$error":"#REF!"}},null,null,null,{"$f":"IF([1]!Таблица8[[#This Row],[Код товара]]=\"\",0,VLOOKUP([1]!Таблица8[[#This Row],[Код товара]],[1]!Таблица3[#Data],8,0))","v":{"$error":"#REF!"}},{"$f":"SUM([1]!Таблица8[[#This Row],[Цена]]*[1]!Таблица8[[#This Row],[Кол-во]])","v":{"$error":"#REF!"}}]
[null,null,null,{"$f":"IF([1]!Таблица8[[#This Row],[Код товара]]=\"\",\"-\",VLOOKUP([1]!Таблица8[[#This Row],[Код товара]],[1]!Таблица3[#Data],2,0))","v":{"$error":"#REF!"}},{"$f":"IF([1]!Таблица8[[#This Row],[Код товара]]=\"\",\"-\",VLOOKUP([1]!Таблица8[[#This Row],[Код товара]],[1]!Таблица3[#Data],3,0))","v":{"$error":"#REF!"}},null,null,null,{"$f":"IF([1]!Таблица8[[#This Row],[Код товара]]=\"\",0,VLOOKUP([1]!Таблица8[[#This Row],[Код товара]],[1]!Таблица3[#Data],8,0))","v":{"$error":"#REF!"}},{"$f":"SUM([1]!Таблица8[[#This Row],[Цена]]*[1]!Таблица8[[#This Row],[Кол-во]])","v":{"$error":"#REF!"}}]
[null,null,null,{"$f":"IF([1]!Таблица8[[#This Row],[Код товара]]=\"\",\"-\",VLOOKUP([1]!Таблица8[[#This Row],[Код товара]],[1]!Таблица3[#Data],2,0))","v":{"$error":"#REF!"}},{"$f":"IF([1]!Таблица8[[#This Row],[Код товара]]=\"\",\"-\",VLOOKUP([1]!Таблица8[[#This Row],[Код товара]],[1]!Таблица3[#Data],3,0))","v":{"$error":"#REF!"}},null,null,null,{"$f":"IF([1]!Таблица8[[#This Row],[Код товара]]=\"\",0,VLOOKUP([1]!Таблица8[[#This Row],[Код товара]],[1]!Таблица3[#Data],8,0))","v":{"$error":"#REF!"}},{"$f":"SUM([1]!Таблица8[[#This Row],[Цена]]*[1]!Таблица8[[#This Row],[Кол-во]])","v":{"$error":"#REF!"}}]
[null,null,null,{"$f":"IF([1]!Таблица8[[#This Row],[Код товара]]=\"\",\"-\",VLOOKUP([1]!Таблица8[[#This Row],[Код товара]],[1]!Таблица3[#Data],2,0))","v":{"$error":"#REF!"}},{"$f":"IF([1]!Таблица8[[#This Row],[Код товара]]=\"\",\"-\",VLOOKUP([1]!Таблица8[[#This Row],[Код товара]],[1]!Таблица3[#Data],3,0))","v":{"$error":"#REF!"}},null,null,null,{"$f":"IF([1]!Таблица8[[#This Row],[Код товара]]=\"\",0,VLOOKUP([1]!Таблица8[[#This Row],[Код товара]],[1]!Таблица3[#Data],8,0))","v":{"$error":"#REF!"}},{"$f":"SUM([1]!Таблица8[[#This Row],[Цена]]*[1]!Таблица8[[#This Row],[Кол-во]])","v":{"$error":"#REF!"}}]
[null,null,null,{"$f":"IF([1]!Таблица8[[#This Row],[Код товара]]=\"\",\"-\",VLOOKUP([1]!Таблица8[[#This Row],[Код товара]],[1]!Таблица3[#Data],2,0))","v":{"$error":"#REF!"}},{"$f":"IF([1]!Таблица8[[#This Row],[Код товара]]=\"\",\"-\",VLOOKUP([1]!Таблица8[[#This Row],[Код товара]],[1]!Таблица3[#Data],3,0))","v":{"$error":"#REF!"}},null,null,null,{"$f":"IF([1]!Таблица8[[#This Row],[Код товара]]=\"\",0,VLOOKUP([1]!Таблица8[[#This Row],[Код товара]],[1]!Таблица3[#Data],8,0))","v":{"$error":"#REF!"}},{"$f":"SUM([1]!Таблица8[[#This Row],[Цена]]*[1]!Таблица8[[#This Row],[Кол-во]])","v":{"$error":"#REF!"}}]
[null,null,null,{"$f":"IF([1]!Таблица8[[#This Row],[Код товара]]=\"\",\"-\",VLOOKUP([1]!Таблица8[[#This Row],[Код товара]],[1]!Таблица3[#Data],2,0))","v":{"$error":"#REF!"}},{"$f":"IF([1]!Таблица8[[#This Row],[Код товара]]=\"\",\"-\",VLOOKUP([1]!Таблица8[[#This Row],[Код товара]],[1]!Таблица3[#Data],3,0))","v":{"$error":"#REF!"}},null,null,null,{"$f":"IF([1]!Таблица8[[#This Row],[Код товара]]=\"\",0,VLOOKUP([1]!Таблица8[[#This Row],[Код товара]],[1]!Таблица3[#Data],8,0))","v":{"$error":"#REF!"}},{"$f":"SUM([1]!Таблица8[[#This Row],[Цена]]*[1]!Таблица8[[#This Row],[Кол-во]])","v":{"$error":"#REF!"}}]
[null,null,null,{"$f":"IF([1]!Таблица8[[#This Row],[Код товара]]=\"\",\"-\",VLOOKUP([1]!Таблица8[[#This Row],[Код товара]],[1]!Таблица3[#Data],2,0))","v":{"$error":"#REF!"}},{"$f":"IF([1]!Таблица8[[#This Row],[Код товара]]=\"\",\"-\",VLOOKUP([1]!Таблица8[[#This Row],[Код товара]],[1]!Таблица3[#Data],3,0))","v":{"$error":"#REF!"}},null,null,null,{"$f":"IF([1]!Таблица8[[#This Row],[Код товара]]=\"\",0,VLOOKUP([1]!Таблица8[[#This Row],[Код товара]],[1]!Таблица3[#Data],8,0))","v":{"$error":"#REF!"}},{"$f":"SUM([1]!Таблица8[[#This Row],[Цена]]*[1]!Таблица8[[#This Row],[Кол-во]])","v":{"$error":"#REF!"}}]
[null,null,null,{"$f":"IF([1]!Таблица8[[#This Row],[Код товара]]=\"\",\"-\",VLOOKUP([1]!Таблица8[[#This Row],[Код товара]],[1]!Таблица3[#Data],2,0))","v":{"$error":"#REF!"}},{"$f":"IF([1]!Таблица8[[#This Row],[Код товара]]=\"\",\"-\",VLOOKUP([1]!Таблица8[[#This Row],[Код товара]],[1]!Таблица3[#Data],3,0))","v":{"$error":"#REF!"}},null,null,null,{"$f":"IF([1]!Таблица8[[#This Row],[Код товара]]=\"\",0,VLOOKUP([1]!Таблица8[[#This Row],[Код товара]],[1]!Таблица3[#Data],8,0))","v":{"$error":"#REF!"}},{"$f":"SUM([1]!Таблица8[[#This Row],[Цена]]*[1]!Таблица8[[#This Row],[Кол-во]])","v":{"$error":"#REF!"}}]
[null,null,null,{"$f":"IF([1]!Таблица8[[#This Row],[Код товара]]=\"\",\"-\",VLOOKUP([1]!Таблица8[[#This Row],[Код товара]],[1]!Таблица3[#Data],2,0))","v":{"$error":"#REF!"}},{"$f":"IF([1]!Таблица8[[#This Row],[Код товара]]=\"\",\"-\",VLOOKUP([1]!Таблица8[[#This Row],[Код товара]],[1]!Таблица3[#Data],3,0))","v":{"$error":"#REF!"}},null,null,null,{"$f":"IF([1]!Таблица8[[#This Row],[Код товара]]=\"\",0,VLOOKUP([1]!Таблица8[[#This Row],[Код товара]],[1]!Таблица3[#Data],8,0))","v":{"$error":"#REF!"}},{"$f":"SUM([1]!Таблица8[[#This Row],[Цена]]*[1]!Таблица8[[#This Row],[Кол-во]])","v":{"$error":"#REF!"}}]
[null,null,null,{"$f":"IF([1]!Таблица8[[#This Row],[Код товара]]=\"\",\"-\",VLOOKUP([1]!Таблица8[[#This Row],[Код товара]],[1]!Таблица3[#Data],2,0))","v":{"$error":"#REF!"}},{"$f":"IF([1]!Таблица8[[#This Row],[Код товара]]=\"\",\"-\",VLOOKUP([1]!Таблица8[[#This Row],[Код товара]],[1]!Таблица3[#Data],3,0))","v":{"$error":"#REF!"}},null,null,null,{"$f":"IF([1]!Таблица8[[#This Row],[Код товара]]=\"\",0,VLOOKUP([1]!Таблица8[[#This Row],[Код товара]],[1]!Таблица3[#Data],8,0))","v":{"$error":"#REF!"}},{"$f":"SUM([1]!Таблица8[[#This Row],[Цена]]*[1]!Таблица8[[#This Row],[Кол-во]])","v":{"$error":"#REF!"}}]
[null,null,null,{"$f":"IF([1]!Таблица8[[#This Row],[Код товара]]=\"\",\"-\",VLOOKUP([1]!Таблица8[[#This Row],[Код товара]],[1]!Таблица3[#Data],2,0))","v":{"$error":"#REF!"}},{"$f":"IF([1]!Таблица8[[#This Row],[Код товара]]=\"\",\"-\",VLOOKUP([1]!Таблица8[[#This Row],[Код товара]],[1]!Таблица3[#Data],3,0))","v":{"$error":"#REF!"}},null,null,null,{"$f":"IF([1]!Таблица8[[#This Row],[Код товара]]=\"\",0,VLOOKUP([1]!Таблица8[[#This Row],[Код товара]],[1]!Таблица3[#Data],8,0))","v":{"$error":"#REF!"}},{"$f":"SUM([1]!Таблица8[[#This Row],[Цена]]*[1]!Таблица8[[#This Row],[Кол-во]])","v":{"$error":"#REF!"}}]
[null,null,null,{"$f":"IF([1]!Таблица8[[#This Row],[Код товара]]=\"\",\"-\",VLOOKUP([1]!Таблица8[[#This Row],[Код товара]],[1]!Таблица3[#Data],2,0))","v":{"$error":"#REF!"}},{"$f":"IF([1]!Таблица8[[#This Row],[Код товара]]=\"\",\"-\",VLOOKUP([1]!Таблица8[[#This Row],[Код товара]],[1]!Таблица3[#Data],3,0))","v":{"$error":"#REF!"}},null,null,null,{"$f":"IF([1]!Таблица8[[#This Row],[Код товара]]=\"\",0,VLOOKUP([1]!Таблица8[[#This Row],[Код товара]],[1]!Таблица3[#Data],8,0))","v":{"$error":"#REF!"}},{"$f":"SUM([1]!Таблица8[[#This Row],[Цена]]*[1]!Таблица8[[#This Row],[Кол-во]])","v":{"$error":"#REF!"}}]
[null,null,null,{"$f":"IF([1]!Таблица8[[#This Row],[Код товара]]=\"\",\"-\",VLOOKUP([1]!Таблица8[[#This Row],[Код товара]],[1]!Таблица3[#Data],2,0))","v":{"$error":"#REF!"}},{"$f":"IF([1]!Таблица8[[#This Row],[Код товара]]=\"\",\"-\",VLOOKUP([1]!Таблица8[[#This Row],[Код товара]],[1]!Таблица3[#Data],3,0))","v":{"$error":"#REF!"}},null,null,null,{"$f":"IF([1]!Таблица8[[#This Row],[Код товара]]=\"\",0,VLOOKUP([1]!Таблица8[[#This Row],[Код товара]],[1]!Таблица3[#Data],8,0))","v":{"$error":"#REF!"}},{"$f":"SUM([1]!Таблица8[[#This Row],[Цена]]*[1]!Таблица8[[#This Row],[Кол-во]])","v":{"$error":"#REF!"}}]
[null,null,null,{"$f":"IF([1]!Таблица8[[#This Row],[Код товара]]=\"\",\"-\",VLOOKUP([1]!Таблица8[[#This Row],[Код товара]],[1]!Таблица3[#Data],2,0))","v":{"$error":"#REF!"}},{"$f":"IF([1]!Таблица8[[#This Row],[Код товара]]=\"\",\"-\",VLOOKUP([1]!Таблица8[[#This Row],[Код товара]],[1]!Таблица3[#Data],3,0))","v":{"$error":"#REF!"}},null,null,null,{"$f":"IF([1]!Таблица8[[#This Row],[Код товара]]=\"\",0,VLOOKUP([1]!Таблица8[[#This Row],[Код товара]],[1]!Таблица3[#Data],8,0))","v":{"$error":"#REF!"}},{"$f":"SUM([1]!Таблица8[[#This Row],[Цена]]*[1]!Таблица8[[#This Row],[Кол-во]])","v":{"$error":"#REF!"}}]
[null,null,null,{"$f":"IF([1]!Таблица8[[#This Row],[Код товара]]=\"\",\"-\",VLOOKUP([1]!Таблица8[[#This Row],[Код товара]],[1]!Таблица3[#Data],2,0))","v":{"$error":"#REF!"}},{"$f":"IF([1]!Таблица8[[#This Row],[Код товара]]=\"\",\"-\",VLOOKUP([1]!Таблица8[[#This Row],[Код товара]],[1]!Таблица3[#Data],3,0))","v":{"$error":"#REF!"}},null,null,null,{"$f":"IF([1]!Таблица8[[#This Row],[Код товара]]=\"\",0,VLOOKUP([1]!Таблица8[[#This Row],[Код товара]],[1]!Таблица3[#Data],8,0))","v":{"$error":"#REF!"}},{"$f":"SUM([1]!Таблица8[[#This Row],[Цена]]*[1]!Таблица8[[#This Row],[Кол-во]])","v":{"$error":"#REF!"}}]
[null,null,null,{"$f":"IF([1]!Таблица8[[#This Row],[Код товара]]=\"\",\"-\",VLOOKUP([1]!Таблица8[[#This Row],[Код товара]],[1]!Таблица3[#Data],2,0))","v":{"$error":"#REF!"}},{"$f":"IF([1]!Таблица8[[#This Row],[Код товара]]=\"\",\"-\",VLOOKUP([1]!Таблица8[[#This Row],[Код товара]],[1]!Таблица3[#Data],3,0))","v":{"$error":"#REF!"}},null,null,null,{"$f":"IF([1]!Таблица8[[#This Row],[Код товара]]=\"\",0,VLOOKUP([1]!Таблица8[[#This Row],[Код товара]],[1]!Таблица3[#Data],8,0))","v":{"$error":"#REF!"}},{"$f":"SUM([1]!Таблица8[[#This Row],[Цена]]*[1]!Таблица8[[#This Row],[Кол-во]])","v":{"$error":"#REF!"}}]
[null,null,null,{"$f":"IF([1]!Таблица8[[#This Row],[Код товара]]=\"\",\"-\",VLOOKUP([1]!Таблица8[[#This Row],[Код товара]],[1]!Таблица3[#Data],2,0))","v":{"$error":"#REF!"}},{"$f":"IF([1]!Таблица8[[#This Row],[Код товара]]=\"\",\"-\",VLOOKUP([1]!Таблица8[[#This Row],[Код товара]],[1]!Таблица3[#Data],3,0))","v":{"$error":"#REF!"}},null,null,null,{"$f":"IF([1]!Таблица8[[#This Row],[Код товара]]=\"\",0,VLOOKUP([1]!Таблица8[[#This Row],[Код товара]],[1]!Таблица3[#Data],8,0))","v":{"$error":"#REF!"}},{"$f":"SUM([1]!Таблица8[[#This Row],[Цена]]*[1]!Таблица8[[#This Row],[Кол-во]])","v":{"$error":"#REF!"}}]
[null,null,null,{"$f":"IF([1]!Таблица8[[#This Row],[Код товара]]=\"\",\"-\",VLOOKUP([1]!Таблица8[[#This Row],[Код товара]],[1]!Таблица3[#Data],2,0))","v":{"$error":"#REF!"}},{"$f":"IF([1]!Таблица8[[#This Row],[Код товара]]=\"\",\"-\",VLOOKUP([1]!Таблица8[[#This Row],[Код товара]],[1]!Таблица3[#Data],3,0))","v":{"$error":"#REF!"}},null,null,null,{"$f":"IF([1]!Таблица8[[#This Row],[Код товара]]=\"\",0,VLOOKUP([1]!Таблица8[[#This Row],[Код товара]],[1]!Таблица3[#Data],8,0))","v":{"$error":"#REF!"}},{"$f":"SUM([1]!Таблица8[[#This Row],[Цена]]*[1]!Таблица8[[#This Row],[Кол-во]])","v":{"$error":"#REF!"}}]
[null,null,null,{"$f":"IF([1]!Таблица8[[#This Row],[Код товара]]=\"\",\"-\",VLOOKUP([1]!Таблица8[[#This Row],[Код товара]],[1]!Таблица3[#Data],2,0))","v":{"$error":"#REF!"}},{"$f":"IF([1]!Таблица8[[#This Row],[Код товара]]=\"\",\"-\",VLOOKUP([1]!Таблица8[[#This Row],[Код товара]],[1]!Таблица3[#Data],3,0))","v":{"$error":"#REF!"}},null,null,null,{"$f":"IF([1]!Таблица8[[#This Row],[Код товара]]=\"\",0,VLOOKUP([1]!Таблица8[[#This Row],[Код товара]],[1]!Таблица3[#Data],8,0))","v":{"$error":"#REF!"}},{"$f":"SUM([1]!Таблица8[[#This Row],[Цена]]*[1]!Таблица8[[#This Row],[Кол-во]])","v":{"$error":"#REF!"}}]
[null,null,null,{"$f":"IF([1]!Таблица8[[#This Row],[Код товара]]=\"\",\"-\",VLOOKUP([1]!Таблица8[[#This Row],[Код товара]],[1]!Таблица3[#Data],2,0))","v":{"$error":"#REF!"}},{"$f":"IF([1]!Таблица8[[#This Row],[Код товара]]=\"\",\"-\",VLOOKUP([1]!Таблица8[[#This Row],[Код товара]],[1]!Таблица3[#Data],3,0))","v":{"$error":"#REF!"}},null,null,null,{"$f":"IF([1]!Таблица8[[#This Row],[Код товара]]=\"\",0,VLOOKUP([1]!Таблица8[[#This Row],[Код товара]],[1]!Таблица3[#Data],8,0))","v":{"$error":"#REF!"}},{"$f":"SUM([1]!Таблица8[[#This Row],[Цена]]*[1]!Таблица8[[#This Row],[Кол-во]])","v":{"$error":"#REF!"}}]
[null,null,null,{"$f":"IF([1]!Таблица8[[#This Row],[Код товара]]=\"\",\"-\",VLOOKUP([1]!Таблица8[[#This Row],[Код товара]],[1]!Таблица3[#Data],2,0))","v":{"$error":"#REF!"}},{"$f":"IF([1]!Таблица8[[#This Row],[Код товара]]=\"\",\"-\",VLOOKUP([1]!Таблица8[[#This Row],[Код товара]],[1]!Таблица3[#Data],3,0))","v":{"$error":"#REF!"}},null,null,null,{"$f":"IF([1]!Таблица8[[#This Row],[Код товара]]=\"\",0,VLOOKUP([1]!Таблица8[[#This Row],[Код товара]],[1]!Таблица3[#Data],8,0))","v":{"$error":"#REF!"}},{"$f":"SUM([1]!Таблица8[[#This Row],[Цена]]*[1]!Таблица8[[#This Row],[Кол-во]])","v":{"$error":"#REF!"}}]

{"sheet":"Склад","index":1,"n_rows":101,"n_cols":7,"rows_kept":101,"cut":false,"hidden":false,"merged":[]}
["Дата","ФИО Сотрудника","Код товара","Наимемнование","Категория","Серийный номер","Операция"]
["2020-07-14T17:25:57","Голубев А.В","1010-0001","Сим-карта ТЕЛЕ2 Мой онлайн","Сим-карты",224710180,"Приход"]
["2020-07-14T17:25:57","Голубев А.В","1010-0001","Сим-карта ТЕЛЕ2 Мой онлайн","Сим-карты",224710181,"Приход"]
["2020-07-14T17:25:57","Голубев А.В","1010-0001","Сим-карта ТЕЛЕ2 Мой онлайн","Сим-карты",224710182,"Приход"]
["2020-07-14T17:25:57","Голубев А.В","1010-0001","Сим-карта ТЕЛЕ2 Мой онлайн","Сим-карты",224710183,"Приход"]
["2020-07-14T17:25:57","Голубев А.В","1010-0001","Сим-карта ТЕЛЕ2 Мой онлайн","Сим-карты",224710184,"Приход"]
["2020-07-14T17:25:57","Голубев А.В","1010-0001","Сим-карта ТЕЛЕ2 Мой онлайн","Сим-карты",224710185,"Приход"]
["2020-07-14T17:25:57","Голубев А.В","1010-0001","Сим-карта ТЕЛЕ2 Мой онлайн","Сим-карты",224710186,"Приход"]
["2020-07-14T17:25:57","Голубев А.В","1010-0001","Сим-карта ТЕЛЕ2 Мой онлайн","Сим-карты",224710187,"Приход"]
["2020-07-14T17:25:57","Голубев А.В","1010-0001","Сим-карта ТЕЛЕ2 Мой онлайн","Сим-карты",224710188,"Приход"]
["2020-07-14T17:25:57","Голубев А.В","1010-0001","Сим-карта ТЕЛЕ2 Мой онлайн","Сим-карты",224710189,"Приход"]
["2020-07-14T17:25:57","Голубев А.В","1010-0001","Сим-карта ТЕЛЕ2 Мой онлайн","Сим-карты",224710190,"Приход"]
["2020-07-14T17:25:57","Голубев А.В","1010-0001","Сим-карта ТЕЛЕ2 Мой онлайн","Сим-карты",224710191,"Приход"]
["2020-07-14T17:25:57","Голубев А.В","1010-0001","Сим-карта ТЕЛЕ2 Мой онлайн","Сим-карты",224710192,"Приход"]
["2020-07-14T17:25:57","Голубев А.В","1010-0001","Сим-карта ТЕЛЕ2 Мой онлайн","Сим-карты",224710193,"Приход"]
["2020-07-14T17:25:57","Голубев А.В","1010-0001","Сим-карта ТЕЛЕ2 Мой онлайн","Сим-карты",224710194,"Приход"]
["2020-07-14T17:25:57","Голубев А.В","1010-0001","Сим-карта ТЕЛЕ2 Мой онлайн","Сим-карты",224710195,"Приход"]
["2020-07-14T17:25:57","Голубев А.В","1010-0001","Сим-карта ТЕЛЕ2 Мой онлайн","Сим-карты",224710196,"Приход"]
["2020-07-14T17:25:57","Голубев А.В","1010-0001","Сим-карта ТЕЛЕ2 Мой онлайн","Сим-карты",224710197,"Приход"]
["2020-07-14T17:25:57","Голубев А.В","1010-0001","Сим-карта ТЕЛЕ2 Мой онлайн","Сим-карты",224710198,"Приход"]
["2020-07-14T17:25:57","Голубев А.В","1010-0001","Сим-карта ТЕЛЕ2 Мой онлайн","Сим-карты",224710199,"Приход"]
["2020-07-14T17:25:57","Голубев А.В","1010-0001","Сим-карта ТЕЛЕ2 Мой онлайн","Сим-карты",224710200,"Приход"]
["2020-07-14T17:25:57","Голубев А.В","1010-0001","Сим-карта ТЕЛЕ2 Мой онлайн","Сим-карты",224710201,"Приход"]
["2020-07-14T17:25:57","Голубев А.В","1010-0001","Сим-карта ТЕЛЕ2 Мой онлайн","Сим-карты",224710202,"Приход"]
["2020-07-14T17:25:57","Голубев А.В","1010-0001","Сим-карта ТЕЛЕ2 Мой онлайн","Сим-карты",224710203,"Приход"]
["2020-07-14T17:25:57","Голубев А.В","1010-0001","Сим-карта ТЕЛЕ2 Мой онлайн","Сим-карты",224710204,"Приход"]
["2020-07-14T17:25:57","Голубев А.В","1010-0001","Сим-карта ТЕЛЕ2 Мой онлайн","Сим-карты",224710205,"Приход"]
["2020-07-14T17:25:57","Голубев А.В","1010-0001","Сим-карта ТЕЛЕ2 Мой онлайн","Сим-карты",224710206,"Приход"]
["2020-07-14T17:25:57","Голубев А.В","1010-0001","Сим-карта ТЕЛЕ2 Мой онлайн","Сим-карты",224710207,"Приход"]
["2020-07-14T17:25:57","Голубев А.В","1010-0001","Сим-карта ТЕЛЕ2 Мой онлайн","Сим-карты",224710208,"Приход"]
["2020-07-14T17:25:57","Голубев А.В","1010-0001","Сим-карта ТЕЛЕ2 Мой онлайн","Сим-карты",224710209,"Приход"]
["2020-07-14T17:25:57","Голубев А.В","1010-0001","Сим-карта ТЕЛЕ2 Мой онлайн","Сим-карты",224710210,"Приход"]
["2020-07-14T17:25:57","Голубев А.В","1010-0001","Сим-карта ТЕЛЕ2 Мой онлайн","Сим-карты",224710211,"Приход"]
["2020-07-14T17:25:57","Голубев А.В","1010-0001","Сим-карта ТЕЛЕ2 Мой онлайн","Сим-карты",224710212,"Приход"]
["2020-07-14T17:25:57","Голубев А.В","1010-0001","Сим-карта ТЕЛЕ2 Мой онлайн","Сим-карты",224710213,"Приход"]
["2020-07-14T17:25:57","Голубев А.В","1010-0001","Сим-карта ТЕЛЕ2 Мой онлайн","Сим-карты",224710214,"Приход"]
["2020-07-14T17:25:57","Голубев А.В","1010-0001","Сим-карта ТЕЛЕ2 Мой онлайн","Сим-карты",224710215,"Приход"]
["2020-07-14T17:25:57","Голубев А.В","1010-0001","Сим-карта ТЕЛЕ2 Мой онлайн","Сим-карты",224710216,"Приход"]
["2020-07-14T17:25:57","Голубев А.В","1010-0001","Сим-карта ТЕЛЕ2 Мой онлайн","Сим-карты",224710217,"Приход"]
["2020-07-14T17:25:57","Голубев А.В","1010-0001","Сим-карта ТЕЛЕ2 Мой онлайн","Сим-карты",224710218,"Приход"]
["2020-07-14T17:25:57","Голубев А.В","1010-0001","Сим-карта ТЕЛЕ2 Мой онлайн","Сим-карты",224710219,"Приход"]
["2020-07-14T17:25:57","Голубев А.В","1010-0001","Сим-карта ТЕЛЕ2 Мой онлайн","Сим-карты",224710220,"Приход"]
["2020-07-14T17:25:57","Голубев А.В","1010-0001","Сим-карта ТЕЛЕ2 Мой онлайн","Сим-карты",224710221,"Приход"]
["2020-07-14T17:25:57","Голубев А.В","1010-0001","Сим-карта ТЕЛЕ2 Мой онлайн","Сим-карты",224710222,"Приход"]
["2020-07-14T17:25:57","Голубев А.В","1010-0001","Сим-карта ТЕЛЕ2 Мой онлайн","Сим-карты",224710223,"Приход"]
["2020-07-14T17:25:57","Голубев А.В","1010-0001","Сим-карта ТЕЛЕ2 Мой онлайн","Сим-карты",224710224,"Приход"]
["2020-07-14T17:25:57","Голубев А.В","1010-0001","Сим-карта ТЕЛЕ2 Мой онлайн","Сим-карты",224710225,"Приход"]
["2020-07-14T17:25:57","Голубев А.В","1010-0001","Сим-карта ТЕЛЕ2 Мой онлайн","Сим-карты",224710226,"Приход"]
["2020-07-14T17:25:57","Голубев А.В","1010-0001","Сим-карта ТЕЛЕ2 Мой онлайн","Сим-карты",224710227,"Приход"]
["2020-07-14T17:25:57","Голубев А.В","1010-0001","Сим-карта ТЕЛЕ2 Мой онлайн","Сим-карты",224710228,"Приход"]
["2020-07-14T17:25:57","Голубев А.В","1010-0001","Сим-карта ТЕЛЕ2 Мой онлайн","Сим-карты",224710229,"Приход"]
["2020-07-14T17:25:57","Голубев А.В","1010-0001","Сим-карта ТЕЛЕ2 Мой онлайн","Сим-карты",224710230,"Приход"]
["2020-07-14T17:25:57","Голубев А.В","1010-0001","Сим-карта ТЕЛЕ2 Мой онлайн","Сим-карты",224710231,"Приход"]
["2020-07-14T17:25:57","Голубев А.В","1010-0001","Сим-карта ТЕЛЕ2 Мой онлайн","Сим-карты",224710232,"Приход"]
["2020-07-14T17:25:57","Голубев А.В","1010-0001","Сим-карта ТЕЛЕ2 Мой онлайн","Сим-карты",224710233,"Приход"]
["2020-07-14T17:25:57","Голубев А.В","1010-0001","Сим-карта ТЕЛЕ2 Мой онлайн","Сим-карты",224710234,"Приход"]
["2020-07-14T17:25:57","Голубев А.В","1010-0001","Сим-карта ТЕЛЕ2 Мой онлайн","Сим-карты",224710235,"Приход"]
["2020-07-14T17:25:57","Голубев А.В","1010-0001","Сим-карта ТЕЛЕ2 Мой онлайн","Сим-карты",224710236,"Приход"]
["2020-07-14T17:25:57","Голубев А.В","1010-0001","Сим-карта ТЕЛЕ2 Мой онлайн","Сим-карты",224710237,"Приход"]
["2020-07-14T17:25:57","Голубев А.В","1010-0001","Сим-карта ТЕЛЕ2 Мой онлайн","Сим-карты",224710238,"Приход"]
["2020-07-14T17:25:57","Голубев А.В","1010-0001","Сим-карта ТЕЛЕ2 Мой онлайн","Сим-карты",224710239,"Приход"]
["2020-07-14T17:25:57","Голубев А.В","1010-0001","Сим-карта ТЕЛЕ2 Мой онлайн","Сим-карты",224710240,"Приход"]
["2020-07-14T17:25:57","Голубев А.В","1010-0001","Сим-карта ТЕЛЕ2 Мой онлайн","Сим-карты",224710241,"Приход"]
["2020-07-14T17:25:57","Голубев А.В","1010-0001","Сим-карта ТЕЛЕ2 Мой онлайн","Сим-карты",224710242,"Приход"]
["2020-07-14T17:25:57","Голубев А.В","1010-0001","Сим-карта ТЕЛЕ2 Мой онлайн","Сим-карты",224710243,"Приход"]
["2020-07-14T17:25:57","Голубев А.В","1010-0001","Сим-карта ТЕЛЕ2 Мой онлайн","Сим-карты",224710244,"Приход"]
["2020-07-14T17:25:57","Голубев А.В","1010-0001","Сим-карта ТЕЛЕ2 Мой онлайн","Сим-карты",224710245,"Приход"]
["2020-07-14T17:25:57","Голубев А.В","1010-0001","Сим-карта ТЕЛЕ2 Мой онлайн","Сим-карты",224710246,"Приход"]
["2020-07-14T17:25:57","Голубев А.В","1010-0001","Сим-карта ТЕЛЕ2 Мой онлайн","Сим-карты",224710247,"Приход"]
["2020-07-14T17:25:57","Голубев А.В","1010-0001","Сим-карта ТЕЛЕ2 Мой онлайн","Сим-карты",224710248,"Приход"]
["2020-07-14T17:25:57","Голубев А.В","1010-0001","Сим-карта ТЕЛЕ2 Мой онлайн","Сим-карты",224710249,"Приход"]
["2020-07-14T17:25:57","Голубев А.В","1010-0001","Сим-карта ТЕЛЕ2 Мой онлайн","Сим-карты",224710250,"Приход"]
["2020-07-14T17:25:57","Голубев А.В","1010-0001","Сим-карта ТЕЛЕ2 Мой онлайн","Сим-карты",224710251,"Приход"]
["2020-07-14T17:25:57","Голубев А.В","1010-0001","Сим-карта ТЕЛЕ2 Мой онлайн","Сим-карты",224710252,"Приход"]
["2020-07-14T17:25:57","Голубев А.В","1010-0001","Сим-карта ТЕЛЕ2 Мой онлайн","Сим-карты",224710253,"Приход"]
["2020-07-14T17:25:57","Голубев А.В","1010-0001","Сим-карта ТЕЛЕ2 Мой онлайн","Сим-карты",224710254,"Приход"]
["2020-07-14T17:25:57","Голубев А.В","1010-0001","Сим-карта ТЕЛЕ2 Мой онлайн","Сим-карты",224710255,"Приход"]
["2020-07-14T17:25:57","Голубев А.В","1010-0001","Сим-карта ТЕЛЕ2 Мой онлайн","Сим-карты",224710256,"Приход"]
["2020-07-14T17:25:57","Голубев А.В","1010-0001","Сим-карта ТЕЛЕ2 Мой онлайн","Сим-карты",224710257,"Приход"]
["2020-07-14T17:25:57","Голубев А.В","1010-0001","Сим-карта ТЕЛЕ2 Мой онлайн","Сим-карты",224710258,"Приход"]
{"$rows_left_out":21}