{"text_format":"1","workbook":"xlsx","n_sheets":22,"sheets":["СПИСОК ЗАКАЗОВ","ТАРИФЫ ТК","+KASPI+ 9641++0","+KASPI+1200820_2++0"," 9639++11550"," 9640++25950","170820++29000","140820++29300","+KASPI+ 9635++0","+KASPI+120820++0"," 9632++10650","+KASPI+ 9633++0","+СЧЁТ Альфа-Банк+Сч0608++0","+СЧЁТ Альфа-Банк+Сч0908++0","+СЧЁТ Альфа-Банк+Сч0608_1++0","+KASPI+ 9630++0"," +","+СЧЁТ Альфа-Банк+Сч1708++0","170820_2","+KASPI+ 9651++0","Лист10","Образец"],"not_rendered":{"charts":0,"images":0,"macros":1,"external_links":0,"defined_names":49,"comments":0,"pivot_tables":0},"unopened":[],"bounds":{"document_bytes":16777216,"sheet_cells":100000,"rows_first":2000,"rows_last":500,"rows_between":2000,"halvings":0,"cell_chars":16384,"cell_head_chars":4096},"cells_cut":0,"cells_raw":0,"read":"whole","date_system":"1900"}

{"sheet":"СПИСОК ЗАКАЗОВ","index":0,"n_rows":500,"n_cols":33,"rows_kept":500,"cut":false,"hidden":false,"merged":[[0,14,0,15]]}
["СПИСОК ЗАКАЗОВ",{"$f":"SUM(A2:A500)","v":21},"ДАТА заказа","ФИО","Город доставки","ТЕЛЕФОН","ЛОГИН","СТАТУС заказа","СУММА заказа","ДАТА ОПЛАТЫ","ОПЛАЧЕНО","СПОСОБ ОПЛАТЫ","№ ПОСЫЛКИ","ДАТА ПОСЫЛКИ",null,null,{"$f":"IFERROR(0.98*MID(R1,SEARCH(\"++\",R1)+2,99),0)","v":0},"феррит",0,1,0,0,0,0,0,0,0,0,4200,"00:00:00",0,"",0]
[{"$f":"IF(LEN(B2)>0,1,0)","v":1},{"$f":" IFERROR(HYPERLINK( SUBSTITUTE(INDEX(ЛИСТЫ, ROW()), \"]\", \"]'\") & \"'!A1\",  INDEX(ЛИСТ.ИМЯ, ROW()) ),\"\")","v":"ТАРИФЫ ТК"},{"$f":" IFERROR(INDIRECT(\"'\"&B2&\"'!B2\"),\"\")","v":"00:00:00"},{"$f":" IFERROR(INDIRECT(\"'\"&$B2&\"'!B3\"),\"\")","v":0},1575877,{"$f":" IFERROR(INDIRECT(\"'\"&$B2&\"'!B4\"),\"\")","v":"Аста"},{"$f":" IFERROR(INDIRECT(\"'\"&$B2&\"'!K3\"),\"\")","v":"Зона 2"},{"$f":" IFERROR(INDIRECT(\"'\"&$B2&\"'!C1\"),\"\")","v":"00:00:00"},{"$f":" IFERROR(INDIRECT(\"'\"&$B2&\"'!F18\"),\"\")","v":"Усть"},{"$f":" IFERROR(INDIRECT(\"'\"&$B2&\"'!G6\"),\"\")","v":"1903-10-31"},{"$f":" IFERROR(INDIRECT(\"'\"&$B2&\"'!I6\"),\"\")","v":5.5},{"$f":" IFERROR(INDIRECT(\"'\"&$B2&\"'!h6\"),\"\")","v":0},{"$f":" IFERROR(INDIRECT(\"'\"&$B2&\"'!E2\"),\"\")","v":0},{"$f":"IFERROR(IF(M2>0,INDIRECT(\"'\"&$B2&\"'!E1\"),\"\"),\"\")","v":""},{"$f":" IFERROR(INDIRECT(\"'\"&$B2&\"'!E4\"),\"\")","v":"Астана"},{"$f":"IF(LEFT(O2,8)=\"оплачено\",0,IF(LEFT(O2,8)=\"ОПЛАТИТЬ\",(ПоискСКонца(O2,\"= \"))*1,\"\"))","v":""},{"$f":"IFERROR(0.98*MID(R2,SEARCH(\"++\",R2)+2,99),0)","v":0},"+Beeline+220819_3++0","2019-08-22","СОЛОВЬЕВ ВИКТОР ","Бишкек","9-965-572-22-24   2-0---   ----","Логин","ОТПРАВЛЕНО",30000,43705,33200,"Beeline",3893651,"00:00:00","ОПЛАТИТЬ= 1100",1100,0]
[{"$f":"IF(LEN(B3)>0,1,0)","v":1},"+KASPI+ 9641++0",{"$f":" IFERROR(INDIRECT(\"'\"&B3&\"'!B1\"),\"\")","v":"2020-08-16T18:08:28"},{"$f":" IFERROR(INDIRECT(\"'\"&$B3&\"'!B3\"),\"\")","v":"КУЗНЕЦОВА ЛАРИСА"},{"$f":" IFERROR(INDIRECT(\"'\"&$B3&\"'!B34\"),\"\")","v":"ТАРАЗ"},{"$f":" IFERROR(INDIRECT(\"'\"&$B3&\"'!B4\"),\"\")","v":"7-771-835-95-68   0----   ----"},{"$f":" IFERROR(INDIRECT(\"'\"&$B3&\"'!K3\"),\"\")","v":"Логин"},{"$f":" IFERROR(INDIRECT(\"'\"&$B3&\"'!C1\"),\"\")","v":"ОТПРАВЛЕНО"},{"$f":" IFERROR(INDIRECT(\"'\"&$B3&\"'!F24\"),\"\")","v":3480},{"$f":" IFERROR(INDIRECT(\"'\"&$B3&\"'!G6\"),\"\")","v":"2020-08-21"},{"$f":" IFERROR(INDIRECT(\"'\"&$B3&\"'!I6\"),\"\")","v":4880},{"$f":" IFERROR(INDIRECT(\"'\"&$B3&\"'!h6\"),\"\")","v":"KASPI"},{"$f":" IFERROR(INDIRECT(\"'\"&$B3&\"'!E2\"),\"\")","v":3611555},{"$f":"IFERROR(IF(M3>0,INDIRECT(\"'\"&$B3&\"'!E1\"),\"\"),\"\")","v":"2020-08-18"},"ОПЛАТИТЬ= 1400",{"$f":"IF(LEFT(O3,8)=\"оплачено\",0,IF(LEFT(O3,8)=\"ОПЛАТИТЬ\",(ПоискСКонца(O3,\"= \"))*1,\"\"))","v":1400},{"$f":"IFERROR((0.98*MID(R3,SEARCH(\"++\",R3)+2,99)-AF3+AA3),0)","v":18839},"30120++20550",43833,"ГУЛЬЖАН УЗБЕКОВА","Жетыгара","8-777-639-64-87   0----   ----","Логин","ОТПРАВЛЕНО",18800,"",0,0,3611221,"2020-01-05","ОПЛАТИТЬ= 1300",1300,3065]
[{"$f":"IF(LEN(B4)>0,1,0)","v":1},"+KASPI+1200820_2++0",{"$f":" IFERROR(INDIRECT(\"'\"&B4&\"'!B1\"),\"\")","v":"2020-08-12"},{"$f":" IFERROR(INDIRECT(\"'\"&$B4&\"'!B3\"),\"\")","v":"АДИЛХАНОВ БАХТИАР"},{"$f":" IFERROR(INDIRECT(\"'\"&$B4&\"'!B34\"),\"\")","v":"Тараз"},"8-776-640-42-21   0----   ----","Логин","ОТПРАВЛЕНО",{"$f":" IFERROR(INDIRECT(\"'\"&$B4&\"'!F24\"),\"\")","v":18000},"2020-08-21",19400,"KASPI",{"$f":" IFERROR(INDIRECT(\"'\"&$B4&\"'!E2\"),\"\")","v":3611551},{"$f":"IFERROR(IF(M4>0,INDIRECT(\"'\"&$B4&\"'!E1\"),\"\"),\"\")","v":"2020-08-17"},"ОПЛАТИТЬ= 1400",{"$f":"IF(LEFT(O4,8)=\"оплачено\",0,IF(LEFT(O4,8)=\"ОПЛАТИТЬ\",(ПоискСКонца(O4,\"= \"))*1,\"\"))","v":1400},{"$f":"IFERROR((0.98*MID(R4,SEARCH(\"++\",R4)+2,99)-AF4+AA4),0)","v":15121},"040120_2++16450","2020-01-04","ВАСИЛИЙ ЛИНКОВ","Астана","8-707-841-99-07   8-702-109-24-90   ----","Логин","ОТПРАВЛЕНО",15120,"",0,0,3611222,"2020-01-05","ОПЛАТИТЬ= 1000",1000,13831]
[1," 9639++11550","2020-08-15T15:08:12","НУРЖАН ИСАБАЕВ","КАРАГАНДА","7-700-404-04-50   0----   ----","Логин","ОТПРАВЛЕНО",9900,"",0,0,3611552,"2020-08-17","ОПЛАТИТЬ= 1400",{"$f":"IF(LEFT(O5,8)=\"оплачено\",0,IF(LEFT(O5,8)=\"ОПЛАТИТЬ\",(ПоискСКонца(O5,\"= \"))*1,\"\"))","v":1400},18839,"040120_3++20550","2020-01-04","ДАНИЯР ДЖАНБЕКОВ","Каскелен","8-777-250-04-86   0----   ----","Логин","ОТПРАВЛЕНО",18800,"",0,0,3611223,"2020-01-05","ОПЛАТИТЬ= 1300",1300,2673]
[1," 9640++25950","2020-08-16T18:08:49","ОСТАПЕНКО НИКОЛАЙ","НУР-СУЛТАН","7-775-974-53-71   0----   ----","Логин","ОТПРАВЛЕНО",24000,"",0,0,3611553,"2020-08-17","ОПЛАТИТЬ= 1400",1400,25754," 9114++27300","2020-01-04T21:01:53","ЕВГЕНИЙ ПОДКОСОВ","АЛМАТЫ","7-707-318-19-99   0----   ----","Логин","ОТПРАВЛЕНО",25760,"",0,0,3611224,"2020-01-05","ОПЛАТИТЬ= 1000",1000,7426]
[1,"170820++29000","2020-08-17","РАКИШЕВ АБЗАЛ","Кокшетау","8-701-105-64-80   0----   ----","Логин","ОТПРАВЛЕНО",27000,"",0,0,3611554,"2020-08-17","ОПЛАТИТЬ= 1400",1400,{"$f":"IFERROR((0.98*MID(R7,SEARCH(\"++\",R7)+2,99)-AF7+AA7),0)","v":15980},"+KASPI+060120_1++0","2020-01-06","ИЛДАНИЗ СУЛТАНОВ","Актау","8-701-351-86-33   0----   ----","Логин","ОТПРАВЛЕНО",15580,43840,16680,"KASPI",3611226,"2020-01-08","ОПЛАТИТЬ= 700",700,8943]
[1,"140820++29300","2020-08-14","АБУЛКАСИМОВ БАУЫРЖАН","Семей","8-702-673-12-82   0----   ----","Логин","ОТПРАВЛЕНО",27300,"",0,0,3611550,"2020-08-14","ОПЛАТИТЬ= 1400",1400,6203,"070120_1++7350","2020-01-07","ГАБИТ АБДИГАПАРОВ","Кызылорда","8-777-562-66-99   0----   ----","Логин","ОТПРАВЛЕНО",6200,"",0,0,3611227,"2020-01-08","ОПЛАТИТЬ= 1000",1000,6444]
[1,"+KASPI+ 9635++0","2020-08-12T19:08:35","АРЦИБАШЕВА АЛЛА ЛЕОНИДОВНА","Семей","8-778-929-83-33   ----   ----","Логин","ОТПРАВЛЕНО",{"$f":" IFERROR(INDIRECT(\"'\"&$B9&\"'!F24\"),\"\")","v":14600},"2020-08-21",16000,"KASPI",3611548,"2020-08-13","ОПЛАТИТЬ= 1400",1400,26000,"+KASPI+080120_1++0",43838,"БОЛАТ НАРБАЕВ","Астана","7-707-988-41-48   0----   ----","Логин","ОТПРАВЛЕНО",26000,43840,27000,"KASPI",3611228,"2020-01-09","ОПЛАТИТЬ= 1000",1000,7618]
[1,"+KASPI+120820++0","2020-08-12","ЁЛКИН АЛЕКСАНДР","Алматы","8-701-072-23-33   0----   ----","Логин","ОТПРАВЛЕНО",14600,"2020-08-21",16000,"KASPI",3611549,"2020-08-13","ОПЛАТИТЬ= 1400",{"$f":"IF(LEFT(O10,8)=\"оплачено\",0,IF(LEFT(O10,8)=\"ОПЛАТИТЬ\",(ПоискСКонца(O10,\"= \"))*1,\"\"))","v":1400},8506,"090120_1++9700",43839,"СТАХАНОВА МАРИЯ ","Алматы","7-705-223-60-10   0----   ----","Логин","ОТПРАВЛЕНО",8480,"",0,0,3611229,"2020-01-09","ОПЛАТИТЬ= 1000",1000,13108]
[1," 9632++10650","2020-08-09T18:08:34","АНАТОЛИ ЕЛИМГИРЕЙ","Астана","7-707-695-04-76   0----   ----","Логин","ОТПРАВЛЕНО",9000,"",0,0,3611546,"2020-08-11","ОПЛАТИТЬ= 1400",1400,4500,"+Beeline+ 8957++0","2019-11-04T14:11:51","ШАРКУНОВ АНДРЕЙ","ШЫМКЕНТ","7-771-383-10-71   0----   ----","Логин","ОТПРАВЛЕНО",4800,43794,5800,"Beeline",3611108,"2019-11-05","ОПЛАТИТЬ= 1300",1300,6734]
[1,"+KASPI+ 9633++0","2020-08-11T13:08:02","СКРЕБЦОВ МАКСИМ","УСТЬ-КАМЕНОГОРСК","7-776-900-77-99   0----   ----","Логин","ОТПРАВЛЕНО",5100,"2020-08-21",6500,"KASPI",3611547,"2020-08-11",{"$f":" IFERROR(INDIRECT(\"'\"&$B12&\"'!E4\"),\"\")","v":"ОПЛАТИТЬ= 1400"},1400,9137," 8962++10650","2019-11-05T11:11:27","ТОЛЫБАЕВА ФЕРУЗА ","Шымкент","7-702-761-06-14   0----   ----","Логин","ОТПРАВЛЕНО",9400,"",0,0,3611109,"2019-11-05","ОПЛАТИТЬ= 1300",1300,11536]
[1,"+СЧЁТ Альфа-Банк+Сч0608++0","2020-08-06","ТОО «РОДАМИН»","Алматы","8-701-517-14-04   0----   ----","Логин","ОТПРАВЛЕНО",216000,"2020-08-21",220400,"СЧЁТ Альфа-Банк",3611544,"2020-08-10","ОПЛАТИТЬ= 3300",3300,8106," 8963++9700","2019-11-05T12:11:46","АБЗАЛБЕКОВ ЕРЖАН АГАЛКАУЛЫ","БАЛХАШ","7-707-952-61-64   0----   ----","Логин","ОТПРАВЛЕНО",8200,"",0,0,3611110,"2019-11-05","ОПЛАТИТЬ= 1400",1400,25309]
[1,"+СЧЁТ Альфа-Банк+Сч0908++0","2020-08-09","ТОО ZZZ","Шымкент","8-705-767-77-77   0----   ----","Логин","ОТПРАВЛЕНО",277290,"2020-08-21",286720,"СЧЁТ Альфа-Банк",3611545,"2020-08-10","ОПЛАТИТЬ= 7700",7700,75777," 8965++78650","2019-11-05T14:11:02","АРМАН ОСПАНОВ","Астана","7-705-297-10-68   0----   ----","Логин","ОТПРАВЛЕНО",75600,"",0,0,3611111,"2019-11-05","ОПЛАТИТЬ= 1300",1300,24066]
[1,"+СЧЁТ Альфа-Банк+Сч0608_1++0","2020-08-06","ИП ОЛИМП СТАХАНОВА МАРИЯ ","Алматы","7-705-223-60-10   0----   ----","Логин","ОТПРАВЛЕНО",7171.2,"2020-08-21",8592,"СЧЁТ Альфа-Банк",3611543,"2020-08-07","ОПЛАТИТЬ= 1400",1400,19235,"051119_2++20750","2019-11-05","МАКСАТ АХМЕТОВ","Алматы","8-701-780-77-75   0----   ----","Логин","ОТПРАВЛЕНО",18800,"",0,0,3611112,"2019-11-05","ОПЛАТИТЬ= 1100",1100,14909]
[1,"+KASPI+ 9630++0","2020-08-06T07:08:52","ШЕЛОМЕНЦЕВ АНТОН","АЛМАТЫ","8-707-998-85-08   8-777-602-92-11   ----","Логин","ОТПРАВЛЕНО",4200,"2020-08-21",5600,"KASPI",3611541,"2020-08-06","ОПЛАТИТЬ= 1400",1400,16393,"051119_3++17850","2019-11-05","ЕВГЕНИЙ КИЛЬТЕР","Усть-каменогорск","8-777-995-95-94   0----   ----","Логин","ОТПРАВЛЕНО",16400,"",0,0,3611113,"2019-11-06","ОПЛАТИТЬ= 1100",1100,7522]
[1," +","дата заказа","ФИО","","0----   ----   ----","Логин","ОПЛОЧЕНО",0,"",0,0,0,"","ОПЛАТИТЬ= 0",0,9137,"61119++10650","2019-11-06","ДЖАФАРОВ МАХИР","Атырау","8-778-222-02-03   0----   ----","Логин","ОТПРАВЛЕНО",9400,"",0,0,3611114,"2019-11-06","ОПЛАТИТЬ= 1300",1300,6440]
[1,"+СЧЁТ Альфа-Банк+Сч1708++0","2020-08-17","РЕГРО «ХРИСТИАНСКИЙ ЦЕНТР СВИДЕТЕЛЕЙ ИЕГОВЫ»","Алматы","7-771-790-09-84   0----   ----","Логин","ОПЛОЧЕНО",9950,"2020-08-21",11350,"СЧЁТ Альфа-Банк",0,"","ОПЛАТИТЬ= 1400",1400,19828,"061119_2++23600","2019-11-06","МАРИНА НИКОЛЕНКО","Шымкент","8-702-415-42-29   0----   ----","Логин","ОТПРАВЛЕНО",21600,"",0,0,3611115,"2019-11-06","ОПЛАТИТЬ= 3300",3300,3845]
[1,"170820_2","2020-08-17","ФИО","Алматы","0----   ----   ----","Логин","ОПЛОЧЕНО",7900,"",0,0,0,"","ОПЛАТИТЬ= 0",0,37148,"+СЧЁТ Альфа-Банк+Сч0511++0","2019-11-05","СТАХАНОВА МАРИЯ ","Алматы","7-705-223-60-10   0----   ----","Логин","ОТПРАВЛЕНО",37440,43794,38448,"СЧЁТ Альфа-Банк",3611116,"2019-11-07","ОПЛАТИТЬ= 1300",1300,8885]
[1,"+KASPI+ 9651++0","2020-08-19T13:08:48","САВОРОВСКИЙ ДМИТРИЙ","ПАВЛОДАР","7-778-500-02-25   0----   ----","Логин","ОПЛОЧЕНО",1950,"2020-08-21",3350,"KASPI",0,"","ОПЛАТИТЬ= 1400",1400,4640,"+KASPI+71119++0","2019-11-06","МАКСИМ НИКОЛАЕВ","Астана","8-701-470-10-79   0----   ----","Логин","ОТПРАВЛЕНО",4940,43794,5940,"KASPI",3611117,"2019-11-07","ОПЛАТИТЬ= 1300",1300,3114]
[1,"Лист10","дата заказа","ФИО","","0----   ----   ----","Логин","ОПЛОЧЕНО",0,"",0,0,0,"","ОПЛАТИТЬ= 0",0,12698," 8967++15100","2019-11-06T22:11:51","ДАВЫДОВ ТОМ АЛЕКСЕЕВИЧ","Шымкент","8-700-664-95-45   8-707-279-75-98   ----","Логин","ОТПРАВЛЕНО",13800,"",0,0,3611118,"2019-11-07","ОПЛАТИТЬ= 2100",2100,3065]
[1,"Образец","дата заказа","ФИО","","0----   ----   ----","Логин","ОПЛОЧЕНО",0,"",0,0,0,"","ОПЛАТИТЬ= 0",0,-205,"+KASPI+3383427++0","2019-11-08","ЖАНДАУЛЕТ ТАЖИБЕК","Туркестан","7-700-277-78-02   0----   ----","Логин","ОТПРАВЛЕНО",520,43794,1820,"KASPI",3611101,"2019-11-08","ОПЛАТИТЬ= 2025",2025,256]
[{"$f":"IF(LEN(B23)>0,1,0)","v":0},"",{"$f":" IFERROR(INDIRECT(\"'\"&B23&\"'!B1\"),\"\")","v":""},{"$f":" IFERROR(INDIRECT(\"'\"&$B23&\"'!B3\"),\"\")","v":""},{"$f":" IFERROR(INDIRECT(\"'\"&$B23&\"'!B34\"),\"\")","v":""},{"$f":" IFERROR(INDIRECT(\"'\"&$B23&\"'!B4\"),\"\")","v":""},{"$f":" IFERROR(INDIRECT(\"'\"&$B23&\"'!K3\"),\"\")","v":""},{"$f":" IFERROR(INDIRECT(\"'\"&$B23&\"'!C1\"),\"\")","v":""},{"$f":" IFERROR(INDIRECT(\"'\"&$B23&\"'!F24\"),\"\")","v":""},{"$f":" IFERROR(INDIRECT(\"'\"&$B23&\"'!G6\"),\"\")","v":""},{"$f":" IFERROR(INDIRECT(\"'\"&$B23&\"'!I6\"),\"\")","v":""},{"$f":" IFERROR(INDIRECT(\"'\"&$B23&\"'!h6\"),\"\")","v":""},{"$f":" IFERROR(INDIRECT(\"'\"&$B23&\"'!E2\"),\"\")","v":""},{"$f":"IFERROR(IF(M23>0,INDIRECT(\"'\"&$B23&\"'!E1\"),\"\"),\"\")","v":""},{"$f":" IFERROR(INDIRECT(\"'\"&$B23&\"'!E4\"),\"\")","v":""},{"$f":"IF(LEFT(O23,8)=\"оплачено\",0,IF(LEFT(O23,8)=\"ОПЛАТИТЬ\",(ПоискСКонца(O23,\"= \"))*1,\"\"))","v":""},{"$f":"IFERROR((0.98*MID(R23,SEARCH(\"++\",R23)+2,99)-AF23+AA23),0)","v":7930},"+KASPI+81119++0","2019-11-08","СМАГУЛОВ ДЕНИС","Астана","8-700-700-74-74   0----   ----","Логин","ОТПРАВЛЕНО",9330,43794,10030,"KASPI",3611119,"2019-11-08","ОПЛАТИТЬ= 2100",2100,15019]
[0,"","","","","","","","","","","","","","","",22300,"+KASPI+ 8970++0","2019-11-07T21:11:25","МУСИРЕПОВ МИРАС","АСТАНА","7-747-803-04-29   0----   ----","Логин","ОТПРАВЛЕНО",22000,43794,23000,"KASPI",3611102,"2019-11-09","ОПЛАТИТЬ= 700",700,8014]
[0,"","","","","","","","","","","","","","","",4837,"101119++5650","2019-11-10","ВАСИЛЬЕВ АЛЕКСАНДР","Балхаш","8-777-072-90-96   0----   ----","Логин","ОТПРАВЛЕНО",4200,"",0,0,3611120,"2019-11-11","ОПЛАТИТЬ= 700",700,4531]
[{"$f":"IF(LEN(B26)>0,1,0)","v":0},"",{"$f":" IFERROR(INDIRECT(\"'\"&B26&\"'!B1\"),\"\")","v":""},{"$f":" IFERROR(INDIRECT(\"'\"&$B26&\"'!B3\"),\"\")","v":""},{"$f":" IFERROR(INDIRECT(\"'\"&$B26&\"'!B34\"),\"\")","v":""},{"$f":" IFERROR(INDIRECT(\"'\"&$B26&\"'!B4\"),\"\")","v":""},{"$f":" IFERROR(INDIRECT(\"'\"&$B26&\"'!K3\"),\"\")","v":""},{"$f":" IFERROR(INDIRECT(\"'\"&$B26&\"'!C1\"),\"\")","v":""},{"$f":" IFERROR(INDIRECT(\"'\"&$B26&\"'!F24\"),\"\")","v":""},{"$f":" IFERROR(INDIRECT(\"'\"&$B26&\"'!G6\"),\"\")","v":""},{"$f":" IFERROR(INDIRECT(\"'\"&$B26&\"'!I6\"),\"\")","v":""},{"$f":" IFERROR(INDIRECT(\"'\"&$B26&\"'!h6\"),\"\")","v":""},{"$f":" IFERROR(INDIRECT(\"'\"&$B26&\"'!E2\"),\"\")","v":""},{"$f":"IFERROR(IF(M26>0,INDIRECT(\"'\"&$B26&\"'!E1\"),\"\"),\"\")","v":""},{"$f":" IFERROR(INDIRECT(\"'\"&$B26&\"'!E4\"),\"\")","v":""},{"$f":"IF(LEFT(O26,8)=\"оплачено\",0,IF(LEFT(O26,8)=\"ОПЛАТИТЬ\",(ПоискСКонца(O26,\"= \"))*1,\"\"))","v":""},{"$f":"IFERROR((0.98*MID(R26,SEARCH(\"++\",R26)+2,99)-AF26+AA26),0)","v":26208}," 8979++29600","2019-11-11T21:11:47","ВИКТОРИЯ КОЛПАШНИКОВА","ПЕТРОПАВЛОВСК","7-705-101-86-45   0----   ----","Логин","ОТПРАВЛЕНО",28000,"",0,0,3611121,"2019-11-12","ОПЛАТИТЬ= 2800",2800,7522]
[0,"","","","","","","","","","","","","","","",4431," 8988++5950","2019-11-12T13:11:58","СЕВАСТЬЯНОВ АЛЕКСЕЙ ","АТЫРАУ","7-777-960-20-60   0----   ----","Логин","ОТПРАВЛЕНО",4800,"",0,0,3611122,"2019-11-12","ОПЛАТИТЬ= 1400",1400,13500]
[0,"","","","","","","","","","","","","","","",7520," 8989++9000","2019-11-12T14:11:35","ШЕРСТОВ ДМИТРИЙ","ПЕТРОПАВЛОВСК","7-705-309-00-80   0----   ----","Логин","ОТПРАВЛЕНО",7800,"",0,0,3611123,"2019-11-12","ОПЛАТИТЬ= 1300",1300,14676]
[0,"","","","","","","","","","","","","","","",11000,"+KASPI+ 8982++0","2019-11-11T21:11:06","КОХ ДМИТРИЙ ","ТЕМИРТАУ","7-747-376-19-01   0----   ----","Логин","ОТПРАВЛЕНО",11000,43794,12300,"KASPI",3611124,"2019-11-12","ОПЛАТИТЬ= 1300",1300,9041]
[0,"","","","","","","","","","","",{"$f":" IFERROR(INDIRECT(\"'\"&$B30&\"'!E2\"),\"\")","v":""},"","","",9800,"+KASPI+ 8980++0","2019-11-11T21:11:38","ЖОЛАКОВ ЧИНГИС","ПАВЛОДАР","7-707-863-02-60   8-747-198-32-19   0----","Логин","ОТПРАВЛЕНО",13000,43794,14000,"KASPI",3611125,"2019-11-13","ОПЛАТИТЬ= 4200",4200,34521]
[0,"","","","","","","","","","","","","","","",12865,"131119++14250","2019-11-14","ГУЛЬНУР РАХАТКЫЗЫ","Шымкент","8-775-330-02-36   0----   ----","Логин","ОТПРАВЛЕНО",12960,"",0,0,3611126,"2019-11-14","ОПЛАТИТЬ= 1100",1100,13104]
[0,"","","","","","","","","","","","","","","",22529,"131119_2++26050","2019-11-14","АШГАЛИЕВА ОКСАНА РУСТАМ УСМАНОВ","Атырау","8-701-766-92-54   0----   ----","Логин","ОТПРАВЛЕНО",24000,"",0,0,3611127,"2019-11-14","ОПЛАТИТЬ= 3000",3000,7522]
[0,"","","","","","","","","","","","","","","",1400,"+KASPI+ 8993++0","2019-11-14T13:11:21","КУЛЬЖАНОВ ГЫЛЫМ","НУР-СУЛТАН","7-701-500-34-54   0----   ----","Логин","ОТПРАВЛЕНО",1500,43794,2500,"KASPI",3611128,"2019-11-14","ОПЛАТИТЬ= 1100",1100,3943]
[0,"","","","","","","","","","","","","","","",9037,"151119++10650","2019-11-15","РОМАН ЛАРИЧЕВ","Актау","8-775-233-99-99   0----   ----","Логин","ОТПРАВЛЕНО",9400,"",0,0,3611130,"2019-11-15","ОПЛАТИТЬ= 1400",1400,17812]
[0,"","","","","","","","","","","","","","","",10115," 8994++11750","2019-11-14T16:11:26","НАТАЛЬЯ ЛАРИОНОВА","Усть-Каменогорск","7-705-500-76-80   0----   ----","Логин","ОТПРАВЛЕНО",10500,"",0,0,3611131,"2019-11-15","ОПЛАТИТЬ= 1400",1400,6342]
[0,"","","","","","","","","","","","","","","",6443,"3395432++9100","2019-11-14","АМИРХАН МУСАБЕКОВ МУСАБЕКОВ","Астана","7-707-741-70-20   0----   ----","Логин","ОТПРАВЛЕНО",7900,"",0,0,3611132,"2019-11-15","ОПЛАТИТЬ= 2475",2475,7032]
[0,"","","","","","","","","","","","","","","",-230,"+KASPI+ 8996++0",43783.79991898148,"ЛИ ЮЛИЯ","КАРАГАНДА","7-701-530-61-01   0----   ----","Логин","ОТПРАВЛЕНО",1920,43794,2920,"KASPI",3611133,"2019-11-15","ОПЛАТИТЬ= 3150",3150,628]
[0,"","","","","","","","","","","","","","","",14623," 9001++16350","2019-11-15T15:11:59","ИВАНОВ СЕРГЕЙ МИХАЙЛОВИЧ","УСТЬ-КАМЕНОГОРСК","8-705-527-45-83   8-705-527-45-83   ----","Логин","ОТПРАВЛЕНО",15000,"",0,0,3611134,"2019-11-15","ОПЛАТИТЬ= 1400",1400,8014]
[0,"","","","","","","","","","","","","","","",2075,"+KASPI+ 8997++0",43783.882916666669,"ЛАЗАРЕВ ГРИГОРИЙ","ТЕМИРТАУ","7-778-009-70-65   0----   ----","Логин","ОТПРАВЛЕНО",2800,43794,4100,"KASPI",3611135,"2019-11-16","ОПЛАТИТЬ= 2025",2025,15021]
[0,"","","","","","","","","","","","","","","",18055,"161119++19750","2019-11-16","АЛДОНГАРОВ Б.К.","Актау","8-777-057-68-86   0----   ----","Логин","ОТПРАВЛЕНО",17860,"",0,0,3611137,"2019-11-16","ОПЛАТИТЬ= 1300",1300,18008]
[0,"","","","","","","","","","","","","","","",21044,"161119_3++22800","2019-11-16","МЕРУЕРТ БАЙГУНАКОВА","УСТЬ-КАМЕНОГОРСК","7-775-903-80-99   0----   ----","Логин","ОТПРАВЛЕНО",21340,"",0,0,3611138,"2019-11-16","ОПЛАТИТЬ= 1300",1300,7522]
[0,"","","","","","","","","","","","","","","",4531," 9005++5950","2019-11-16T12:11:39","КУЗНЕЦОВА НАТАЛИ","Атырау","7-701-139-27-80   0----   ----","Логин","ОТПРАВЛЕНО",4800,"",0,0,3611139,"2019-11-16","ОПЛАТИТЬ= 1300",1300,7522]
[0,"","","","","","","","","","","","","","","",9337," 9002++10650","2019-11-15T18:11:36","ЧИНГИЗ СЕРАЛИЕВ","КЫЗЫЛОРДА","7-702-231-66-66   0----   ----","Логин","ОТПРАВЛЕНО",9400,"",0,0,3611140,"2019-11-16","ОПЛАТИТЬ= 1100",1100,7518]
[0,"","","","","","","","","","","","","","","",37702,"161119_4++39900","2019-11-16","ТУЛЕГОНОВА КУЛЬПАШ","Актау","8-701-413-30-30   ----   ----","Логин","ОТПРАВЛЕНО",37600,"",0,0,3611103,"2019-11-18","ОПЛАТИТЬ= 1400",1400,4533]
[0,"","","","","","","","","","","","","","","",16808," 9007++19600","2019-11-17T11:11:07","ЛОСЕВ ВИКТОР","КАРАГАНДА","7-708-330-70-32   0----   ----","Логин","ОТПРАВЛЕНО",18200,"",0,0,3611104,"2019-11-18","ОПЛАТИТЬ= 2400",2400,29131]
[0,"","","","","","","","","","","","","","","",21930," 9008++23500","2019-11-17T14:11:50","КЕНЖЕБАЕВ АЗАТ","НУР-СУЛТАН","7-707-346-02-60   0----   ----","Логин","ОТПРАВЛЕНО",22000,"",0,0,3611105,"2019-11-18","ОПЛАТИТЬ= 1100",1100,25995]
[0,"","","","","","","","","","","","","","","",7618,"181119++9100","2019-11-18","АЗАМАТ КАПТАГУЛОВ","Караганда","8-771-180-64-26   0----   ----","Логин","ОТПРАВЛЕНО",8200,"",0,0,3611106,"2019-11-18","ОПЛАТИТЬ= 1300",1300,7522]
[0,"","","","","","","","","","","","","","","",2500,"+KASPI+ 9013++0","2019-11-19T16:11:05","ЕРЛАН ТАГАЕВ","ТАРАЗ","7-701-300-02-76   8-726-245-29-00   0----","Логин","ОТПРАВЛЕНО",2600,43794,3600,"KASPI",3611144,"2019-11-19","ОПЛАТИТЬ= 1100",1100,37706]
[0,"","","","","","","","","","","","","","","",20975,"+СЧЁТ Альфа-Банк+Сч1511++0","2019-11-15","МАЛИК ВЛАНТИНА","Алматы","8-701-690-39-00   0----   ----","Логин","ОТПРАВЛЕНО",22000,43794,23000,"СЧЁТ Альфа-Банк",3611143,"2019-11-19","ОПЛАТИТЬ= 2025",2025,5707]
[0,"","","","","","","","","","","","","","","",27908," 9010++29600","2019-11-18T21:11:36","ПОДКОСОВ ЕВГЕНИЙ","АЛМАТЫ","7-707-318-19-99   0----   ----","Логин","ОТПРАВЛЕНО",28000,"",0,0,3611142,"2019-11-19","ОПЛАТИТЬ= 1100",1100,21193]
[0,"","","","","","","","","","","","","","","",12698,"201119++15100","2019-11-20","ТОЛМАШЕВ ДАНИЯР","караганда","8-702-645-88-24   0----   ----","Логин","ОТПРАВЛЕНО",13800,"",0,0,3611145,"2019-11-20","ОПЛАТИТЬ= 2100",2100,7083]
[0,"","","","","","","","","","","","","","","",6276," 9017++8700","2019-11-20T16:11:01","ГРИГОРЯН ЛЕВОН","АКТОБЕ","7-701-270-89-86   8-708-495-76-44   0----","Логин","ОТПРАВЛЕНО",7500,"",0,0,3611146,"2019-11-20","ОПЛАТИТЬ= 2250",2250,13012]
[0,"","","","","","","","","","","","","","","",10900,"+KASPI+211119++0",43790,"СТАХАНОВА МАРИЯ ","Алматы","7-705-223-60-10   0----   ----","Логин","ОТПРАВЛЕНО",10600,43794,11600,"KASPI",3611150,"2019-11-21","ОПЛАТИТЬ= 700",700,0]
[0,"","","","","","","","","","","","","","","",22379," 9018++23550","2019-11-21T11:11:01","ДУПЛИНСКИЙ СЕРГЕЙ","ТАЛДЫКОРГАН","7-705-954-21-44   0----   ----","Логин","ОТПРАВЛЕНО",22068,"",0,0,3611147,"2019-11-21","ОПЛАТИТЬ= 700",700,17322]
[{"$f":"IF(LEN(B55)>0,1,0)","v":0},"",{"$f":" IFERROR(INDIRECT(\"'\"&B55&\"'!B1\"),\"\")","v":""},{"$f":" IFERROR(INDIRECT(\"'\"&$B55&\"'!B3\"),\"\")","v":""},{"$f":" IFERROR(INDIRECT(\"'\"&$B55&\"'!B34\"),\"\")","v":""},{"$f":" IFERROR(INDIRECT(\"'\"&$B55&\"'!B4\"),\"\")","v":""},{"$f":" IFERROR(INDIRECT(\"'\"&$B55&\"'!K3\"),\"\")","v":""},{"$f":" IFERROR(INDIRECT(\"'\"&$B55&\"'!C1\"),\"\")","v":""},{"$f":" IFERROR(INDIRECT(\"'\"&$B55&\"'!F24\"),\"\")","v":""},{"$f":" IFERROR(INDIRECT(\"'\"&$B55&\"'!G6\"),\"\")","v":""},{"$f":" IFERROR(INDIRECT(\"'\"&$B55&\"'!I6\"),\"\")","v":""},{"$f":" IFERROR(INDIRECT(\"'\"&$B55&\"'!h6\"),\"\")","v":""},{"$f":" IFERROR(INDIRECT(\"'\"&$B55&\"'!E2\"),\"\")","v":""},{"$f":"IFERROR(IF(M55>0,INDIRECT(\"'\"&$B55&\"'!E1\"),\"\"),\"\")","v":""},{"$f":" IFERROR(INDIRECT(\"'\"&$B55&\"'!E4\"),\"\")","v":""},{"$f":"IF(LEFT(O55,8)=\"оплачено\",0,IF(LEFT(O55,8)=\"ОПЛАТИТЬ\",(ПоискСКонца(O55,\"= \"))*1,\"\"))","v":""},{"$f":"IFERROR((0.98*MID(R55,SEARCH(\"++\",R55)+2,99)-AF55+AA55),0)","v":43192},"211119_2++45400","2019-11-21","БАГЛАН СУЕНДИКОВ","Шымкент","8-777-604-78-43   8-701-355-19-58   ----","Логин","ОТПРАВЛЕНО",43200,"",0,0,3611148,"2019-11-21","ОПЛАТИТЬ= 1300",1300,-1200]
[{"$f":"IF(LEN(B56)>0,1,0)","v":0},"",{"$f":" IFERROR(INDIRECT(\"'\"&B56&\"'!B1\"),\"\")","v":""},{"$f":" IFERROR(INDIRECT(\"'\"&$B56&\"'!B3\"),\"\")","v":""},{"$f":" IFERROR(INDIRECT(\"'\"&$B56&\"'!B34\"),\"\")","v":""},{"$f":" IFERROR(INDIRECT(\"'\"&$B56&\"'!B4\"),\"\")","v":""},{"$f":" IFERROR(INDIRECT(\"'\"&$B56&\"'!K3\"),\"\")","v":""},{"$f":" IFERROR(INDIRECT(\"'\"&$B56&\"'!C1\"),\"\")","v":""},{"$f":" IFERROR(INDIRECT(\"'\"&$B56&\"'!F24\"),\"\")","v":""},{"$f":" IFERROR(INDIRECT(\"'\"&$B56&\"'!G6\"),\"\")","v":""},{"$f":" IFERROR(INDIRECT(\"'\"&$B56&\"'!I6\"),\"\")","v":""},{"$f":" IFERROR(INDIRECT(\"'\"&$B56&\"'!h6\"),\"\")","v":""},{"$f":" IFERROR(INDIRECT(\"'\"&$B56&\"'!E2\"),\"\")","v":""},{"$f":"IFERROR(IF(M56>0,INDIRECT(\"'\"&$B56&\"'!E1\"),\"\"),\"\")","v":""},{"$f":" IFERROR(INDIRECT(\"'\"&$B56&\"'!E4\"),\"\")","v":""},{"$f":"IF(LEFT(O56,8)=\"оплачено\",0,IF(LEFT(O56,8)=\"ОПЛАТИТЬ\",(ПоискСКонца(O56,\"= \"))*1,\"\"))","v":""},{"$f":"IFERROR((0.98*MID(R56,SEARCH(\"++\",R56)+2,99)-AF56+AA56),0)","v":9333},"211119_3++10850","2019-11-21","ВЛАДИМИР КУЗНЕЦОВ","Усть-Каменогорск","8-705-653-51-00   0----   ----","Логин","ОТПРАВЛЕНО",9600,"",0,0,3611149,"2019-11-21","ОПЛАТИТЬ= 1300",1300,-1200]
[0,"","","","","","","","","","","","","","","",3700,"+СЧЁТ Альфа-Банк+Сч2111++0","2019-11-21","РЕГРО «ХРИСТИАНСКИЙ ЦЕНТР СВИДЕТЕЛЕЙ ИЕГОВЫ»","Алматы","7-771-790-09-84   0----   ----","Логин","ОТПРАВЛЕНО",3800,43794,4800,"СЧЁТ Альфа-Банк",3611151,"2019-11-22","ОПЛАТИТЬ= 1100",1100,7224]
[{"$f":"IF(LEN(B58)>0,1,0)","v":0},"","","","","","","","","","","","","","","",14511,"211119_3++16950","2019-11-21","ФЕДОРОВ АНДРЕЙ","Актобе","8-701-566-04-90   0----   ----","Логин","ОТПРАВЛЕНО",15600,"",0,0,3611152,"2019-11-22","ОПЛАТИТЬ= 2100",2100,16832]
[0,"","","","","","","","","","","","","","","",15831,"221119++18450","2019-11-22","ГУЛЬНУР РАХАТКЫЗЫ","Шымкент","8-775-330-02-36   0----   ----","Логин","ОТПРАВЛЕНО",16740,"",0,0,3611153,"2019-11-22","ОПЛАТИТЬ= 2250",2250,10219]
[0,"","","","","","","","","","","","","","","",2895," 9019++5250",43791.424641203703,"КИМ АНТОН","НУР-СУЛТАН","7-701-727-73-53   0----   ----","Логин","ОТПРАВЛЕНО",4400,"",0,0,3611154,"2019-11-22","ОПЛАТИТЬ= 2250",2250,-1200]
[0,"","","","","","","","","","","","","","","",3512," 9022++5650","2019-11-22T14:11:56","КОЖАН РУСЛАН","АКТОБЕ","7-708-828-49-63   0----   ----","Логин","ОТПРАВЛЕНО",4800,"",0,0,3611155,"2019-11-22","ОПЛАТИТЬ= 2025",2025,-1100]
[0,"","","","","","","","","","","","","","","",3806,"231119++5950","2019-11-23","АЛЕКСАНДР МУХИН","Караганда","8-700-328-98-34   0----   ----","Логин","ОТПРАВЛЕНО",4800,"",0,0,3611157,"2019-11-23","ОПЛАТИТЬ= 2025",2025,1742]
[0,"","","","","","","","","","","","","","","",6540," 9023++8000","2019-11-22T19:11:32","ЛАРИОНОВА НАТАЛЬЯ","УСТЬ-КАМЕНОГОРСК","7-705-500-76-80   0----   ----","Логин","ОТПРАВЛЕНО",6820,"",0,0,3611156,"2019-11-23","ОПЛАТИТЬ= 1300",1300,-1200]
[0,"","","","","","","","","","","","","","","",37610," 6646++39500","2018-02-13T16:02:26","МЕНЬЖУКОВА ПОЛИНА ","ШЫМКЕНТ","7-747-467-11-60   ----   ----","Логин","ОТПРАВЛЕНО",36000,"",0,0,2428034,"2018-02-13","ОПЛАТИТЬ= 1100",1100,0]
[0,"","","","","","","","","","","","","","","",4139,"2239407++5550","2018-02-13","ДУМАН БЕКМАМБЕТОВ","Балхаш","8-775-530-34-01   0----   ----","Логин","ОТПРАВЛЕНО",4000,"",0,0,2428032,"2018-02-13","ОПЛАТИТЬ= 1300",1300,0]
[0,{"$f":" IFERROR(HYPERLINK( SUBSTITUTE(INDEX(ЛИСТЫ, ROW()), \"]\", \"]'\") & \"'!A1\",  INDEX(ЛИСТ.ИМЯ, ROW()) ),\"\")","v":""},"","","","","","","","","","","","","","",48560,"+СчётСб+Сч2601++0","2018-01-21","АО РТС ДЕКО","Алматы","8-701-743-96-86   8-727-258-84-22   1-614-0--","Логин","ОТПРАВЛЕНО",47160,43157,49860,"СчётСб",2428033,"2018-02-13","ОПЛАТИТЬ= 1300",1300,0]
[0,"","","","",{"$f":" IFERROR(INDIRECT(\"'\"&$B67&\"'!B4\"),\"\")","v":""},{"$f":" IFERROR(INDIRECT(\"'\"&$B67&\"'!K3\"),\"\")","v":""},{"$f":" IFERROR(INDIRECT(\"'\"&$B67&\"'!C1\"),\"\")","v":""},"",{"$f":" IFERROR(INDIRECT(\"'\"&$B67&\"'!G6\"),\"\")","v":""},{"$f":" IFERROR(INDIRECT(\"'\"&$B67&\"'!I6\"),\"\")","v":""},{"$f":" IFERROR(INDIRECT(\"'\"&$B67&\"'!h6\"),\"\")","v":""},{"$f":" IFERROR(INDIRECT(\"'\"&$B67&\"'!E2\"),\"\")","v":""},"",{"$f":" IFERROR(INDIRECT(\"'\"&$B67&\"'!E4\"),\"\")","v":""},"",14723,"130218++16350","2018-02-13","ЧУГУНКОВ ОЛЕГ","Усть-Каменогорск","8-777-201-11-07   8-747-558-63-88   ----","Логин","ОТПРАВЛЕНО",14000,"",0,0,2428022,"2018-02-13","ОПЛАТИТЬ= 1300",1300,0]
[{"$f":"IF(LEN(B68)>0,1,0)","v":0},"",{"$f":" IFERROR(INDIRECT(\"'\"&B68&\"'!B1\"),\"\")","v":""},{"$f":" IFERROR(INDIRECT(\"'\"&$B68&\"'!B3\"),\"\")","v":""},{"$f":" IFERROR(INDIRECT(\"'\"&$B68&\"'!B34\"),\"\")","v":""},"","","",{"$f":" IFERROR(INDIRECT(\"'\"&$B68&\"'!F24\"),\"\")","v":""},"","","","",{"$f":"IFERROR(IF(M68>0,INDIRECT(\"'\"&$B68&\"'!E1\"),\"\"),\"\")","v":""},"",{"$f":"IF(LEFT(O68,8)=\"оплачено\",0,IF(LEFT(O68,8)=\"ОПЛАТИТЬ\",(ПоискСКонца(O68,\"= \"))*1,\"\"))","v":""},{"$f":"IFERROR((0.98*MID(R68,SEARCH(\"++\",R68)+2,99)-AF68+AA68),0)","v":3845}," 6636++5250","2018-02-12T21:02:03","КОРГАШОВ БАХЫТ","АСТАНА","7-778-504-84-54   4-359-41--   ----","Логин","ОТПРАВЛЕНО",4000,"",0,0,2428023,"2018-02-13","ОПЛАТИТЬ= 1300",1300,0]
[0,"","","","","","","","","","","","","","","",8806," 6639++9700","2018-02-12T22:02:52","ПЕКНИЧ АЛЕКСАНДР","АСТАНА","7-701-748-25-00   ----   ----","Логин","ОТПРАВЛЕНО",8380,"",0,0,2428024,"2018-02-13","ОПЛАТИТЬ= 700",700,0]
[0,"","","","","","","","","","","","","","","",7910," 6635++9500","2018-02-12T21:02:33","ЯХЬЯЕВ ГАБИБУЛАХ","АКТАУ","7-747-674-66-32   ----   ----","Логин","ОТПРАВЛЕНО",8000,"",0,0,2428025,"2018-02-13","ОПЛАТИТЬ= 1400",1400,0]
[0,"","","","","","","","","","","","","","","",17369," 6642++19050","2018-02-13T11:02:18","ПИЛЮГИН ЕВГЕНИЙ","АЛМАТЫ","7-707-419-08-57   ----   ----","Логин","ОТПРАВЛЕНО",16650,"",0,0,2428026,"2018-02-13","ОПЛАТИТЬ= 1300",1300,0]
[0,"","","","","","","","","","","","","","","",11636," 6626++13200",43141.001608796294,"КУСТАЕВ ГАЛЫМЖАН АКЫЛБАЙУЛЫ","Жанаозен","7-702-433-60-28   8-776-190-80-97   ----","Логин","ОТПРАВЛЕНО",11500,"",0,0,2428027,"2018-02-13","ОПЛАТИТЬ= 1300",1300,65400]
[0,"","","","","","","","","","","","","","","",23884," 6608++25800","2018-02-08T10:02:05","МЕРИСТАН ГАМИДОВА","АКТАУ","7-701-375-46-93   0----   ----","Логин","ОТПРАВЛЕНО",23000,"",0,0,2428028,"2018-02-13","ОПЛАТИТЬ= 1400",1400,0]
[0,"","","","","","","","","","","","","","","",10392," 6634++12900","2018-02-12T16:02:32","МАЙЕР АЛЕКСАНДР ЭДУАРДОВИЧ","КАРАГАНДА","8-707-864-76-01   8----   ----","Логин","ОТПРАВЛЕНО",11500,"",0,0,2428029,"2018-02-13","ОПЛАТИТЬ= 2250",2250,34400]
[0,"","","","","","","","","","","","","","","",7893,"2238842++10350","2018-02-13","ЕВГЕНИЙ ХОХЛОВ","Щучинск","7-702-496-27-77   8-708-626-20-91   ----","Логин","ОТПРАВЛЕНО",8000,"",0,0,2428030,"2018-02-13","ОПЛАТИТЬ= 2250",2250,61700]
[0,"","","","","","","","","","","","","","","",7814,"130218_2++9300",43144,"ДОШАЕВ СЕЙФУЛЛА","Кульсары","8-778-171-60-31   8-702-248-41-26   ----","Логин","ОТПРАВЛЕНО",7000,"",0,0,2428031,"2018-02-13","ОПЛАТИТЬ= 1300",1300,0]
[0,"","","","","","","","","","","","","","","",3633," 6648++5850",43145.626493055555,"АЛИБЕКОВ САХИ","АКТАУ","7-701-566-92-11   4-131-610--   ----","Логин","ОТПРАВЛЕНО",4600,"",0,0,2428039,"2018-02-14","ОПЛАТИТЬ= 2100",2100,-3600]
[0,"","","","","","","","","","","","","","","",4437,"130218_4++5650","2018-02-13","ПАВЕЛ ОГАЙ","Астана","8-707-855-54-02   0----   ----","Логин","ОТПРАВЛЕНО",4400,"",0,0,2428035,"2018-02-14","ОПЛАТИТЬ= 1100",1100,-1200]
[0,"","","","","","","","","","","",{"$f":" IFERROR(INDIRECT(\"'\"&$B79&\"'!E2\"),\"\")","v":""},"","","",3745," 6647++5250","2018-02-14T10:02:59","СУИЕСИНОВ ТАЛГАТ","АТЫРАУ","7-771-507-79-35   ----   ----","Логин","ОТПРАВЛЕНО",4000,"",0,0,2428036,"2018-02-14","ОПЛАТИТЬ= 1400",1400,-2100]
[0,"","","","","","","","","","","","","","","",8400,"+Beeline+140218++0","2018-02-14","КАРАКУШИКОВА КУЛЯШ","Актау","8-701-370-41-03   8-701-559-71-77   ----","Логин","ОТПРАВЛЕНО",8000,43157,9500,"Beeline",2428037,"2018-02-14","ОПЛАТИТЬ= 1100",1100,-2100]
[0,"","","","","","","","","","","","","","","",14037," 6620++15650","2018-02-09T13:02:33","ДИГЛАРИС ЭЛАНА","ЖЕЗКАЗГАН","7-778-226-31-44   ----   ----","Логин","ОТПРАВЛЕНО",13900,"",0,0,2428038,"2018-02-14","ОПЛАТИТЬ= 1300",1300,79800]
[0,"","","","","","","","","","","","","","","",8700," 6657++10000","2018-02-15T15:02:53","КУРЛЫКОВ ВЯЧЕСЛАВ","КАРАГАНДА","7-701-538-35-37   ----   ----","Логин","ОТПРАВЛЕНО",8700,"",0,0,2428041,"2018-02-15","ОПЛАТИТЬ= 1100",1100,0]
[0,"","","","","","","","","","","","","","","",3604," 6656++4800","2018-02-15T14:02:36","КУРЛЫКОВ ВЯЧЕСЛАВ","КАРАГАНДА","7-701-538-35-37   ----   ----","Логин","ОТПРАВЛЕНО",3600,"",0,0,2428040,"2018-02-15","ОПЛАТИТЬ= 1100",1100,0]
[0,"","","","","","","","","","","","","","","",17000,"+Beeline+110218++0","2018-02-11","МАРАТ КАДАЙБЕРГЕНОВ","Щучинск","8-771-163-56-00   0----   ----","Логин","ОТПРАВЛЕНО",16000,43157,18100,"Beeline",2231206,"2018-02-15","ОПЛАТИТЬ= 1100",1100,0]
[0,"","","","","","","","","","","","","","","",5914," 6649++9300","2018-02-14T19:02:34","БОРИСОВА НАДЕЖДА ВАЛЕНТИНОВНА","УСТЬ-КАМЕНОГОРСК","8-777-411-75-79   8-708-695-73-61   ----","Логин","ОТПРАВЛЕНО",8000,"",0,0,2231207,"2018-02-15","ОПЛАТИТЬ= 3200",3200,0]
[0,"","","","","","","","","","","","","","","",4041,"2242685++5450","2018-02-15","АЛЕКСАНДР РОГОЗИН","Актау","7-708-632-50-98   8-701-283-12-38   ----","Логин","ОТПРАВЛЕНО",4000,"",0,0,2231208,"2018-02-15","ОПЛАТИТЬ= 1300",1300,0]
[0,"","","","","","","","","","","","","","","",7230," 6654++8500","2018-02-15T11:02:36","ИВАНОВ СЕРГЕЙ","АКТОБЕ","7-771-118-00-16   ----   ----","Логин","ОТПРАВЛЕНО",7200,"",0,0,2231209,"2018-02-15","ОПЛАТИТЬ= 1100",1100,0]
[0,"","","","","","","","","","","","","","","",6638," 6650++8100","2018-02-14T22:02:50","МОЛЯРЕВИЧ АНАТОЛИЙ","Алматы","7-702-956-83-00   ----   ----","Логин","ОТПРАВЛЕНО",6800,"",0,0,2231210,"2018-02-15","ОПЛАТИТЬ= 1300",1300,0]
[0,"","","","","","","","","","","","","","","",7814," 6660++9300","2018-02-15T17:02:16","ЮГАЙ ВИКТОРИЯ","КЫЗЫЛОРДА","7-705-166-82-48   0----   ----","Логин","ОТПРАВЛЕНО",8000,"",0,0,2231212,"2018-02-16","ОПЛАТИТЬ= 1300",1300,0]
[0,"","","","","","","","","","","","","","","",7994," 6643++10300","2018-02-13T11:02:22","ГРЕБЕНЮКОВА НАТАЛЬЯ","ЗЫРЯНОВСК","7-775-487-51-41   ----   ----","Логин","ОТПРАВЛЕНО",7960,"",0,0,2231213,"2018-02-16","ОПЛАТИТЬ= 2100",2100,0]
[0,"","","","","","","","","","","","","","","",6610,"160218++9500","2018-02-16","ПОПОВ ЮРИЙ","Актау","8-701-566-02-63   8-729-254-42-29   ----","Логин","ОТПРАВЛЕНО",8000,"",0,0,2231214,"2018-02-16","ОПЛАТИТЬ= 2700",2700,0]
[0,"","","","","","","","","","","","","","","",4445," 6662++5250","2018-02-15T19:02:05","РАХЫМБАЕВ ПЕРИЗАТ ","Кызылорда","7-775-575-03-45   ----   ----","Логин","ОТПРАВЛЕНО",4000,"",0,0,2231215,"2018-02-16","ОПЛАТИТЬ= 700",700,0]
[0,"","","","","","","","","","","","","","","",3800,"+Beeline+160218_2++0","2018-02-15","ОСПАН ЕРМУРАТ","Караганда","8-705-749-22-04   8-708-746-04-31   ----","Логин","ОТПРАВЛЕНО",4000,43157,5100,"Beeline",2231216,"2018-02-16","ОПЛАТИТЬ= 1300",1300,0]
[0,"","","","","","","","","","","","","","","",16932,"160218_3++18400","2018-02-16","АНДРЕЕВА АНГЕЛИНА","Шымкент","8-777-329-85-51   0----   ----","Логин","ОТПРАВЛЕНО",16000,"",0,0,2231217,"2018-02-16","ОПЛАТИТЬ= 1100",1100,0]
[0,"","","","","","","","","","","","","","","",-2025,"+0+160218_4++0","2018-02-13","ЧУГУНКОВ ОЛЕГ","Усть-Каменогорск","8-777-201-11-07   8-747-558-63-88   ----","Логин","ОТПРАВЛЕНО",0,1,0,0,2231218,"2018-02-16","ОПЛАТИТЬ= 2025",2025,0]
[0,"","","","","","","","","","","","","","","",7714," 6685++9300","2018-02-19T16:02:18","ТУРСЫНБАЕВА АЙГУЛЬ","АТЫРАУ","7-775-555-85-58   ----   ----","Логин","ОТПРАВЛЕНО",8000,"",0,0,2231229,"2018-02-19","ОПЛАТИТЬ= 1400",1400,0]
[0,"","","","","","","","","","","","","","","",708,"+Beeline+ 6681++0","2018-02-19T13:02:15","ГЛАДКОВ ИВАН","Караганда","7-700-310-85-34   8-701-255-63-38   0----","Логин","ОТПРАВЛЕНО",1108,43157,1808,"Beeline",2231226,"2018-02-19","ОПЛАТИТЬ= 1100",1100,0]
[0,"","","","","","","","","","","","","","","",7814," 6682++9300","2018-02-19T15:02:19","АЛЕКСАНДР ГОТФРИД","АКТОБЕ","7-705-158-28-53   8-713-256-34-72   ----","Логин","ОТПРАВЛЕНО",8000,"",0,0,2231227,"2018-02-19","ОПЛАТИТЬ= 1300",1300,0]
[0,"","","","","","","","","","","","","","","",7014," 6684++9300","2018-02-19T16:02:01","ГЛУХОВ ВИТАЛИЙ","АЛМАТЫ","7-707-170-21-70   8-747-808-52-74   ----","Логин","ОТПРАВЛЕНО",8000,"",0,0,2231228,"2018-02-19","ОПЛАТИТЬ= 2100",2100,-1100]
[0,"","","","","","","","","","","","","","","",11636,"190218_3++13200","2018-02-19","ЕРЛАН УШКЕМПЕРОВ","Капшагай","8-747-551-85-60   0----   ----","Логин","ОТПРАВЛЕНО",11500,"",0,0,2428042,"2018-02-19","ОПЛАТИТЬ= 1300",1300,-1400]
[0,"","","","","","","","","","","","","","","",17402,"190218_2++19900","2018-02-19","ЖУМАШЕВ ГАБИТ","Балхаш","8-775-264-00-09   8-777-487-94-84   8-778-479-92-94","Логин","ОТПРАВЛЕНО",18100,"",0,0,2231225,"2018-02-19","ОПЛАТИТЬ= 2100",2100,0]
[0,"","","","","","","","","","","","","","","",6843," 6666++10350","2018-02-16T18:02:43","ЕГОРОВА ЕЛЕНА ","СТЕПНОГОРСК","7-702-106-29-84   ----   ----","Логин","ОТПРАВЛЕНО",8000,"",0,0,2231219,"2018-02-19","ОПЛАТИТЬ= 3300",3300,0]
[0,"","","","","","","","","","","","","","","",26095," 6676++27750","2018-02-17T17:02:02","АМАНЖОЛОВА ЖАНИЯ","САТПАЕВ","7-777-181-54-01   ----   ----","Логин","ОТПРАВЛЕНО",25760,"",0,0,2231220,"2018-02-19","ОПЛАТИТЬ= 1100",1100,-1200]
[0,"","","","","","","","","","","","","","","",2200,"+Beeline+ 6613++0","2018-02-08T18:02:26","ТЕН НИНА","АКТАУ","7-702-525-99-53   0----   ----","Логин","ОТПРАВЛЕНО",3600,43157,4900,"Beeline",2231221,"2018-02-19","ОПЛАТИТЬ= 2700",2700,-1400]
[0,"","","","","","","","","","","","","","","",18625,"+Beeline+180218++0","2018-02-18","ДИНАРА КУАТАЛИЕВА","АТЫРАУ","7-775-599-06-17   7-775-599-06-17   ----","Логин","ОТПРАВЛЕНО",18000,43157,20025,"Beeline",2231222,"2018-02-19","ОПЛАТИТЬ= 1400",1400,0]
[0,"","","","","","","","","","","","","","","",25212,"190218++29400","2018-02-19","ГАННИБАЛ ОЛЕГ","Алматы","7-701-713-06-05   8-707-131-08-12   0----","Логин","ОТПРАВЛЕНО",27680,"",0,0,2231223,"2018-02-19","ОПЛАТИТЬ= 3600",3600,0]
[0,"","","","","","","","","","","","","","","",11666," 6680++14200","2018-02-18T23:02:58","КОРОЛЬКОВ ВИТАЛИЙ НИКОЛАЕВИЧ","ШЫМКЕНТ","7-701-270-73-54   ----   ----","Логин","ОТПРАВЛЕНО",12800,"",0,0,2231224,"2018-02-19","ОПЛАТИТЬ= 2250",2250,0]
[0,"","","","","","","","","","","","","","","",14049,"200218_4++17550","2018-02-20","НАУШАБАЕВ АМАНГЕЛЬДЫ","Актау","8-701-466-82-42   0----   ----","Логин","ОТПРАВЛЕНО",16000,"",0,0,2231230,"2018-02-20","ОПЛАТИТЬ= 3150",3150,-1100]
[0,"","","","","","","","","","","","","","","",23114," 6691++24300","2018-02-20T15:02:16","ДЮ ВЛАДИСЛАВ ИГОРЕВИЧ","КАРАГАНДА","8-707-516-60-36   8-701-516-60-36   ----","Логин","ОТПРАВЛЕНО",22500,"",0,0,2428048,"2018-02-20","ОПЛАТИТЬ= 700",700,-1200]
[0,"","","","","","","","","","","","","","","",23737,"200218++25650","2018-02-20","НЕСЕТПАЕВ ЕСЕНАЛИ","Алматы","8-771-487-81-51   8-707-353-01-40   ----","Логин","ОТПРАВЛЕНО",24000,"",0,0,2428043,"2018-02-20","ОПЛАТИТЬ= 1400",1400,-2100]
[0,"","","","","","","","","","","","","","","",7720," 6687++9000","2018-02-19T17:02:17","КУДЖОЯН ТАТЕВИК","Карабалык","7-705-234-96-81   ----   ----","Логин","ОТПРАВЛЕНО",7400,"",0,0,2428044,"2018-02-20","ОПЛАТИТЬ= 1100",1100,9043]
[0,"","","","","","","","","","","","","","","",7014,"200218_2++9300","2018-02-20","БОЛДАКОВ СЕРИК","Кызылорда","8-777-370-12-72   8-705-506-74-00   ----","Логин","ОТПРАВЛЕНО",8000,"",0,0,2428046,"2018-02-20","ОПЛАТИТЬ= 2100",2100,0]
[0,"","","","","","","","","","","","","","","",7014," 6688++9300","2018-02-19T18:02:22","АБСАДЫКОВ АЛМАТ ","Кызылорда","7-705-722-59-42   ----   ----","Логин","ОТПРАВЛЕНО",8000,"",0,0,2428046,"2018-02-20","ОПЛАТИТЬ= 2100",2100,0]
[0,"","","","","","","","","","","","","","","",20293,"200218_3++22850","2018-02-20","ГУЦОЛ СВЕТЛАНА","Сатпаев","8-705-301-12-35   0----   ----","Логин","ОТПРАВЛЕНО",21000,"",0,0,2428047,"2018-02-20","ОПЛАТИТЬ= 2100",2100,0]
[0,"","","","","","","","","","","","","","","",7714,"210218++9300","2018-02-20","МУКАЖАНОВА ГУЛЬНАЗ","Караганда","8-701-988-24-22   8-721-232-48-82   ----","Логин","ОТПРАВЛЕНО",8000,"",0,0,2231233,"2018-02-21","ОПЛАТИТЬ= 1400",1400,-4500]
[0,"","","","","","","","","","","","","","","",8200,"+Beeline+210218_2++0","2018-02-21","ОСПАН ЕРМУРАТ","Караганда","8-705-749-22-04   8-708-746-04-31   ----","Логин","ОТПРАВЛЕНО",8000,43157,9500,"Beeline",2231234,"2018-02-21","ОПЛАТИТЬ= 1300",1300,0]
[0,"","","","","","","","","","","","","","","",6109,"210218_3++8300","2018-02-21","ЖАНЫСБАЕВА АЙГУЛЬ","Актау","8-701-653-16-52   0----   ----","Логин","ОТПРАВЛЕНО",7000,"",0,0,2231235,"2018-02-21","ОПЛАТИТЬ= 2025",2025,16832]
[0,"","","","","","","","","","","","","","","",28983," 6696++32100","2018-02-21T13:02:40","ПИЛЮГИН ЕВГЕНИЙ","АЛМАТЫ","7-707-419-08-57   ----   ----","Логин","ОТПРАВЛЕНО",28980,"",0,0,2231236,"2018-02-21","ОПЛАТИТЬ= 2475",2475,5880]
[0,"","","","","","","","","","","","","","","",6005," 6692++7250","2018-02-20T16:02:31","ЗИМА НАТАЛЬЯ","ШЫМКЕНТ","7-707-060-32-70   ----   ----","Логин","ОТПРАВЛЕНО",6000,"",0,0,2231231,"2018-02-21","ОПЛАТИТЬ= 1100",1100,-70000]
[0,"","","","","","","","","","","","","","","",20750," 6695++22500","2018-02-21T10:02:36","ТУРГАНОВ АБДУЛЛА","Кызылорда","7-777-453-51-35   ----   ----","Логин","ОТПРАВЛЕНО",20000,"",0,0,2231232,"2018-02-21","ОПЛАТИТЬ= 1300",1300,0]
[0,"","","","","","","","","","","","","","","",83100,"+Beeline+090218_3++0","2018-02-09","РАВИЛЬ ХАМИТОВ","Атырау","7-775-355-13-09   8-701-551-96-70   ----","Логин","ОТПРАВЛЕНО",82800,43157,85200,"Beeline",2428049,"2018-02-22","ОПЛАТИТЬ= 2100",2100,0]
[0,"","","","","","","","","","","","","","","",-60,"+Beeline+ 6693++0","2018-02-20T21:02:11","ТУЯКБАЕВ ТЕНГИЗ","АЛМАТЫ","7-701-532-69-32   ----   ----","Логин","ОТПРАВЛЕНО",1090,43157,2190,"Beeline",2231240,"2018-02-22","ОПЛАТИТЬ= 2250",2250,74652]
[0,"","","","","","","","","","","","","","","",14735,"2257182++15750","2018-02-21","АННА ЗЕЛЕПУКИНА","Сатпаев","7-747-955-93-87   0----   ----","Логин","ОТПРАВЛЕНО",14000,"",0,0,2231239,"2018-02-22","ОПЛАТИТЬ= 700",700,0]
[0,"","","","","","","","","","","","","","","",16850,"+Beeline+210218_4++0","2018-02-21","ВОЙТЕНКО АЛЕКСАНДР","Актау","7-771-545-44-04   0----   ----","Логин","ОТПРАВЛЕНО",16000,43157,18250,"Beeline",2231238,"2018-02-22","ОПЛАТИТЬ= 1400",1400,0]
[0,"","","","","","","","","","","","","","","",-1300,"220218++0","2018-02-02","МУСАЕВ СУНАТТУЛЛА ЕРГАШОВИЧ","КЕНТАУ","8-707-737-72-72   8-708-327-17-27   8-777-106-29-92","Логин","ОТПРАВЛЕНО",0,"",0,0,2231237,"2018-02-22","ОПЛАТИТЬ= 1300",1300,2342.1999999999998]
[0,"","","","","","","","","","","","","","","",10607," 6721++12150","2018-02-23T15:02:51","ПИЛЮГИН ЕВГЕНИЙ","АЛМАТЫ","7-707-419-08-57   ----   ----","Логин","ОТПРАВЛЕНО",10800,"",0,0,2428057,"2018-02-23","ОПЛАТИТЬ= 1300",1300,2820]
[0,"","","","","","","","","","","","","","","",2895,"230218++5250","2018-02-23","ЕЛЕБАЕВ ЕРБОЛ","Актобе","8-705-630-64-25   0----   ----","Логин","ОТПРАВЛЕНО",4000,"",0,0,2428050,"2018-02-23","ОПЛАТИТЬ= 2250",2250,47996]
[0,"","","","","","","","","","","","","","","",5425," 6703++6250","2018-02-22T18:02:31","ВАЙЦЕХОВСКИЙ АЛЕКСЕЙ ","АТБАСАР","7-705-581-90-27   ----   ----","Логин","ОТПРАВЛЕНО",4000,"",0,0,2428051,"2018-02-23","ОПЛАТИТЬ= 700",700,0]
[0,"","","","","","","","","","","","","","","",6034,"2258966++8300","2018-02-22","АЖКЕНОВ КУАНЫШ\n","Тараз","7-777-783-64-00   0----   ----","Логин","ОТПРАВЛЕНО",7000,"",0,0,2428052,"2018-02-23","ОПЛАТИТЬ= 2100",2100,-1100]
[0,{"$f":" IFERROR(HYPERLINK( SUBSTITUTE(INDEX(ЛИСТЫ, ROW()), \"]\", \"]'\") & \"'!A1\",  INDEX(ЛИСТ.ИМЯ, ROW()) ),\"\")","v":""},"","","","","","","","","","","","","","",8108,"230218_3++9600","2018-02-23","КУРБАНОВ ДМИТРИЙ","Балхаш","8-771-274-53-41   8-775-374-92-73   ----","Логин","ОТПРАВЛЕНО",8000,"",0,0,2428053,"2018-02-23","ОПЛАТИТЬ= 1300",1300,0]
[0,"","","","",{"$f":" IFERROR(INDIRECT(\"'\"&$B131&\"'!B4\"),\"\")","v":""},{"$f":" IFERROR(INDIRECT(\"'\"&$B131&\"'!K3\"),\"\")","v":""},{"$f":" IFERROR(INDIRECT(\"'\"&$B131&\"'!C1\"),\"\")","v":""},"",{"$f":" IFERROR(INDIRECT(\"'\"&$B131&\"'!G6\"),\"\")","v":""},{"$f":" IFERROR(INDIRECT(\"'\"&$B131&\"'!I6\"),\"\")","v":""},{"$f":" IFERROR(INDIRECT(\"'\"&$B131&\"'!h6\"),\"\")","v":""},{"$f":" IFERROR(INDIRECT(\"'\"&$B131&\"'!E2\"),\"\")","v":""},"",{"$f":" IFERROR(INDIRECT(\"'\"&$B131&\"'!E4\"),\"\")","v":""},"",6295,"230218_4++7750","2018-02-23","ВАСИЛИЙ ЛИНКОВ","Астана","8-707-841-99-07   8-702-109-24-90   ----","Логин","ОТПРАВЛЕНО",6480,"",0,0,2428054,"2018-02-23","ОПЛАТИТЬ= 1300",1300,7720]
[{"$f":"IF(LEN(B132)>0,1,0)","v":0},"",{"$f":" IFERROR(INDIRECT(\"'\"&B132&\"'!B1\"),\"\")","v":""},{"$f":" IFERROR(INDIRECT(\"'\"&$B132&\"'!B3\"),\"\")","v":""},{"$f":" IFERROR(INDIRECT(\"'\"&$B132&\"'!B34\"),\"\")","v":""},"","","",{"$f":" IFERROR(INDIRECT(\"'\"&$B132&\"'!F24\"),\"\")","v":""},"","","","",{"$f":"IFERROR(IF(M132>0,INDIRECT(\"'\"&$B132&\"'!E1\"),\"\"),\"\")","v":""},"",{"$f":"IF(LEFT(O132,8)=\"оплачено\",0,IF(LEFT(O132,8)=\"ОПЛАТИТЬ\",(ПоискСКонца(O132,\"= \"))*1,\"\"))","v":""},{"$f":"IFERROR((0.98*MID(R132,SEARCH(\"++\",R132)+2,99)-AF132+AA132),0)","v":17010}," 6715++19500","2018-02-22T23:02:12","СЕМЕНЯК ИВАН","АЛМАТЫ","7-707-500-47-09   8-707-277-94-98   ----","Логин","ОТПРАВЛЕНО",18000,"",0,0,2428055,"2018-02-23","ОПЛАТИТЬ= 2100",2100,0]
[0,"","","","","","","","","","","","","","","",15932,"230218_5++18400","2018-02-23","САВЧЕНКО ИВАН","Павлодар","8-705-613-08-21   0----   ----","Логин","ОТПРАВЛЕНО",16000,"",0,0,2428056,"2018-02-23","ОПЛАТИТЬ= 2100",2100,0]
[0,"","","","","","","","","","","","","","","",2145,"230218_6++5250","2018-02-23","САКЕЕВ САБЫР","Актобе","8-771-049-05-70   8-701-049-05-70   ----","Логин","ОТПРАВЛЕНО",4000,"",0,0,2231241,"2018-02-24","ОПЛАТИТЬ= 3000",3000,0]
[0,"","","","","","","","","","","","","","","",7814,"230218_7++9300","2018-02-23","ХАМЗИНА УПАН","Астана","8-701-441-28-44   0----   ----","Логин","ОТПРАВЛЕНО",8000,"",0,0,2231242,"2018-02-24","ОПЛАТИТЬ= 1300",1300,0]
[0,"","","","","","","","","","","","","","","",7426,"2265328++8700","2018-02-26","БАЙГАБУЛОВ ЕРМЕК","Астана","7-705-760-15-81   8-705-130-03-35   ----","Логин","ОТПРАВЛЕНО",7400,"",0,0,2231248,"2018-02-26","ОПЛАТИТЬ= 1100",1100,6587]
[0,"","","","","","","","","","","","","","","",6109,"250218++8300","2018-02-25","ДЕНИС ГОРОДЕЛЬСКИЙ","Астана","8-776-148-90-65   8-705-550-31-43   ----","Логин","ОТПРАВЛЕНО",7000,"",0,0,2231243,"2018-02-26","ОПЛАТИТЬ= 2025",2025,0]
[0,"","","","","","","","","","","","","","","",8014," 6724++9300","2018-02-25T14:02:34","ПАДЕРИН ЕВГЕНИЙ","УСТЬ-КАМЕНОГОРСК","7-771-485-80-53   8-701-318-58-24   ----","Логин","ОТПРАВЛЕНО",8000,"",0,0,2231244,"2018-02-26","ОПЛАТИТЬ= 1100",1100,0]
[0,"","","","","","","","","","","","","","","",-1300,"260218++0","2018-02-26","МУСАЕВ СУНАТТУЛЛА ЕРГАШОВИЧ","КЕНТАУ","8-707-737-72-72   8-708-327-17-27   8-777-106-29-92","Логин","ОТПРАВЛЕНО",3450,"",0,0,2231245,"2018-02-26","ОПЛАТИТЬ= 1300",1300,0]
[0,"","","","","","","","","","","","","","","",10392," 6725++12900","2018-02-25T19:02:10","ПУШКАРСКИЙ ВИКТОР ВИКТОРОВИЧ","ПЕТРОПАВЛОВСК","7-777-271-30-76   ----   ----","Логин","ОТПРАВЛЕНО",11500,"",0,0,2231246,"2018-02-26","ОПЛАТИТЬ= 2250",2250,0]
[0,"","","","","","","","","","","","","","","",6403," 6726++8600","2018-02-26T09:02:03","БАЯЗИТОВА ЖУЛДЫЗ КАЙЫРЖАНОВНА ","БАЛХАШ","7-747-549-43-91   ----   ----","Логин","ОТПРАВЛЕНО",7000,"",0,0,2231247,"2018-02-26","ОПЛАТИТЬ= 2025",2025,0]
[0,"","","","","","","","","","","","","","","",27048,"191217_3++30100","2017-12-19","КАДИРОВ АБЛИКИН","Алматы","8-707-834-89-62   3-039-201--   ----","Логин","ОТПРАВЛЕНО",27000,"",0,0,2103273,"2017-12-20","ОПЛАТИТЬ= 2450",2450,0]
[0,"","","","","","","","","","","","","","","",4482,"201217++5900","2017-12-20","АБДУЛЛИНА ГУЛЬНАРА","Кызылорда","8-778-998-82-22   0----   ----","Логин","ОТПРАВЛЕНО",4480,"",0,0,2103274,"2017-12-20","ОПЛАТИТЬ= 1300",1300,0]
[0,"","","","","","","","","","","","","","","",2808,"+QIWI+2115677++0","2017-12-13","ВОРОНИН ОЛЕГ\n","Караганда","7-702-813-24-39   0----   ----","Логин","ОТПРАВЛЕНО",2808,43091,4108,"QIWI",2103275,"2017-12-20","ОПЛАТИТЬ= 1300",1300,0]
[0,"","","","","","","","","","","","","","","",11542," 6323++12900","2017-12-20T10:12:52","КОРОЛЬ МИХАИЛ","АЛМАТЫ","7-708-333-49-75   ----   ----","Логин","ОТПРАВЛЕНО",11500,"",0,0,2103276,"2017-12-20","ОПЛАТИТЬ= 1100",1100,0]
[0,"","","","","","","","","","","","","","","",13200,"+ККБ+201217_2++0",43089,"РЛСАЛДИН ЖАНДОС","Караганда","8-777-051-11-84   0----   ----","Логин","ОТПРАВЛЕНО",12600,43091,13900,"ККБ",2103277,"2017-12-20","ОПЛАТИТЬ= 700",700,0]
[0,"","","","","","","","","","","","","","","",7034," 6322++8300","2017-12-20T09:12:33","БУКАРЕВ ВИКТОР","АЛМАТЫ","7-707-655-58-32   8-701-720-43-81   ----","Логин","ОТПРАВЛЕНО",7000,"",0,0,2103278,"2017-12-20","ОПЛАТИТЬ= 1100",1100,0]
[0,"","","","","","","","","","","","","","","",6818,"201217_3++9100","2017-12-20","ДЕНИСК КАШКЕВИЧ","Щучинск","8-747-993-53-10   8-707-696-99-46   ----","Логин","ОТПРАВЛЕНО",6800,"",0,0,2103279,"2017-12-20","ОПЛАТИТЬ= 2100",2100,0]
[0,"","","","","","","","","","","","","","","",25925," 6333++28750","2017-12-20T12:12:46","МЕНЬЖУКОВА ПОЛИНА","ШЫМКЕНТ","7-747-467-11-60   ----   ----","Логин","ОТПРАВЛЕНО",25935,"",0,0,2103280,"2017-12-20","ОПЛАТИТЬ= 2250",2250,0]
[0,"","","","","","","","","","","","","","","",8010,"211217_4++9500",43090,"АЛИКУЛОВ ФАРХАД","Шымкент","8-777-252-48-18   0----   ----","Логин","ОТПРАВЛЕНО",8000,"",0,0,2231030,"2017-12-21","ОПЛАТИТЬ= 1300",1300,0]
[0,"","","","","","","","","","","","","","","",19731,"211217_3++22200","2017-12-21","ВИКТОР МИЛЕНТЬЕВ","Астана","8-701-353-42-58   0----   ----","Логин","ОТПРАВЛЕНО",19700,"",0,0,2231029,"2017-12-21","ОПЛАТИТЬ= 2025",2025,0]
[0,"","","","","","","","","","","","","","","",2500,"+ККБ+191217++0","2017-12-18","ПОЛОСОВА ЖАННА","Шымкент","8-777-380-92-22   0----   ----","Логин","ОТПРАВЛЕНО",2500,43091,3800,"ККБ",2231022,"2017-12-21","ОПЛАТИТЬ= 1300",1300,0]
[0,"","","","","","","","","","","","","","","",4000,"+QIWI+201217_5++0",43089,"ЕВГЕНИЯ СПОТАРЬ","Актау","8-777-630-04-98   0----   ----","Логин","ОТПРАВЛЕНО",4000,43091,5300,"QIWI",2231023,"2017-12-21","ОПЛАТИТЬ= 1300",1300,0]
[0,"","","","","","","","","","","","","","","",7800,"+ККБ+ 6290++0","2017-12-14T20:12:17","КАЗБЕКОВ АРМАН КАЗБЕКОВИЧ","Караганда","7-700-996-82-52   ----   ----","Логин","ОТПРАВЛЕНО",7000,43091,9100,"ККБ",2231025,"2017-12-21","ОПЛАТИТЬ= 1300",1300,0]
[0,"","","","","","","","","","","","","","","",16007," 6340++18400","2017-12-21T11:12:43","КАДИР АЛЬ ФАРАБИ","ШЫМКЕНТ","7-707-155-71-22   ----   ----","Логин","ОТПРАВЛЕНО",16000,"",0,0,2231026,"2017-12-21","ОПЛАТИТЬ= 2025",2025,0]
[0,"","","","","","","","","","","","","","","",7030," 6342++8500","2017-12-21T11:12:39","МАМЕДОВ АЛИМ НАДИРОВИЧ","АКТАУ","7-701-138-99-99   ----   ----","Логин","ОТПРАВЛЕНО",7000,"",0,0,2231027,"2017-12-21","ОПЛАТИТЬ= 1300",1300,0]
[0,"","","","","","","","","","","","","","","",35991,"211217_2++37950",43090,"БАГЛАН СУЕНДИКОВ","Шымкент","8-777-604-78-43   8-701-355-19-58   ----","Логин","ОТПРАВЛЕНО",36000,"",0,0,2231028,"2017-12-21","ОПЛАТИТЬ= 1200",1200,0]
[0,"","","","","","","","","","","","","","","",44029,"211217_5++46050","2017-12-21","АМАНТАЙ МУЛЬДЫР","Алматы","8-707-784-77-44   8-777-583-69-58   0----","Логин","ОТПРАВЛЕНО",44000,"",0,0,2103281,"2017-12-22","ОПЛАТИТЬ= 1100",1100,0]
[0,"","","","","","","","","","","","","","","",16001,"2131859++17450","2017-12-21","КУАНЫШ ДЮСЕМБЕКОВ","Караганда","7-778-108-25-82   0----   ----","Логин","ОТПРАВЛЕНО",16000,"",0,0,2103282,"2017-12-22","ОПЛАТИТЬ= 1100",1100,0]
[0,"","","","","","","","","","","","","","","",-1100," 6338++0","2017-12-21T11:12:44","БЕРСЕНЁВА ИННА","АЛМАТЫ","7-777-398-08-65   8-707-419-96-68   0----","Логин","ОТПРАВЛЕНО",1440,"",0,0,2103283,"2017-12-22","ОПЛАТИТЬ= 1100",1100,0]
[0,"","","","","","","","","","","","","","","",63462,"221217++66900","2017-12-22","ТАСИБЕКОВА ГУЛБАГДА КАНАЛБЕКОВНА\n","Шу","7-707-791-29-48   8-707-880-95-55   ----","Логин","ОТПРАВЛЕНО",63480,"",0,0,2103284,"2017-12-22","ОПЛАТИТЬ= 2100",2100,0]
[0,"","","","","","","","","","","","","","","",10509," 6345++12050","2017-12-21T23:12:16","МАРАТ АБДУРЕЙМОВ","АКТАУ","7-708-963-44-20   ----   ----","Логин","ОТПРАВЛЕНО",10500,"",0,0,2103285,"2017-12-22","ОПЛАТИТЬ= 1300",1300,0]
[0,"","","","","","","","","","","","","","","",19927," 6347++22400","2017-12-22T10:12:36","ЕВГЕНИЙ ПИЛЮГИН","АЛМАТЫ","7-707-419-08-57   ----   ----","Логин","ОТПРАВЛЕНО",19890,"",0,0,2103286,"2017-12-22","ОПЛАТИТЬ= 2025",2025,0]
[0,"","","","","","","","","","","","","","","",9043,"2132550++10350",43091,"ПОНОМАРЕНКО КОНСТАНТИН\n","Алматы","7-700-424-20-30   8-778-200-52-03   ----","Логин","ОТПРАВЛЕНО",9000,"",0,0,2103287,"2017-12-22","ОПЛАТИТЬ= 1100",1100,0]
[0,"","","","","","","","","","","","","","","",8010,"211216_5++9500","2016-12-21","САТПАЕВ ИСКАНДЕР","Шымкент","8-775-289-61-21   0----   ----","Логин","ОТПРАВЛЕНО",8000,"",0,0,1715713,"2016-12-22","ОПЛАТИТЬ= 1300",1300,0]
[0,"","","","","","","","","","","","","","","",11550,"+QIWI+211216_6++0","2016-12-21","НИКОЛАЙ ВАСИЛЬЕВ","Алматы","8-700-789-07-86   0----   ----","Логин","ОТПРАВЛЕНО",11260,42726,12650,"QIWI",1715712,"2016-12-22","ОПЛАТИТЬ= 1100",1100,0]
[0,"","","","","","","","","","","","","","","",1280,"+QIWI+ 4554++0","2016-12-21T15:12:33","ГУРЬЯНОВ ОЛЕГ","АЛМАТЫ","7-701-439-74-78   ----   ----","Логин","ОТПРАВЛЕНО",1280,42726,2380,"QIWI",1715715,"2016-12-22","ОПЛАТИТЬ= 1100",1100,0]
[0,"","","","","","","","","","","","","","","",21593,"221216++24100","2016-12-22","ВИКТОР МИЛЕНТЬЕВ","Астана","8-701-353-42-58   0----   ----","Логин","ОТПРАВЛЕНО",21600,"",0,0,1715711,"2016-12-22","ОПЛАТИТЬ= 2025",2025,0]
[0,"","","","","","","","","","","","","","","",8010,"221216_2++9500","2016-12-22","МИРМАН РАХИМЖАНОВ","Шымкент","8-778-229-56-86   0----   ----","Логин","ОТПРАВЛЕНО",8000,"",0,0,1715710,"2016-12-22","ОПЛАТИТЬ= 1300",1300,0]
[0,"","","","","","","","","","","","","","","",0,"","","","","","","","","","","","","","","",0]
[0,"","","","","","","","","","","","","","","",0,"","","","","","","","","","","","","","","",0]
[0,"","","","","","","","","","","","","","","",0,"","","","","","","","","","","","","","","",0]
[0,"","","","","","","","","","","","","","","",0,"","","","","","","","","","","","","","","",0]
[0,"","","","","","","","","","","","","","","",0,"","","","","","","","","","","","","","","",0]
[0,"","","","","","","","","","","","","","","",0,"","","","","","","","","","","","","","","",0]
[0,"","","","","","","","","","","","","","","",0,"","","","","","","","","","","","","","","",0]
[0,"","","","","","","","","","","","","","","",0,"","","","","","","","","","","","","","","",0]
[0,"","","","","","","","","","","","","","","",0,"","","","","","","","","","","","","","","",0]
[0,"","","","","","","","","","","","","","","",0,"","","","","","","","","","","","","","","",0]
[0,"","","","","","","","","","","","","","","",0,"","","","","","","","","","","","","","","",0]
[0,"","","","","","","","","","","","","","","",0,"","","","","","","","","","","","","","","",0]
[0,"","","","","","","","","","","","","","","",0,"","","","","","","","","","","","","","","",0]
[0,"","","","","","","","","","","","","","","",0,"","","","","","","","","","","","","","","",0]
[0,"","","","","","","","","","","","","","","",0,"","","","","","","","","","","","","","","",0]
[0,"","","","","","","","","","","","","","","",0,"","","","","","","","","","","","","","","",0]
[0,"","","","","","","","","","","","","","","",0,"","","","","","","","","","","","","","","",0]
[0,"","","","","","","","","","","","","","","",0,"","","","","","","","","","","","","","","",0]
[0,"","","","","","","","","","","","","","","",0,"","","","","","","","","","","","","","","",0]
[0,"","","","","","","","","","","","","","","",0,"","","","","","","","","","","","","","","",0]
[0,"","","","","","","","","","","","","","","",0,"","","","","","","","","","","","","","","",0]
[0,"","","","","","","","","","","","","","","",0,"","","","","","","","","","","","","","","",0]
[0,"","","","","","","","","","","","","","","",0,"","","","","","","","","","","","","","","",0]
[0,"","","","","","","","","","","","","","","",0,"","","","","","","","","","","","","","","",0]
[0,{"$f":" IFERROR(HYPERLINK( SUBSTITUTE(INDEX(ЛИСТЫ, ROW()), \"]\", \"]'\") & \"'!A1\",  INDEX(ЛИСТ.ИМЯ, ROW()) ),\"\")","v":""},"","","","","","","","","","","","","","",0,"","","","","","","","","","","","","","","",0]
[0,"","","","",{"$f":" IFERROR(INDIRECT(\"'\"&$B195&\"'!B4\"),\"\")","v":""},{"$f":" IFERROR(INDIRECT(\"'\"&$B195&\"'!K3\"),\"\")","v":""},{"$f":" IFERROR(INDIRECT(\"'\"&$B195&\"'!C1\"),\"\")","v":""},"",{"$f":" IFERROR(INDIRECT(\"'\"&$B195&\"'!G6\"),\"\")","v":""},{"$f":" IFERROR(INDIRECT(\"'\"&$B195&\"'!I6\"),\"\")","v":""},{"$f":" IFERROR(INDIRECT(\"'\"&$B195&\"'!h6\"),\"\")","v":""},{"$f":" IFERROR(INDIRECT(\"'\"&$B195&\"'!E2\"),\"\")","v":""},"",{"$f":" IFERROR(INDIRECT(\"'\"&$B195&\"'!E4\"),\"\")","v":""},"",0,"","","","","","","","","","","","","","","",0]
[{"$f":"IF(LEN(B196)>0,1,0)","v":0},"",{"$f":" IFERROR(INDIRECT(\"'\"&B196&\"'!B1\"),\"\")","v":""},{"$f":" IFERROR(INDIRECT(\"'\"&$B196&\"'!B3\"),\"\")","v":""},{"$f":" IFERROR(INDIRECT(\"'\"&$B196&\"'!B34\"),\"\")","v":""},"","","",{"$f":" IFERROR(INDIRECT(\"'\"&$B196&\"'!F24\"),\"\")","v":""},"","","","",{"$f":"IFERROR(IF(M196>0,INDIRECT(\"'\"&$B196&\"'!E1\"),\"\"),\"\")","v":""},"",{"$f":"IF(LEFT(O196,8)=\"оплачено\",0,IF(LEFT(O196,8)=\"ОПЛАТИТЬ\",(ПоискСКонца(O196,\"= \"))*1,\"\"))","v":""},{"$f":"IFERROR((0.98*MID(R196,SEARCH(\"++\",R196)+2,99)-AF196+AA196),0)","v":0},"","","","","","","","","","","","","","","",0]
[0,"","","","","","","","","","","","","","","",0,"","","","","","","","","","","","","","","",0]
[0,"","","","","","","","","","","","","","","",0,"","","","","","","","","","","","","","","",0]
[0,"","","","","","","","","","","","","","","",0,"","","","","","","","","","","","","","","",0]
[0,"","","","","","","","","","","","","","","",0,"","","","","","","","","","","","","","","",0]
[0,"","","","","","","","","","","","","","","",0,"","","","","","","","","","","","","","","",0]
[0,"","","","","","","","","","","","","","","",0,"","","","","","","","","","","","","","","",0]
[0,"","","","","","","","","","","","","","","",0,"","","","","","","","","","","","","","","",0]
[0,"","","","","","","","","","","","","","","",0,"","","","","","","","","","","","","","","",0]
[0,"","","","","","","","","","","","","","","",0,"","","","","","","","","","","","","","","",0]
[0,"","","","","","","","","","","","","","","",0,"","","","","","","","","","","","","","","",0]
[0,"","","","","","","","","","","","","","","",0,"","","","","","","","","","","","","","","",0]
[0,"","","","","","","","","","","","","","","",0,"","","","","","","","","","","","","","","",0]
[0,"","","","","","","","","","","","","","","",0,"","","","","","","","","","","","","","","",0]
[0,"","","","","","","","","","","","","","","",0,"","","","","","","","","","","","","","","",0]
[0,"","","","","","","","","","","","","","","",0,"","","","","","","","","","","","","","","",0]
[0,"","","","","","","","","","","","","","","",0,"","","","","","","","","","","","","","","",0]
[0,"","","","","","","","","","","","","","","",0,"","","","","","","","","","","","","","","",0]
[0,"","","","","","","","","","","","","","","",0,"","","","","","","","","","","","","","","",0]
[0,"","","","","","","","","","","","","","","",0,"","","","","","","","","","","","","","","",0]
[0,"","","","","","","","","","","","","","","",0,"","","","","","","","","","","","","","","",0]
[0,"","","","","","","","","","","","","","","",0,"","","","","","","","","","","","","","","",0]
[0,"","","","","","","","","","","","","","","",0,"","","","","","","","","","","","","","","",0]
[0,"","","","","","","","","","","","","","","",0,"","","","","","","","","","","","","","","",0]
[0,"","","","","","","","","","","","","","","",0,"","","","","","","","","","","","","","","",0]
[0,"","","","","","","","","","","","","","","",0,"","","","","","","","","","","","","","","",0]
[0,"","","","","","","","","","","","","","","",0,"","","","","","","","","","","","","","","",0]
[0,"","","","","","","","","","","","","","","",0,"","","","","","","","","","","","","","","",0]
[0,"","","","","","","","","","","","","","","",0,"","","","","","","","","","","","","","","",0]
[0,"","","","","","","","","","","","","","","",0,"","","","","","","","","","","","","","","",0]
[0,"","","","","","","","","","","","","","","",0,"","","","","","","","","","","","","","","",0]
[0,"","","","","","","","","","","","","","","",0,"","","","","","","","","","","","","","","",0]
[0,"","","","","","","","","","","","","","","",0,"","","","","","","","","","","","","","","",0]
[0,"","","","","","","","","","","","","","","",0,"","","","","","","","","","","","","","","",0]
[0,"","","","","","","","","","","","","","","",0,"","","","","","","","","","","","","","","",0]
[0,"","","","","","","","","","","","","","","",0,"","","","","","","","","","","","","","","",0]
[0,"","","","","","","","","","","","","","","",0,"","","","","","","","","","","","","","","",0]
[0,"","","","","","","","","","","","","","","",0,"","","","","","","","","","","","","","","",0]
[0,"","","","","","","","","","","","","","","",0,"","","","","","","","","","","","","","","",0]
[0,"","","","","","","","","","","","","","","",0,"","","","","","","","","","","","","","","",0]
[0,"","","","","","","","","","","","","","","",0,"","","","","","","","","","","","","","","",0]
[0,"","","","","","","","","","","","","","","",0,"","","","","","","","","","","","","","","",0]
[0,"","","","","","","","","","","","","","","",0,"","","","","","","","","","","","","","","",0]
[0,"","","","","","","","","","","","","","","",0,"","","","","","","","","","","","","","","",0]
[0,"","","","","","","","","","","","","","","",0,"","","","","","","","","","","","","","","",0]
[0,"","","","","","","","","","","","","","","",0,"","","","","","","","","","","","","","","",0]
[0,"","","","","","","","","","","","","","","",0,"","","","","","","","","","","","","","","",0]
[0,"","","","","","","","","","","","","","","",0,"","","","","","","","","","","","","","","",0]
[0,"","","","","","","","","","","","","","","",0,"","","","","","","","","","","","","","","",0]
[0,"","","","","","","","","","","","","","","",0,"","","","","","","","","","","","","","","",0]
[0,"","","","","","","","","","","","","","","",0,"","","","","","","","","","","","","","","",0]
[0,"","","","","","","","","","","","","","","",0,"","","","","","","","","","","","","","","",0]
[0,"","","","","","","","","","","","","","","",0,"","","","","","","","","","","","","","","",0]
[0,"","","","","","","","","","","","","","","",0,"","","","","","","","","","","","","","","",0]
[0,"","","","","","","","","","","","","","","",0,"","","","","","","","","","","","","","","",0]
[0,"","","","","","","","","","","","","","","",0,"","","","","","","","","","","","","","","",0]
[0,"","","","","","","","","","","","","","","",0,"","","","","","","","","","","","","","","",0]
[0,"","","","","","","","","","","","","","","",0,"","","","","","","","","","","","","","","",0]
[0,"","","","","","","","","","","","","","","",0,"","","","","","","","","","","","","","","",0]
[0,"","","","","","","","","","","","","","","",0,"","","","","","","","","","","","","","","",0]
[0,"","","","","","","","","","","","","","","",0,"","","","","","","","","","","","","","","",0]
[0,"","","","","","","","","","","","","","","",0,"","","","","","","","","","","","","","","",0]
[0,{"$f":" IFERROR(HYPERLINK( SUBSTITUTE(INDEX(ЛИСТЫ, ROW()), \"]\", \"]'\") & \"'!A1\",  INDEX(ЛИСТ.ИМЯ, ROW()) ),\"\")","v":""},"","","","","","","","","","","","","","",0,"","","","","","","","","","","","","","","",0]
[0,"","","","",{"$f":" IFERROR(INDIRECT(\"'\"&$B259&\"'!B4\"),\"\")","v":""},{"$f":" IFERROR(INDIRECT(\"'\"&$B259&\"'!K3\"),\"\")","v":""},{"$f":" IFERROR(INDIRECT(\"'\"&$B259&\"'!C1\"),\"\")","v":""},"",{"$f":" IFERROR(INDIRECT(\"'\"&$B259&\"'!G6\"),\"\")","v":""},{"$f":" IFERROR(INDIRECT(\"'\"&$B259&\"'!I6\"),\"\")","v":""},{"$f":" IFERROR(INDIRECT(\"'\"&$B259&\"'!h6\"),\"\")","v":""},{"$f":" IFERROR(INDIRECT(\"'\"&$B259&\"'!E2\"),\"\")","v":""},"",{"$f":" IFERROR(INDIRECT(\"'\"&$B259&\"'!E4\"),\"\")","v":""},"",0,"","","","","","","","","","","","","","","",0]
[{"$f":"IF(LEN(B260)>0,1,0)","v":0},"",{"$f":" IFERROR(INDIRECT(\"'\"&B260&\"'!B1\"),\"\")","v":""},{"$f":" IFERROR(INDIRECT(\"'\"&$B260&\"'!B3\"),\"\")","v":""},{"$f":" IFERROR(INDIRECT(\"'\"&$B260&\"'!B34\"),\"\")","v":""},"","","",{"$f":" IFERROR(INDIRECT(\"'\"&$B260&\"'!F24\"),\"\")","v":""},"","","","",{"$f":"IFERROR(IF(M260>0,INDIRECT(\"'\"&$B260&\"'!E1\"),\"\"),\"\")","v":""},"",{"$f":"IF(LEFT(O260,8)=\"оплачено\",0,IF(LEFT(O260,8)=\"ОПЛАТИТЬ\",(ПоискСКонца(O260,\"= \"))*1,\"\"))","v":""},{"$f":"IFERROR((0.98*MID(R260,SEARCH(\"++\",R260)+2,99)-AF260+AA260),0)","v":0},"","","","","","","","","","","","","","","",0]
[0,"","","","","","","","","","","","","","","",0,"","","","","","","","","","","","","","","",0]
[0,"","","","","","","","","","","","","","","",0,"","","","","","","","","","","","","","","",0]
[0,"","","","","","","","","","","","","","","",0,"","","","","","","","","","","","","","","",0]
[0,"","","","","","","","","","","","","","","",0,"","","","","","","","","","","","","","","",0]
[0,"","","","","","","","","","","","","","","",0,"","","","","","","","","","","","","","","",0]
[0,"","","","","","","","","","","","","","","",0,"","","","","","","","","","","","","","","",0]
[0,"","","","","","","","","","","","","","","",0,"","","","","","","","","","","","","","","",0]
[0,"","","","","","","","","","","","","","","",0,"","","","","","","","","","","","","","","",0]
[0,"","","","","","","","","","","","","","","",0,"","","","","","","","","","","","","","","",0]
[0,"","","","","","","","","","","","","","","",0,"","","","","","","","","","","","","","","",0]
[0,"","","","","","","","","","","","","","","",0,"","","","","","","","","","","","","","","",0]
[0,"","","","","","","","","","","","","","","",0,"","","","","","","","","","","","","","","",0]
[0,"","","","","","","","","","","","","","","",0,"","","","","","","","","","","","","","","",0]
[0,"","","","","","","","","","","","","","","",0,"","","","","","","","","","","","","","","",0]
[0,"","","","","","","","","","","","","","","",0,"","","","","","","","","","","","","","","",0]
[0,"","","","","","","","","","","","","","","",0,"","","","","","","","","","","","","","","",0]
[0,"","","","","","","","","","","","","","","",0,"","","","","","","","","","","","","","","",0]
[0,"","","","","","","","","","","","","","","",0,"","","","","","","","","","","","","","","",0]
[0,"","","","","","","","","","","","","","","",0,"","","","","","","","","","","","","","","",0]
[0,"","","","","","","","","","","","","","","",0,"","","","","","","","","","","","","","","",0]
[0,"","","","","","","","","","","","","","","",0,"","","","","","","","","","","","","","","",0]
[0,"","","","","","","","","","","","","","","",0,"","","","","","","","","","","","","","","",0]
[0,"","","","","","","","","","","","","","","",0,"","","","","","","","","","","","","","","",0]
[0,"","","","","","","","","","","","","","","",0,"","","","","","","","","","","","","","","",0]
[0,"","","","","","","","","","","","","","","",0,"","","","","","","","","","","","","","","",0]
[0,"","","","","","","","","","","","","","","",0,"","","","","","","","","","","","","","","",0]
[0,"","","","","","","","","","","","","","","",0,"","","","","","","","","","","","","","","",0]
[0,"","","","","","","","","","","","","","","",0,"","","","","","","","","","","","","","","",0]
[0,"","","","","","","","","","","","","","","",0,"","","","","","","","","","","","","","","",0]
[0,"","","","","","","","","","","","","","","",0,"","","","","","","","","","","","","","","",0]
[0,"","","","","","","","","","","","","","","",0,"","","","","","","","","","","","","","","",0]
[0,"","","","","","","","","","","","","","","",0,"","","","","","","","","","","","","","","",0]
[0,"","","","","","","","","","","","","","","",0,"","","","","","","","","","","","","","","",0]
[0,"","","","","","","","","","","","","","","",0,"","","","","","","","","","","","","","","",0]
[0,"","","","","","","","","","","","","","","",0,"","","","","","","","","","","","","","","",0]
[0,"","","","","","","","","","","","","","","",0,"","","","","","","","","","","","","","","",0]
[0,"","","","","","","","","","","","","","","",0,"","","","","","","","","","","","","","","",0]
[0,"","","","","","","","","","","","","","","",0,"","","","","","","","","","","","","","","",0]
[0,"","","","","","","","","","","","","","","",0,"","","","","","","","","","","","","","","",0]
[0,"","","","","","","","","","","","","","","",0,"","","","","","","","","","","","","","","",0]
[0,"","","","","","","","","","","","","","","",0,"","","","","","","","","","","","","","","",0]
[0,"","","","","","","","","","","","","","","",0,"","","","","","","","","","","","","","","",0]
[0,"","","","","","","","","","","","","","","",0,"","","","","","","","","","","","","","","",0]
[0,"","","","","","","","","","","","","","","",0,"","","","","","","","","","","","","","","",0]
[0,"","","","","","","","","","","","","","","",0,"","","","","","","","","","","","","","","",0]
[0,"","","","","","","","","","","","","","","",0,"","","","","","","","","","","","","","","",0]
[0,"","","","","","","","","","","","","","","",0,"","","","","","","","","","","","","","","",0]
[0,"","","","","","","","","","","","","","","",0,"","","","","","","","","","","","","","","",0]
[0,"","","","","","","","","","","","","","","",0,"","","","","","","","","","","","","","","",0]
[0,"","","","","","","","","","","","","","","",0,"","","","","","","","","","","","","","","",0]
[0,"","","","","","","","","","","","","","","",0,"","","","","","","","","","","","","","","",0]
[0,"","","","","","","","","","","","","","","",0,"","","","","","","","","","","","","","","",0]
[0,"","","","","","","","","","","","","","","",0,"","","","","","","","","","","","","","","",0]
[0,"","","","","","","","","","","","","","","",0,"","","","","","","","","","","","","","","",0]
[0,"","","","","","","","","","","","","","","",0,"","","","","","","","","","","","","","","",0]
[0,"","","","","","","","","","","","","","","",0,"","","","","","","","","","","","","","","",0]
[0,"","","","","","","","","","","","","","","",0,"","","","","","","","","","","","","","","",0]
[0,"","","","","","","","","","","","","","","",0,"","","","","","","","","","","","","","","",0]
[0,"","","","","","","","","","","","","","","",0,"","","","","","","","","","","","","","","",0]
[0,"","","","","","","","","","","","","","","",0,"","","","","","","","","","","","","","","",0]
[0,"","","","","","","","","","","","","","","",0,"","","","","","","","","","","","","","","",0]
[0,{"$f":" IFERROR(HYPERLINK( SUBSTITUTE(INDEX(ЛИСТЫ, ROW()), \"]\", \"]'\") & \"'!A1\",  INDEX(ЛИСТ.ИМЯ, ROW()) ),\"\")","v":""},"","","","","","","","","","","","","","",0,"","","","","","","","","","","","","","","",0]
[0,"","","","",{"$f":" IFERROR(INDIRECT(\"'\"&$B323&\"'!B4\"),\"\")","v":""},{"$f":" IFERROR(INDIRECT(\"'\"&$B323&\"'!K3\"),\"\")","v":""},{"$f":" IFERROR(INDIRECT(\"'\"&$B323&\"'!C1\"),\"\")","v":""},"",{"$f":" IFERROR(INDIRECT(\"'\"&$B323&\"'!G6\"),\"\")","v":""},{"$f":" IFERROR(INDIRECT(\"'\"&$B323&\"'!I6\"),\"\")","v":""},{"$f":" IFERROR(INDIRECT(\"'\"&$B323&\"'!h6\"),\"\")","v":""},{"$f":" IFERROR(INDIRECT(\"'\"&$B323&\"'!E2\"),\"\")","v":""},"",{"$f":" IFERROR(INDIRECT(\"'\"&$B323&\"'!E4\"),\"\")","v":""},"",0,"","","","","","","","","","","","","","","",0]
[{"$f":"IF(LEN(B324)>0,1,0)","v":0},"",{"$f":" IFERROR(INDIRECT(\"'\"&B324&\"'!B1\"),\"\")","v":""},{"$f":" IFERROR(INDIRECT(\"'\"&$B324&\"'!B3\"),\"\")","v":""},{"$f":" IFERROR(INDIRECT(\"'\"&$B324&\"'!B34\"),\"\")","v":""},"","","",{"$f":" IFERROR(INDIRECT(\"'\"&$B324&\"'!F24\"),\"\")","v":""},"","","","",{"$f":"IFERROR(IF(M324>0,INDIRECT(\"'\"&$B324&\"'!E1\"),\"\"),\"\")","v":""},"",{"$f":"IF(LEFT(O324,8)=\"оплачено\",0,IF(LEFT(O324,8)=\"ОПЛАТИТЬ\",(ПоискСКонца(O324,\"= \"))*1,\"\"))","v":""},{"$f":"IFERROR((0.98*MID(R324,SEARCH(\"++\",R324)+2,99)-AF324+AA324),0)","v":0},"","","","","","","","","","","","","","","",0]
[0,"","","","","","","","","","","","","","","",0,"","","","","","","","","","","","","","","",0]
[0,"","","","","","","","","","","","","","","",0,"","","","","","","","","","","","","","","",0]
[0,"","","","","","","","","","","","","","","",0,"","","","","","","","","","","","","","","",0]
[0,"","","","","","","","","","","","","","","",0,"","","","","","","","","","","","","","","",0]
[0,"","","","","","","","","","","","","","","",0,"","","","","","","","","","","","","","","",0]
[0,"","","","","","","","","","","","","","","",0,"","","","","","","","","","","","","","","",0]
[0,"","","","","","","","","","","","","","","",0,"","","","","","","","","","","","","","","",0]
[0,"","","","","","","","","","","","","","","",0,"","","","","","","","","","","","","","","",0]
[0,"","","","","","","","","","","","","","","",0,"","","","","","","","","","","","","","","",0]
[0,"","","","","","","","","","","","","","","",0,"","","","","","","","","","","","","","","",0]
[0,"","","","","","","","","","","","","","","",0,"","","","","","","","","","","","","","","",0]
[0,"","","","","","","","","","","","","","","",0,"","","","","","","","","","","","","","","",0]
[0,"","","","","","","","","","","","","","","",0,"","","","","","","","","","","","","","","",0]
[0,"","","","","","","","","","","","","","","",0,"","","","","","","","","","","","","","","",0]
[0,"","","","","","","","","","","","","","","",0,"","","","","","","","","","","","","","","",0]
[0,"","","","","","","","","","","","","","","",0,"","","","","","","","","","","","","","","",0]
[0,"","","","","","","","","","","","","","","",0,"","","","","","","","","","","","","","","",0]
[0,"","","","","","","","","","","","","","","",0,"","","","","","","","","","","","","","","",0]
[0,"","","","","","","","","","","","","","","",0,"","","","","","","","","","","","","","","",0]
[0,"","","","","","","","","","","","","","","",0,"","","","","","","","","","","","","","","",0]
[0,"","","","","","","","","","","","","","","",0,"","","","","","","","","","","","","","","",0]
[0,"","","","","","","","","","","","","","","",0,"","","","","","","","","","","","","","","",0]
[0,"","","","","","","","","","","","","","","",0,"","","","","","","","","","","","","","","",0]
[0,"","","","","","","","","","","","","","","",0,"","","","","","","","","","","","","","","",0]
[0,"","","","","","","","","","","","","","","",0,"","","","","","","","","","","","","","","",0]
[0,"","","","","","","","","","","","","","","",0,"","","","","","","","","","","","","","","",0]
[0,"","","","","","","","","","","","","","","",0,"","","","","","","","","","","","","","","",0]
[0,"","","","","","","","","","","","","","","",0,"","","","","","","","","","","","","","","",0]
[0,"","","","","","","","","","","","","","","",0,"","","","","","","","","","","","","","","",0]
[0,"","","","","","","","","","","","","","","",0,"","","","","","","","","","","","","","","",0]
[0,"","","","","","","","","","","","","","","",0,"","","","","","","","","","","","","","","",0]
[0,"","","","","","","","","","","","","","","",0,"","","","","","","","","","","","","","","",0]
[0,"","","","","","","","","","","","","","","",0,"","","","","","","","","","","","","","","",0]
[0,"","","","","","","","","","","","","","","",0,"","","","","","","","","","","","","","","",0]
[0,"","","","","","","","","","","","","","","",0,"","","","","","","","","","","","","","","",0]
[0,"","","","","","","","","","","","","","","",0,"","","","","","","","","","","","","","","",0]
[0,"","","","","","","","","","","","","","","",0,"","","","","","","","","","","","","","","",0]
[0,"","","","","","","","","","","","","","","",0,"","","","","","","","","","","","","","","",0]
[0,"","","","","","","","","","","","","","","",0,"","","","","","","","","","","","","","","",0]
[0,"","","","","","","","","","","","","","","",0,"","","","","","","","","","","","","","","",0]
[0,"","","","","","","","","","","","","","","",0,"","","","","","","","","","","","","","","",0]
[0,"","","","","","","","","","","","","","","",0,"","","","","","","","","","","","","","","",0]
[0,"","","","","","","","","","","","","","","",0,"","","","","","","","","","","","","","","",0]
[0,"","","","","","","","","","","","","","","",0,"","","","","","","","","","","","","","","",0]
[0,"","","","","","","","","","","","","","","",0,"","","","","","","","","","","","","","","",0]
[0,"","","","","","","","","","","","","","","",0,"","","","","","","","","","","","","","","",0]
[0,"","","","","","","","","","","","","","","",0,"","","","","","","","","","","","","","","",0]
[0,"","","","","","","","","","","","","","","",0,"","","","","","","","","","","","","","","",0]
[0,"","","","","","","","","","","","","","","",0,"","","","","","","","","","","","","","","",0]
[0,"","","","","","","","","","","","","","","",0,"","","","","","","","","","","","","","","",0]
[0,"","","","","","","","","","","","","","","",0,"","","","","","","","","","","","","","","",0]
[0,"","","","","","","","","","","","","","","",0,"","","","","","","","","","","","","","","",0]
[0,"","","","","","","","","","","","","","","",0,"","","","","","","","","","","","","","","",0]
[0,"","","","","","","","","","","","","","","",0,"","","","","","","","","","","","","","","",0]
[0,"","","","","","","","","","","","","","","",0,"","","","","","","","","","","","","","","",0]
[0,"","","","","","","","","","","","","","","",0,"","","","","","","","","","","","","","","",0]
[0,"","","","","","","","","","","","","","","",0,"","","","","","","","","","","","","","","",0]
[0,"","","","","","","","","","","","","","","",0,"","","","","","","","","","","","","","","",0]
[0,"","","","","","","","","","","","","","","",0,"","","","","","","","","","","","","","","",0]
[0,"","","","","","","","","","","","","","","",0,"","","","","","","","","","","","","","","",0]
[0,"","","","","","","","","","","","","","","",0,"","","","","","","","","","","","","","","",0]
[0,{"$f":" IFERROR(HYPERLINK( SUBSTITUTE(INDEX(ЛИСТЫ, ROW()), \"]\", \"]'\") & \"'!A1\",  INDEX(ЛИСТ.ИМЯ, ROW()) ),\"\")","v":""},"","","","","","","","","","","","","","",0,"","","","","","","","","","","","","","","",0]
[0,"","","","",{"$f":" IFERROR(INDIRECT(\"'\"&$B387&\"'!B4\"),\"\")","v":""},{"$f":" IFERROR(INDIRECT(\"'\"&$B387&\"'!K3\"),\"\")","v":""},{"$f":" IFERROR(INDIRECT(\"'\"&$B387&\"'!C1\"),\"\")","v":""},"",{"$f":" IFERROR(INDIRECT(\"'\"&$B387&\"'!G6\"),\"\")","v":""},{"$f":" IFERROR(INDIRECT(\"'\"&$B387&\"'!I6\"),\"\")","v":""},{"$f":" IFERROR(INDIRECT(\"'\"&$B387&\"'!h6\"),\"\")","v":""},{"$f":" IFERROR(INDIRECT(\"'\"&$B387&\"'!E2\"),\"\")","v":""},"",{"$f":" IFERROR(INDIRECT(\"'\"&$B387&\"'!E4\"),\"\")","v":""},"",0,"","","","","","","","","","","","","","","",0]
[{"$f":"IF(LEN(B388)>0,1,0)","v":0},"",{"$f":" IFERROR(INDIRECT(\"'\"&B388&\"'!B1\"),\"\")","v":""},{"$f":" IFERROR(INDIRECT(\"'\"&$B388&\"'!B3\"),\"\")","v":""},{"$f":" IFERROR(INDIRECT(\"'\"&$B388&\"'!B34\"),\"\")","v":""},"","","",{"$f":" IFERROR(INDIRECT(\"'\"&$B388&\"'!F24\"),\"\")","v":""},"","","","",{"$f":"IFERROR(IF(M388>0,INDIRECT(\"'\"&$B388&\"'!E1\"),\"\"),\"\")","v":""},"",{"$f":"IF(LEFT(O388,8)=\"оплачено\",0,IF(LEFT(O388,8)=\"ОПЛАТИТЬ\",(ПоискСКонца(O388,\"= \"))*1,\"\"))","v":""},{"$f":"IFERROR((0.98*MID(R388,SEARCH(\"++\",R388)+2,99)-AF388+AA388),0)","v":0},"","","","","","","","","","","","","","","",0]
[0,"","","","","","","","","","","","","","","",0,"","","","","","","","","","","","","","","",0]
[0,"","","","","","","","","","","","","","","",0,"","","","","","","","","","","","","","","",0]
[0,"","","","","","","","","","","","","","","",0,"","","","","","","","","","","","","","","",0]
[0,"","","","","","","","","","","","","","","",0,"","","","","","","","","","","","","","","",0]
[0,"","","","","","","","","","","","","","","",0,"","","","","","","","","","","","","","","",0]
[0,"","","","","","","","","","","","","","","",0,"","","","","","","","","","","","","","","",0]
[0,"","","","","","","","","","","","","","","",0,"","","","","","","","","","","","","","","",0]
[0,"","","","","","","","","","","","","","","",0,"","","","","","","","","","","","","","","",0]
[0,"","","","","","","","","","","","","","","",0,"","","","","","","","","","","","","","","",0]
[0,"","","","","","","","","","","","","","","",0,"","","","","","","","","","","","","","","",0]
[0,"","","","","","","","","","","","","","","",0,"","","","","","","","","","","","","","","",0]
[0,"","","","","","","","","","","","","","","",0,"","","","","","","","","","","","","","","",0]
[0,"","","","","","","","","","","","","","","",0,"","","","","","","","","","","","","","","",0]
[0,"","","","","","","","","","","","","","","",0,"","","","","","","","","","","","","","","",0]
[0,"","","","","","","","","","","","","","","",0,"","","","","","","","","","","","","","","",0]
[0,"","","","","","","","","","","","","","","",0,"","","","","","","","","","","","","","","",0]
[0,"","","","","","","","","","","","","","","",0,"","","","","","","","","","","","","","","",0]
[0,"","","","","","","","","","","","","","","",0,"","","","","","","","","","","","","","","",0]
[0,"","","","","","","","","","","","","","","",0,"","","","","","","","","","","","","","","",0]
[0,"","","","","","","","","","","","","","","",0,"","","","","","","","","","","","","","","",0]
[0,"","","","","","","","","","","","","","","",0,"","","","","","","","","","","","","","","",0]
[0,"","","","","","","","","","","","","","","",0,"","","","","","","","","","","","","","","",0]
[0,"","","","","","","","","","","","","","","",0,"","","","","","","","","","","","","","","",0]
[0,"","","","","","","","","","","","","","","",0,"","","","","","","","","","","","","","","",0]
[0,"","","","","","","","","","","","","","","",0,"","","","","","","","","","","","","","","",0]
[0,"","","","","","","","","","","","","","","",0,"","","","","","","","","","","","","","","",0]
[0,"","","","","","","","","","","","","","","",0,"","","","","","","","","","","","","","","",0]
[0,"","","","","","","","","","","","","","","",0,"","","","","","","","","","","","","","","",0]
[0,"","","","","","","","","","","","","","","",0,"","","","","","","","","","","","","","","",0]
[0,"","","","","","","","","","","","","","","",0,"","","","","","","","","","","","","","","",0]
[0,"","","","","","","","","","","","","","","",0,"","","","","","","","","","","","","","","",0]
[0,"","","","","","","","","","","","","","","",0,"","","","","","","","","","","","","","","",0]
[0,"","","","","","","","","","","","","","","",0,"","","","","","","","","","","","","","","",0]
[0,"","","","","","","","","","","","","","","",0,"","","","","","","","","","","","","","","",0]
[0,"","","","","","","","","","","","","","","",0,"","","","","","","","","","","","","","","",0]
[0,"","","","","","","","","","","","","","","",0,"","","","","","","","","","","","","","","",0]
[0,"","","","","","","","","","","","","","","",0,"","","","","","","","","","","","","","","",0]
[0,"","","","","","","","","","","","","","","",0,"","","","","","","","","","","","","","","",0]
[0,"","","","","","","","","","","","","","","",0,"","","","","","","","","","","","","","","",0]
[0,"","","","","","","","","","","","","","","",0,"","","","","","","","","","","","","","","",0]
[0,"","","","","","","","","","","","","","","",0,"","","","","","","","","","","","","","","",0]
[0,"","","","","","","","","","","","","","","",0,"","","","","","","","","","","","","","","",0]
[0,"","","","","","","","","","","","","","","",0,"","","","","","","","","","","","","","","",0]
[0,"","","","","","","","","","","","","","","",0,"","","","","","","","","","","","","","","",0]
[0,"","","","","","","","","","","","","","","",0,"","","","","","","","","","","","","","","",0]
[0,"","","","","","","","","","","","","","","",0,"","","","","","","","","","","","","","","",0]
[0,"","","","","","","","","","","","","","","",0,"","","","","","","","","","","","","","","",0]
[0,"","","","","","","","","","","","","","","",0,"","","","","","","","","","","","","","","",0]
[0,"","","","","","","","","","","","","","","",0,"","","","","","","","","","","","","","","",0]
[0,"","","","","","","","","","","","","","","",0,"","","","","","","","","","","","","","","",0]
[0,"","","","","","","","","","","","","","","",0,"","","","","","","","","","","","","","","",0]
[0,"","","","","","","","","","","","","","","",0,"","","","","","","","","","","","","","","",0]
[0,"","","","","","","","","","","","","","","",0,"","","","","","","","","","","","","","","",0]
[0,"","","","","","","","","","","","","","","",0,"","","","","","","","","","","","","","","",0]
[0,"","","","","","","","","","","","","","","",0,"","","","","","","","","","","","","","","",0]
[0,"","","","","","","","","","","","","","","",0,"","","","","","","","","","","","","","","",0]
[0,"","","","","","","","","","","","","","","",0,"","","","","","","","","","","","","","","",0]
[0,"","","","","","","","","","","","","","","",0,"","","","","","","","","","","","","","","",0]
[0,"","","","","","","","","","","","","","","",0,"","","","","","","","","","","","","","","",0]
[0,"","","","","","","","","","","","","","","",0,"","","","","","","","","","","","","","","",0]
[0,"","","","","","","","","","","","","","","",0,"","","","","","","","","","","","","","","",0]
[0,{"$f":" IFERROR(HYPERLINK( SUBSTITUTE(INDEX(ЛИСТЫ, ROW()), \"]\", \"]'\") & \"'!A1\",  INDEX(ЛИСТ.ИМЯ, ROW()) ),\"\")","v":""},"","","","","","","","","","","","","","",0,"","","","","","","","","","","","","","","",0]
[0,"","","","",{"$f":" IFERROR(INDIRECT(\"'\"&$B451&\"'!B4\"),\"\")","v":""},{"$f":" IFERROR(INDIRECT(\"'\"&$B451&\"'!K3\"),\"\")","v":""},{"$f":" IFERROR(INDIRECT(\"'\"&$B451&\"'!C1\"),\"\")","v":""},"",{"$f":" IFERROR(INDIRECT(\"'\"&$B451&\"'!G6\"),\"\")","v":""},{"$f":" IFERROR(INDIRECT(\"'\"&$B451&\"'!I6\"),\"\")","v":""},{"$f":" IFERROR(INDIRECT(\"'\"&$B451&\"'!h6\"),\"\")","v":""},{"$f":" IFERROR(INDIRECT(\"'\"&$B451&\"'!E2\"),\"\")","v":""},"",{"$f":" IFERROR(INDIRECT(\"'\"&$B451&\"'!E4\"),\"\")","v":""},"",0,"","","","","","","","","","","","","","","",0]
[{"$f":"IF(LEN(B452)>0,1,0)","v":0},"",{"$f":" IFERROR(INDIRECT(\"'\"&B452&\"'!B1\"),\"\")","v":""},{"$f":" IFERROR(INDIRECT(\"'\"&$B452&\"'!B3\"),\"\")","v":""},{"$f":" IFERROR(INDIRECT(\"'\"&$B452&\"'!B34\"),\"\")","v":""},"","","",{"$f":" IFERROR(INDIRECT(\"'\"&$B452&\"'!F24\"),\"\")","v":""},"","","","",{"$f":"IFERROR(IF(M452>0,INDIRECT(\"'\"&$B452&\"'!E1\"),\"\"),\"\")","v":""},"",{"$f":"IF(LEFT(O452,8)=\"оплачено\",0,IF(LEFT(O452,8)=\"ОПЛАТИТЬ\",(ПоискСКонца(O452,\"= \"))*1,\"\"))","v":""},{"$f":"IFERROR((0.98*MID(R452,SEARCH(\"++\",R452)+2,99)-AF452+AA452),0)","v":0},"","","","","","","","","","","","","","","",0]
[0,"","","","","","","","","","","","","","","",0,"","","","","","","","","","","","","","","",0]
[0,"","","","","","","","","","","","","","","",0,"","","","","","","","","","","","","","","",0]
[0,"","","","","","","","","","","","","","","",0,"","","","","","","","","","","","","","","",0]
[0,"","","","","","","","","","","","","","","",0,"","","","","","","","","","","","","","","",0]
[0,"","","","","","","","","","","","","","","",0,"","","","","","","","","","","","","","","",0]
[0,"","","","","","","","","","","","","","","",0,"","","","","","","","","","","","","","","",0]
[0,"","","","","","","","","","","","","","","",0,"","","","","","","","","","","","","","","",0]
[0,"","","","","","","","","","","","","","","",0,"","","","","","","","","","","","","","","",0]
[0,"","","","","","","","","","","","","","","",0,"","","","","","","","","","","","","","","",0]
[0,"","","","","","","","","","","","","","","",0,"","","","","","","","","","","","","","","",0]
[0,"","","","","","","","","","","","","","","",0,"","","","","","","","","","","","","","","",0]
[0,"","","","","","","","","","","","","","","",0,"","","","","","","","","","","","","","","",0]
[0,"","","","","","","","","","","","","","","",0,"","","","","","","","","","","","","","","",0]
[0,"","","","","","","","","","","","","","","",0,"","","","","","","","","","","","","","","",0]
[0,"","","","","","","","","","","","","","","",0,"","","","","","","","","","","","","","","",0]
[0,"","","","","","","","","","","","","","","",0,"","","","","","","","","","","","","","","",0]
[0,"","","","","","","","","","","","","","","",0,"","","","","","","","","","","","","","","",0]
[0,"","","","","","","","","","","","","","","",0,"","","","","","","","","","","","","","","",0]
[0,"","","","","","","","","","","","","","","",0,"","","","","","","","","","","","","","","",0]
[0,"","","","","","","","","","","","","","","",0,"","","","","","","","","","","","","","","",0]
[0,"","","","","","","","","","","","","","","",0,"","","","","","","","","","","","","","","",0]
[0,"","","","","","","","","","","","","","","",0,"","","","","","","","","","","","","","","",0]
[0,"","","","","","","","","","","","","","","",0,"","","","","","","","","","","","","","","",0]
[0,"","","","","","","","","","","","","","","",0,"","","","","","","","","","","","","","","",0]
[0,"","","","","","","","","","","","","","","",0,"","","","","","","","","","","","","","","",0]
[0,"","","","","","","","","","","","","","","",0,"","","","","","","","","","","","","","","",0]
[0,"","","","","","","","","","","","","","","",0,"","","","","","","","","","","","","","","",0]
[0,"","","","","","","","","","","","","","","",0,"","","","","","","","","","","","","","","",0]
[0,"","","","","","","","","","","","","","","",0,"","","","","","","","","","","","","","","",0]
[0,"","","","","","","","","","","","","","","",0,"","","","","","","","","","","","","","","",0]
[0,"","","","","","","","","","","","","","","",0,"","","","","","","","","","","","","","","",0]
[0,"","","","","","","","","","","","","","","",0,"","","","","","","","","","","","","","","",0]
[0,"","","","","","","","","","","","","","","",0,"","","","","","","","","","","","","","","",0]
[0,"","","","","","","","","","","","","","","",0,"","","","","","","","","","","","","","","",0]
[0,"","","","","","","","","","","","","","","",0,"","","","","","","","","","","","","","","",0]
[0,"","","","","","","","","","","","","","","",0,"","","","","","","","","","","","","","","",0]
[0,"","","","","","","","","","","","","","","",0,"","","","","","","","","","","","","","","",0]
[0,"","","","","","","","","","","","","","","",0,"","","","","","","","","","","","","","","",0]
[0,"","","","","","","","","","","","","","","",0,"","","","","","","","","","","","","","","",0]
[0,"","","","","","","","","","","","","","","",0,"","","","","","","","","","","","","","","",0]
[0,"","","","","","","","","","","","","","","",0,"","","","","","","","","","","","","","","",0]
[0,"","","","","","","","","","","","","","","",0,"","","","","","","","","","","","","","","",0]
[0,"","","","","","","","","","","","","","","",0,"","","","","","","","","","","","","","","",0]
[0,"","","","","","","","","","","","","","","",0,"","","","","","","","","","","","","","","",0]
[0,"","","","","","","","","","","","","","","",0,"","","","","","","","","","","","","","","",0]
[0,"","","","","","","","","","","","","","","",0,"","","","","","","","","","","","","","","",0]
[0,"","","","","","","","","","","","","","","",0,"","","","","","","","","","","","","","","",0]
[0,"","","","","","","","","","","","","","","",0,"","","","","","","","","","","","","","","",0]

{"sheet":"ТАРИФЫ ТК","index":1,"n_rows":268,"n_cols":12,"rows_kept":268,"cut":false,"hidden":false,"merged":[[2,0,2,3],[2,4,2,6],[1,8,1,11],[1,0,1,6]]}
["ТАРИФЫ ТК",null,null,null,null,null,null,null,null,null,"210516_2"]
["AVIS LOGISTICS",null,null,null,null,null,null,null,"EXLINE"]
["АВИС ЭКОНОМ до 3кг идо 30 см.",null,null,null,"АВИС ЭКСПРЕСС до 1,0 кг",null,null,null,"Вес (кг)","Зона 1","Зона 2"]
["Астана",{"$f":"LEFT(A4,4)","v":"Аста"},1300,"Акмолинская область","Астана",{"$f":"LEFT(E4,4)","v":"Аста"},1400,null,5,1100,1400]
["Нур-Султан","Нур-",1300,null,"Нур-Султан","Нур-",1400]
["Кокшетау","Кокш",1300,null,"Алматы","Алма",1400,null,5.5,1150,1540]
["Акколь",{"$f":"LEFT(A7,4)","v":"Акко"},2100,null,"Актау","Акта",1400,null,6,1200,1680]
["Атбасар","Атба",2100,1,"Атырау","Атыр",1400,null,6.5,1250,1820]
["Державинск","Держ",1400,null,"Актобе","Акто",1400,null,7,1300,1960]
["Ерментау","Ерме",2100,null,"Караганда","Кара",1400,null,7.5,1350]
["Есиль","Есил",1400,null,"Кокшетау","Кокш",1400,null,8,1400,2240]
["Макинск","Маки",2100,null,"Кызылорда","Кызы",1400,null,8.5,1450,2380]
["Степногорск","Степ",2100,null,"Павлодар","Павл",1400,null,9,1500,2520]
["Боровое","Боро",2100,null,"Петропавловск","Петр",1400,null,9.5,1550,2660]
["Щучинск","Щучи",2100,null,"Талдыкорган","Талд",1400,null,10,1600,2800]
[null,null,null,null,"Тараз","Тара",1400,null,"+ 0,5 кг",80,140]
["Актобе",{"$f":"LEFT(A17,4)","v":"Акто"},1300,"Актюбинская область","Уральск","Урал",1400,null,"Зона 1","Актау",{"$f":"LEFT(J17,4)","v":"Акта"},1550]
["Хромтау",{"$f":"LEFT(A18,4)","v":"Хром"},1400,null,"Усть-Каменогорск","Усть",1400,null,null,"Актобе","Акто",1550]
[null,null,null,null,"Туркестан","Турк",1400]
[null,null,null,null,"Шымкент","Шымк",1400,null,null,"Алматы","Алма",1550]
["Алматы",{"$f":"LEFT(A21,4)","v":"Алма"},1300,"Алматинская область",null,null,null,null,null,"Астана","Аста",1550]
["Талдыкорган",{"$f":"LEFT(A22,4)","v":"Талд"},1200,null,null,null,null,null,null,"Атырау","Атыр",1550]
["Есик",{"$f":"LEFT(A23,4)","v":"Есик"},1400,null,null,null,null,null,null,"Караганда","Кара",1550]
["Жаркент","Жарк",2100,null,null,null,null,null,null,"Кокшетау","Кокш",1550]
["Капшагай","Капш",1400,null,null,null,null,null,null,"Костанай","Кост",1550]
["Каскелен","Каск",1300,null,null,null,null,null,null,"Кызылорда","Кызы",1550]
["Отеген Батыр","Отег",1400,null,{"$f":"D29","v":0},null,null,null,null,"Павлодар","Павл",1550]
["Сарыозек","Сары",1400,null,null,null,null,null,null,"Петропавловск","Петр",1550]
["Талгар","Талг",1400,null,null,null,null,null,null,"Талдыкорган","Талд",1550]
["Узынагаш","Узын",1400,null,null,null,null,null,null,"Тараз","Тара",1550]
["Уштобе","Ушто",2100,null,null,null,null,null,null,"Уральск","Урал",1550]
[null,null,null,null,null,null,null,null,null,"Усть-Каменогорск","Усть",1550]
[null,null,null,null,null,null,null,null,null,"Оскемен","Оске",1550]
["Атырау",{"$f":"LEFT(A34,4)","v":"Атыр"},1300,"Атырауская область",null,null,null,null,null,"Шымкент","Шымк",1550]
["Кульсары",{"$f":"LEFT(A35,4)","v":"Куль"},2100]
["Махамбет","Маха",1650]
[null,null,null,null,null,null,null,null,"Зона 2"]
["Усть-Каменогорск","Усть",1300,"ВКО",null,null,null,null,"Акмолинская область"]
["Семей","Семе",1200,null,null,null,null,null,null,"Акколь",{"$f":"LEFT(J39,4)","v":"Акко"},2100]
["Семипалатинск","Семи",1200,null,null,null,null,null,null,"Акмол","Акмо",2100]
["Бородулиха",{"$f":"LEFT(A41,4)","v":"Боро"},1400,null,null,null,null,null,null,"Малиновка","Мали",2100]
["Зайсан","Зайс",2100,null,null,null,null,null,null,"Аршалы","Арша",2100]
["Зыряновск","Зыря",2100,null,null,null,null,null,null,"Астраханка","Астр",2100]
["Курчатов","Курч",2100,null,null,null,null,null,null,"Атбасар","Атба",2100]
["Риддер","Ридд",2100,null,null,null,null,null,null,"Балкашино","Балк",2100]
["Жаскент","Жаск",2100,null,null,null,null,null,null,"Викторовка","Викт",2100]
["Шемонаиха","Шемо",2100,null,null,null,null,null,null,"Державинск","Держ",2100]
[]
["Тараз",{"$f":"LEFT(A49,4)","v":"Тара"},1300,"Жамбыльская область"]
["Аса","Аса",2100,null,null,null,null,null,null,"Егиндыколь","Егин",2100]
["Бауржан Момышулы","Баур",2100,null,null,null,null,null,null,"Ерментау","Ерме",2100]
["Жанатас","Жана",4900,null,null,null,null,null,null,"Есиль","Есил",2100]
["Каратау","Кара",2100,null,null,null,null,null,null,"Жаксы","Жакс",2100]
["Кордай","Корд",2100,null,null,null,null,null,null,"Зеренда","Зере",2100]
["Кулан","Кула",2100,null,null,null,null,null,null,"Коргалжын","Корг",2100]
["Мерке","Мерк",2100,null,null,null,null,null,null,"Макинск","Маки",2100]
["Мойынкум","Мойы",3500,null,null,null,null,null,null,"Сандыктау","Санд",2100]
["Сарыкемер","Сары",2100,null,null,null,null,null,null,"Степногорск","Степ",2100]
["Толе би","Толе",2100,null,null,null,null,null,null,"Степняк","Степ",2100]
["Шу","Шу",2100,null,null,null,null,null,null,"Шортанды","Шорт",2100]
[null,null,null,null,null,null,null,null,null,"Щучинск","Щучи",2100]
["Уральск",{"$f":"LEFT(A62,4)","v":"Урал"},1300,"ЗКО"]
["Аксай","Акса",2100,null,null,null,null,null,"Актюбинская область"]
["Зачаганск","Зача",1400,null,null,null,null,null,null,"Алга",{"$f":"LEFT(J64,4)","v":"Алга"},2100]
["Мичурино","Мичу",1400,null,null,null,null,null,null,"Бадамша","Бада",2100]
["Плодоовощной","Плод",1400,null,null,null,null,null,null,"Иргиз","Ирги",2100]
["Селекционная","Селе",1400,null,null,null,null,null,null,"Кандыагаш","Канд",2100]
[null,null,null,null,null,null,null,null,null,"Карауылкельды","Кара",2100]
["Караганда",{"$f":"LEFT(A69,4)","v":"Кара"},1300,"Карагандинская область",null,null,null,null,null,"Кобда","Кобд",2100]
["Абай",{"$f":"LEFT(A70,4)","v":"Абай"},1400,null,null,null,null,null,null,"Новоалексеевка","Ново",2100]
["Актас","Акта",1400,null,null,null,null,null,null,"Комсомольское","Комс",2100]
[null,null,null,null,null,null,null,null,null,"Мартук","Март",2100]
["Балхаш","Балх",1300,null,null,null,null,null,null,"Уил","Уил",2100]
["Долинка","Доли",1400,null,null,null,null,null,null,"Хромтау","Хром",2100]
["Жезказган","Жезк",1400,null,null,null,null,null,null,"Шалкар","Шалк",2100]
["Сарань","Сара",1400,null,null,null,null,null,null,"Шубаркудук","Шуба",2100]
["Сатпаев","Сатп",1400,null,null,null,null,null,null,"Эмба","Эмба",2100]
["Темиртау","Теми",1400]
["Шахан","Шаха",1400,null,null,null,null,null,"Алматинская область"]
["Шахтинск","Шахт",1400,null,null,null,null,null,null,"Баканас",{"$f":"LEFT(J80,4)","v":"Бака"},2100]
[null,null,null,null,null,null,null,null,null,"Балпык би","Балп",2100]
["Кызылорда",{"$f":"LEFT(A82,4)","v":"Кызы"},1200,"Кызылординская область",null,null,null,null,null,"Есик","Есик",2100]
[null,null,null,null,null,null,null,null,null,"Жансугуров","Жанс",2100]
["Актау",{"$f":"LEFT(A84,4)","v":"Акта"},1300,"Мангистауская область",null,null,null,null,null,"Жаркент","Жарк",2100]
["Жанаозен",{"$f":"LEFT(A85,4)","v":"Жана"},1400,null,null,null,null,null,null,"Капшагай","Капш",2100]
["Курык","Куры",1400,null,null,null,null,null,null,"Карабулак","Кара",2100]
["Мангистау (ст.Мангышлак)","Манг",1400,null,null,null,null,null,null,"Каскелен","Каск",2100]
["Форт Шевченко","Форт",1400,null,null,null,null,null,null,"Кеген","Кеге",2100]
["Шетпе","Шетп",1400,null,null,null,null,null,null,"Отеген Батыра","Отег",2100]
["Баранколь (опорный)","Бара",2500,null,null,null,null,null,null,"Саркан","Сарк",2100]
["Бейнеу","Бейн",2100,null,null,null,null,null,null,"Сарыозек","Сары",2100]
[null,null,null,null,null,null,null,null,null,"Талгар","Талг",2100]
["Павлодар",{"$f":"LEFT(A93,4)","v":"Павл"},1200,"Павлодарская область",null,null,null,null,null,"Текели","Теке",2100]
["Аксу",{"$f":"LEFT(A94,4)","v":"Аксу"},1400,null,null,null,null,null,null,"Узынагаш","Узын",2100]
["Экибастуз",{"$f":"LEFT(A95,4)","v":"Экиб"},1300,null,null,null,null,null,null,"Ушарал","Ушар",2100]
[null,null,null,null,null,null,null,null,null,"Уштобе","Ушто",2100]
["Петропавловск",{"$f":"LEFT(A97,4)","v":"Петр"},1300,"СКО",null,null,null,null,null,"Шонжа","Шонж",2100]
["Бесколь (Бишкуль)",{"$f":"LEFT(A98,4)","v":"Беск"},1400]
["Булаево","Була",2500,null,null,null,null,null,"Атырауская область"]
["Кишкенеколь","Кишк",3000,null,null,null,null,null,null,"Аккыстау",{"$f":"LEFT(J100,4)","v":"Аккы"},2100]
["Мамлютка","Мамл",3000,null,null,null,null,null,null,"Ганюшкино","Ганю",2100]
["Новоишимский","Ново",3000,null,null,null,null,null,null,"Индерборский","Инде",2100]
["Саумалколь","Саум",3000,null,null,null,null,null,null,"Кульсары","Куль",2100]
["Сергеевка","Серг",3000,null,null,null,null,null,null,"Макат","Мака",2100]
["Смирново","Смир",3000,null,null,null,null,null,null,"Махамбет","Маха",2100]
["Тайынша","Тайы",3000,null,null,null,null,null,null,"Миялы","Миял",2100]
["Талшык","Талш",3000]
["Тимирязево","Тими",3000,null,null,null,null,null,"Восточно-Казахстанская область"]
["Явленка","Явле",3000,null,null,null,null,null,null,"Аксуат",{"$f":"LEFT(J109,4)","v":"Аксу"},2100]
[null,null,null,null,null,null,null,null,null,"Аякоз","Аяко",2100]
["Костанай",{"$f":"LEFT(A111,4)","v":"Кост"},0,"Костанайская область",null,null,null,null,null,"Бескарагай","Беск",2100]
["Аркалык",{"$f":"LEFT(A112,4)","v":"Арка"},2100,null,null,null,null,null,null,"Большая Владимировка","Боль",2100]
["Аулиеколь","Аули",1400,null,null,null,null,null,null,"Большенарымское","Боль",2100]
["Боровское","Боро",1400,null,null,null,null,null,null,"Бородулиха","Боро",2100]
["Жетыгара","Жеты",1400,null,null,null,null,null,null,"Глубокое","Глуб",2100]
["Затобольск","Зато",1400,null,null,null,null,null,null,"Зайсан","Зайс",2100]
["Карабалык","Кара",1400,null,null,null,null,null,null,"Зыряновск","Зыря",2100]
["Караменды","Кара",2800,null,null,null,null,null,null,"Калбатау (Георгиевка)","Калб",2100]
["Карасу","Кара",1400,null,null,null,null,null,null,"Карааул","Кара",2100]
["Качар","Кача",1400,null,null,null,null,null,null,"Касыма Кайсенова","Касы",2100]
["Лисаковск","Лиса",1400,null,null,null,null,null,null,"Молодежное","Моло",2100]
["Рудный","Рудн",1400,null,null,null,null,null,null,"Кокпекты","Кокп",2100]
["Тобол","Тобо",1400,null,null,null,null,null,null,"Курчатов","Курч",2100]
["Узынколь","Узын",1400,null,null,null,null,null,null,"Курчум","Курч",2100]
["Федоровка","Федо",1400,null,null,null,null,null,null,"Риддер","Ридд",2100]
[null,null,null,null,null,null,null,null,null,"Семей","Семе",2100]
["Шымкент",{"$f":"LEFT(A127,4)","v":"Шымк"},1300,"ЮКО",null,null,null,null,null,"Семипалатинск","Семи",2100]
["Аксукент",{"$f":"LEFT(A128,4)","v":"Аксу"},2100,null,null,null,null,null,null,"Урджар","Урдж",2100]
["Кентау","Кент",2100,null,null,null,null,null,null,"Шемонаиха","Шемо",2100]
["Ленгер","Ленг",2100]
["Сары агаш","Сары",2800,null,null,null,null,null,"Жамбыльская область"]
["Туркестан","Турк",1300,null,null,null,null,null,null,"Аса",{"$f":"LEFT(J132,4)","v":"Аса"},2100]
["Сайрам","Сайр",2100,null,null,null,null,null,null,"Бауржан Момышулы","Баур",2100]
["Тасай","Таса",2100,null,null,null,null,null,null,"Жанатас","Жана",2100]
[null,null,null,null,null,null,null,null,null,"Каратау","Кара",2100]
[null,null,null,null,null,null,null,null,null,"Кордай","Корд",2100]
[null,null,null,null,null,null,null,null,null,"Кулан","Кула",2100]
[null,null,null,null,null,null,null,null,null,"Мерке","Мерк",2100]
[null,null,null,null,null,null,null,null,null,"Мойынкум","Мойы",2100]
[null,null,null,null,null,null,null,null,null,"Сарыкемер","Сары",2100]
[null,null,null,null,null,null,null,null,null,"Толе би","Толе",2100]
[null,null,null,null,null,null,null,null,null,"Шу","Шу",2100]
[]
[null,null,null,null,null,null,null,null,"Западно-Казахстанская область",null,null,2100]
[null,null,null,null,null,null,null,null,null,"Аксай",{"$f":"LEFT(J145,4)","v":"Акса"},2100]
[null,null,null,null,null,null,null,null,null,"Жангала","Жанг",2100]
[null,null,null,null,null,null,null,null,null,"Жаныбек","Жаны",2100]
[null,null,null,null,null,null,null,null,null,"Жимпиты","Жимп",2100]
[null,null,null,null,null,null,null,null,null,"Казталовка","Казт",2100]
[null,null,null,null,null,null,null,null,null,"Каратобе","Кара",2100]
[null,null,null,null,null,null,null,null,null,"Переметное","Пере",2100]
[null,null,null,null,null,null,null,null,null,"Сайхин","Сайх",2100]
[null,null,null,null,null,null,null,null,null,"Таскала","Таск",2100]
[null,null,null,null,null,null,null,null,null,"Федоровка","Федо",2100]
[null,null,null,null,null,null,null,null,null,"Чапаев","Чапа",2100]
[null,null,null,null,null,null,null,null,null,"Чингерлау","Чинг",2100]
[]
[null,null,null,null,null,null,null,null,"Западно-Казахстанская область (В черте Уральска)",null,null,2100]
[null,null,null,null,null,null,null,null,null,"Зачаганск",{"$f":"LEFT(J159,4)","v":"Зача"},2100]
[null,null,null,null,null,null,null,null,null,"Маштаково",{"$f":"LEFT(J160,4)","v":"Машт"},2100]
[null,null,null,null,null,null,null,null,null,"Мичурино",{"$f":"LEFT(J161,4)","v":"Мичу"},2100]
[null,null,null,null,null,null,null,null,null,"Плодовощной",{"$f":"LEFT(J162,4)","v":"Плод"},2100]
[null,null,null,null,null,null,null,null,null,"Селекционная",{"$f":"LEFT(J163,4)","v":"Селе"},2100]
[]
[null,null,null,null,null,null,null,null,"Карагандинская область"]
[null,null,null,null,null,null,null,null,null,"Абай",{"$f":"LEFT(J166,4)","v":"Абай"},2100]
[null,null,null,null,null,null,null,null,null,"Аксу-Аюлы","Аксу",2100]
[null,null,null,null,null,null,null,null,null,"Актогай?","Акто",2100]
[null,null,null,null,null,null,null,null,null,"Атасу","Атас",2100]
[null,null,null,null,null,null,null,null,null,"Балхаш","Балх",2100]
[null,null,null,null,null,null,null,null,null,"Ботакара","Бота",2100]
[null,null,null,null,null,null,null,null,null,"Жезказган","Жезк",2100]
[null,null,null,null,null,null,null,null,null,"Каражал","Кара",2100]
[null,null,null,null,null,null,null,null,null,"Каркаралинск","Карк",2100]
[null,null,null,null,null,null,null,null,null,"Киевка","Киев",2100]
[null,null,null,null,null,null,null,null,null,"Осакаровка","Осак",2100]
[null,null,null,null,null,null,null,null,null,"Приозерск","Прио",2100]
[null,null,null,null,null,null,null,null,null,"Сарань","Сара",2100]
[null,null,null,null,null,null,null,null,null,"Сатпаев","Сатп",2100]
[null,null,null,null,null,null,null,null,null,"Темиртау","Теми",2100]
[null,null,null,null,null,null,null,null,null,"Улытау","Улыт",2100]
[null,null,null,null,null,null,null,null,null,"Шахтинск","Шахт",2100]
[]
[null,null,null,null,null,null,null,null,"Костанайская область"]
[null,null,null,null,null,null,null,null,null,"Амангельды",{"$f":"LEFT(J185,4)","v":"Аман"},2100]
[null,null,null,null,null,null,null,null,null,"Аркалык?","Арка",2100]
[null,null,null,null,null,null,null,null,null,"Аулиеколь","Аули",2100]
[null,null,null,null,null,null,null,null,null,"Боровское","Боро",2100]
[null,null,null,null,null,null,null,null,null,"Денисовка","Дени",2100]
[null,null,null,null,null,null,null,null,null,"Жетикара","Жети",2100]
[null,null,null,null,null,null,null,null,null,"Затобольск","Зато",2100]
[null,null,null,null,null,null,null,null,null,"Камысты","Камы",2100]
[null,null,null,null,null,null,null,null,null,"Карабалык","Кара",2100]
[null,null,null,null,null,null,null,null,null,"Караменды","Кара",2100]
[null,null,null,null,null,null,null,null,null,"Карасу","Кара",2100]
[null,null,null,null,null,null,null,null,null,"Лисаковск","Лиса",2100]
[null,null,null,null,null,null,null,null,null,"Рудный","Рудн",2100]
[null,null,null,null,null,null,null,null,null,"Сарыколь","Сары",2100]
[null,null,null,null,null,null,null,null,null,"Тарановское","Тара",2100]
[null,null,null,null,null,null,null,null,null,"Торгай","Торг",2100]
[null,null,null,null,null,null,null,null,null,"Узынколь","Узын",2100]
[null,null,null,null,null,null,null,null,null,"Федоровка","Федо",2100]
[]
[null,null,null,null,null,null,null,null,"Кызылординская область"]
[null,null,null,null,null,null,null,null,null,"Айтеке би",{"$f":"LEFT(J205,4)","v":"Айте"},2100]
[null,null,null,null,null,null,null,null,null,"Казалинск","Каза",2100]
[null,null,null,null,null,null,null,null,null,"Аральск","Арал",2100]
[null,null,null,null,null,null,null,null,null,"Байконур","Байк",2100]
[null,null,null,null,null,null,null,null,null,"Жалагаш","Жала",2100]
[null,null,null,null,null,null,null,null,null,"Жанакорган","Жана",2100]
[null,null,null,null,null,null,null,null,null,"Жосалы","Жоса",2100]
[null,null,null,null,null,null,null,null,null,"Теренозек","Тере",2100]
[null,null,null,null,null,null,null,null,null,"Шиели","Шиел",2100]
[]
[null,null,null,null,null,null,null,null,"Мангистауская область"]
[null,null,null,null,null,null,null,null,null,"Жанаозен",{"$f":"LEFT(J216,4)","v":"Жана"},2100]
[null,null,null,null,null,null,null,null,null,"Курык","Куры",2100]
[null,null,null,null,null,null,null,null,null,"Мангистау","Манг",2100]
[null,null,null,null,null,null,null,null,null,"Мангышлак","Манг",2100]
[null,null,null,null,null,null,null,null,null,"Форт Шевченко","Форт",2100]
[null,null,null,null,null,null,null,null,null,"Шетпе","Шетп",2100]
[]
[null,null,null,null,null,null,null,null,"Павлодарская область"]
[null,null,null,null,null,null,null,null,null,"Акку",{"$f":"LEFT(J224,4)","v":"Акку"},2100]
[null,null,null,null,null,null,null,null,null,"Аксу","Аксу",2100]
[null,null,null,null,null,null,null,null,null,"Актогай","Акто",2100]
[null,null,null,null,null,null,null,null,null,"Баянаул","Баян",2100]
[null,null,null,null,null,null,null,null,null,"Железинка","Желе",2100]
[null,null,null,null,null,null,null,null,null,"Иртышск","Ирты",2100]
[null,null,null,null,null,null,null,null,null,"Кашыр","Кашы",2100]
[null,null,null,null,null,null,null,null,null,"Коктобе","Кокт",2100]
[null,null,null,null,null,null,null,null,null,"Успенка","Успе",2100]
[null,null,null,null,null,null,null,null,null,"Шарбакты","Шарб",2100]
[null,null,null,null,null,null,null,null,null,"Экибастуз","Экиб",2100]
[]
[null,null,null,null,null,null,null,null,"Северо-Казахстанская область"]
[null,null,null,null,null,null,null,null,null,"Бесколь",{"$f":"LEFT(J237,4)","v":"Беск"},2100]
[null,null,null,null,null,null,null,null,null,"Бишкуль","Бишк",2100]
[null,null,null,null,null,null,null,null,null,"Булаево","Була",2100]
[null,null,null,null,null,null,null,null,null,"Кишкенеколь","Кишк",2100]
[null,null,null,null,null,null,null,null,null,"Мамлютка","Мамл",2100]
[null,null,null,null,null,null,null,null,null,"Новоишимский","Ново",2100]
[null,null,null,null,null,null,null,null,null,"Саумалколь","Саум",2100]
[null,null,null,null,null,null,null,null,null,"Сергеевка","Серг",2100]
[null,null,null,null,null,null,null,null,null,"Смирново","Смир",2100]
[null,null,null,null,null,null,null,null,null,"Тайынша","Тайы",2100]
[null,null,null,null,null,null,null,null,null,"Талшык","Талш",2100]
[null,null,null,null,null,null,null,null,null,"Тимирязево","Тими",2100]
[null,null,null,null,null,null,null,null,null,"Явленка","Явле",2100]
[]
[null,null,null,null,null,null,null,null,"Южно-Казахстанская область"]
[null,null,null,null,null,null,null,null,null,"Аксукент",{"$f":"LEFT(J252,4)","v":"Аксу"},2100]
[null,null,null,null,null,null,null,null,null,"Арыс","Арыс",2100]
[null,null,null,null,null,null,null,null,null,"Жетысай","Жеты",2100]
[null,null,null,null,null,null,null,null,null,"Казыгурт","Казы",2100]
[null,null,null,null,null,null,null,null,null,"Кентау","Кент",2100]
[null,null,null,null,null,null,null,null,null,"Ленгер","Ленг",2100]
[null,null,null,null,null,null,null,null,null,"Сары агаш","Сары",2100]
[null,null,null,null,null,null,null,null,null,"Темирлановка","Теми",2100]
[null,null,null,null,null,null,null,null,null,"Турар Рыскулов","Тура",2100]
[null,null,null,null,null,null,null,null,null,"Туркестан","Турк",2100]
[null,null,null,null,null,null,null,null,null,"Шардара","Шард",2100]
[null,null,null,null,null,null,null,null,null,"Шаульдер","Шаул",2100]
[null,null,null,null,null,null,null,null,null,"Шаян","Шаян",2100]
[null,null,null,null,null,null,null,null,null,"Шолаккорган","Шола",2100]
[null,null,null,null,null,null,null,null,null,"Шаульдер",{"$f":"LEFT(J266,4)","v":"Шаул"},2100]
[null,null,null,null,null,null,null,null,null,"Шаян",{"$f":"LEFT(J267,4)","v":"Шаян"},2100]
[null,null,null,null,null,null,null,null,null,"Шолаккорган",{"$f":"LEFT(J268,4)","v":"Шола"},2100]

{"sheet":"+KASPI+ 9641++0","index":2,"n_rows":42,"n_cols":21,"rows_kept":42,"cut":false,"hidden":false,"merged":[[27,6,27,8],[31,0,31,1],[37,1,37,2],[0,4,0,7],[1,4,1,8],[2,1,2,2],[3,1,3,2],[25,6,25,8],[26,6,26,8]]}
[{"$f":"IF(LEFT(C29,2)=\"сп\",P1&\" ► СП\",IF(E25=D26,P1,IF(H6<>0,P1&\"++\"&\"0\",IF(E25=D27,P1&\"++\"&\"0\",IF(E25=D28,P1&\"++\"&\"0\",IF(E25=D27,P1&\"++\"&\"0\",IF(E25=D28,P1&\"++\"&\"0\",IF(LEFT(C25,2)=\"AV\",P1&\"++\"&F29,P1))))))))","v":"+KASPI+ 9641++0"},{"$f":"L4","v":"2020-08-16T18:08:28"},{"$f":"IF(E2>0,\"ОТПРАВЛЕНО\",IF(LEFT(C29,3)=\"ЗАК\",\"ЗАКАЗАНО в СПБ\",IF(G24>=0,\"ОПЛОЧЕНО\",\"ОЖИДАНИЕ ОПЛАТЫ\")))","v":"ОТПРАВЛЕНО"},{"$f":"'СПИСОК ЗАКАЗОВ'!B1","v":21},"2020-08-18",null,null,null,{"$f":"A1","v":"+KASPI+ 9641++0"},null,"Заказ № 9641",null,null,null,null,{"$f":"IF(G24>0,\"+\"&H6&\"+\"&Q1,Q1)","v":"+KASPI+ 9641"},{"$f":"ПоискСКонца(K1,\"№\")","v":" 9641"}]
["Логин",{"$f":"L3","v":0},"Номер накл-ой",null,3611555,null,null,null,null,null,"Примечание"]
["ФИО",{"$f":"IF(C32=0,UPPER((P9)),UPPER(C33))","v":"КУЗНЕЦОВА ЛАРИСА"},null,null,null,null,null,null,null,null,"Логин"]
["Телефон",{"$f":"R12","v":"7-771-835-95-68   0----   ----"},null,null,{"$f":"IF(F4>0.5,\"оплачено\",IF(F4<0,\"ОПЛАТИТЬ= \"&G4,\"ОПЛАТИТЬ= \"&Q25))","v":"ОПЛАТИТЬ= 1400"},0,1100,null,null,null,"Дата заказа","2020-08-16T18:08:28"]
["e-mail:",{"$f":"L11","v":"-"}]
["Вес","ПРИМЕЧАНИЯ","Наименование","Кол-во","Цена","Всего",{"$f":"IF(MAX(G7:G25)>0,MAX(G7:G25),\"\")","v":"2020-08-21"},{"$f":"IF(I7>0,\"НАЛ\",IF(I8>0,\"ПЕРЕВОД\",IF(I9>0,\"Beeline\",IF(I10>0,\"KASPI\",IF(I11>0,\"QIWI\",IF(I12>0,\"СЧЁТ Альфа-Банк\",0))))))","v":"KASPI"},{"$f":"SUM(I7:I28)","v":4880}]
[{"$f":"IF(L24>0,Q24*1/100,\"\")","v":""},"списано",{"$f":"IF(L26<>\"\",K26,\"\")","v":"Неодимовый магнит D20x10mm(Аксиал)`42 (сила притяжения 14 кг)"},{"$f":"IF(L26>0,L26,\"\")","v":4},{"$f":"IF(M26=\"уточняйте\",0,IF(L26>0,M26,\"\"))","v":870},{"$f":"IF(D7<>\"\",E7*D7,\"\")","v":3480},{"$f":"IF(I7 >0,TODAY(),\"\")","v":""},"НАЛ",null,{"$f":"IFERROR(IFERROR(VLOOKUP(C7,#REF!,3,0)*D7,VLOOKUP(C7,#REF!,7,0)*D7),\"нет веса\")","v":"нет веса"},"Заказ №9641"]
[{"$f":"IF(L25>0,Q25*1/100,\"\")","v":14},null,{"$f":"IF(L27<>\"\",K27,\"\")","v":""},{"$f":"IF(L27>0,L27,\"\")","v":""},{"$f":"IF(M27=\"уточняйте\",0,IF(L27>0,M27,\"\"))","v":""},"","","ПЕРЕВОД",null,{"$f":"IFERROR(IFERROR(VLOOKUP(C8,#REF!,3,0)*D8,VLOOKUP(C8,#REF!,7,0)*D8),\"нет веса\")","v":"нет веса"}]
[{"$f":"IF(L26>0,Q26*1/100,\"\")","v":0.94},null,"","","","","","Beeline",null,{"$f":"IFERROR(IFERROR(VLOOKUP(C9,#REF!,3,0)*D9,VLOOKUP(C9,#REF!,7,0)*D9),\"нет веса\")","v":"нет веса"},"Здравствуйте, Кузнецова Лариса",null,null,null,null,{"$f":"MID(K9,15,70)","v":"Кузнецова Лариса"},{"$f":"TEXT(SUM(MID(0&L9,LARGE(ISNUMBER(-MID(L9,ROW($1:$96),1))*ROW($1:$96),ROW($1:$23)+15)+1,1)*10^ROW($1:$23)/10),REPT(0,MIN(MAX(COUNT(1/(MID(L9,ROW($1:$96),1)+1))-15,),15)))&TEXT(SUM(MID(0&L9,LARGE(ISNUMBER(-MID(L9,ROW($1:$96),1))*ROW($1:$96),ROW($1:$23))+1,1)*10^ROW($1:$23)/10),REPT(0,MIN(COUNT(1/(MID(L9,ROW($1:$96),1)+1)),15)))","v":""}]
["",null,"","","","","2020-08-21","KASPI",{"$f":"F29","v":4880},{"$f":"IFERROR(IFERROR(VLOOKUP(C10,#REF!,3,0)*D10,VLOOKUP(C10,#REF!,7,0)*D10),\"нет веса\")","v":"нет веса"},"Мы получили Ваш заказ номер, 9641"]
["",null,"","","","","","QIWI",null,{"$f":"IFERROR(IFERROR(VLOOKUP(C11,#REF!,3,0)*D11,VLOOKUP(C11,#REF!,7,0)*D11),\"нет веса\")","v":"нет веса"},"Электронная почта:","-"]
["",null,"","","","","","СЧЁТ Альфа-Банк",null,{"$f":"IFERROR(IFERROR(VLOOKUP(C12,#REF!,3,0)*D12,VLOOKUP(C12,#REF!,7,0)*D12),\"нет веса\")","v":"нет веса"},"Контактный телефон:","+7 (771) 835-95-68",null,null,null,{"$f":"(L12&\"  \"&P13)","v":"+7 (771) 835-95-68  0"},{"$f":"TEXT(SUM(MID(0&P12,LARGE(ISNUMBER(-MID(P12,ROW($1:$99),1))*ROW($1:$99),ROW($1:$15)+30)+1,1)*10^ROW($1:$15)/10),REPT(0,MIN(MAX(COUNT(1/(MID(P12,ROW($1:$99),1)+1))-30,),15)))&TEXT(SUM(MID(0&P12,LARGE(ISNUMBER(-MID(P12,ROW($1:$99),1))*ROW($1:$99),ROW($1:$15)+15)+1,1)*10^ROW($1:$15)/10),REPT(0,MIN(MAX(COUNT(1/(MID(P12,ROW($1:$99),1)+1))-15,),15)))&TEXT(SUM(MID(0&P12,LARGE(ISNUMBER(-MID(P12,ROW($1:$99),1))*ROW($1:$99),ROW($1:$15))+1,1)*10^ROW($1:$15)/10),REPT(0,MIN(COUNT(1/(MID(P12,ROW($1:$99),1)+1)),15)))","v":"777183595680"},{"$f":"(MID(Q12,1,1))&\"-\"&(MID(Q12,2,3))&\"-\"&(MID(Q12,5,3))&\"-\"&(MID(Q12,8,2))&\"-\"&(MID(Q12,10,2))&\"   \"&(MID(Q12,12,1))&\"-\"&(MID(Q12,13,3))&\"-\"&(MID(Q12,16,3))&\"-\"&(MID(Q12,19,2))&\"-\"&(MID(Q12,21,2))&\"   \"&(MID(Q12,23,1))&\"-\"&(MID(Q12,24,3))&\"-\"&(MID(Q12,27,3))&\"-\"&(MID(Q12,30,2))&\"-\"&(MID(Q12,32,2))","v":"7-771-835-95-68   0----   ----"}]
["",null,"","","","","",null,null,{"$f":"IFERROR(IFERROR(VLOOKUP(C13,#REF!,3,0)*D13,VLOOKUP(C13,#REF!,7,0)*D13),\"нет веса\")","v":"нет веса"},"Доставка:","-",null,null,null,{"$f":"IF(L13=\"-\",IFERROR(НайтиСтрокуПоСлову(\"Комментарий\",K27:K60),0),L13)","v":0}]
["",null,"","","","","",null,null,{"$f":"IFERROR(IFERROR(VLOOKUP(C14,#REF!,3,0)*D14,VLOOKUP(C14,#REF!,7,0)*D14),\"нет веса\")","v":"нет веса"},"Оплата:","-",null,null,null,{"$f":"MID(L14,23,70)","v":""}]
["",null,"","","","","",null,null,{"$f":"IFERROR(IFERROR(VLOOKUP(C15,#REF!,3,0)*D15,VLOOKUP(C15,#REF!,7,0)*D15),\"нет веса\")","v":"нет веса"},null,null,null,null,null,{"$f":"IF(LEFT(P14,2)=\"EX\",MID(L15,11,70),L15)","v":0},{"$f":"TEXT(SUM(MID(0&P15,LARGE(ISNUMBER(-MID(P15,ROW($1:$88),1))*ROW($1:$88),ROW($1:$15)+15)+1,1)*10^ROW($1:$15)/10),REPT(0,MIN(MAX(COUNT(1/(MID(P15,ROW($1:$88),1)+1))-15,),15)))&TEXT(SUM(MID(0&P15,LARGE(ISNUMBER(-MID(P15,ROW($1:$88),1))*ROW($1:$88),ROW($1:$15))+1,1)*10^ROW($1:$15)/10),REPT(0,MIN(COUNT(1/(MID(P15,ROW($1:$88),1)+1)),15)))","v":"0"},{"$f":"SUMPRODUCT(--SUBSTITUTE(Q15:Q15,CHAR(160),))","v":0},{"$f":"LEN(Q15)","v":1},{"$f":"FLOOR(S15/3,1)","v":0}]
["",null,"","","","","",null,null,{"$f":"IFERROR(IFERROR(VLOOKUP(C16,#REF!,3,0)*D16,VLOOKUP(C16,#REF!,7,0)*D16),\"нет веса\")","v":"нет веса"},"Адрес доставки:","Индекс:",null,null,null,{"$f":"MID(L16,9,70)","v":""}]
["",null,"","","","","",null,null,{"$f":"IFERROR(IFERROR(VLOOKUP(C17,#REF!,3,0)*D17,VLOOKUP(C17,#REF!,7,0)*D17),\"нет веса\")","v":"нет веса"},null,"Страна:",null,null,null,{"$f":"MID(L17,9,70)","v":""},{"$f":"IF(LEFT(K17,4)=\"ваша\",VALUE(MID(K17,13,20))*100,0)","v":0}]
["",null,"","","","","",null,null,{"$f":"IFERROR(IFERROR(VLOOKUP(C18,#REF!,3,0)*D18,VLOOKUP(C18,#REF!,7,0)*D18),\"нет веса\")","v":"нет веса"},null,"Область:",null,null,null,{"$f":"MID(L18,10,70)","v":""}]
["",null,"","","","","",null,null,{"$f":"IFERROR(IFERROR(VLOOKUP(C19,#REF!,3,0)*D19,VLOOKUP(C19,#REF!,7,0)*D19),\"нет веса\")","v":"нет веса"},null,"Город: Тараз",null,null,null,{"$f":"MID(L19,8,70)","v":"Тараз"},{"$f":"IF(LEFT(K19,4)=\"ваша\",VALUE(MID(K19,13,20))*100,0)","v":0}]
["",null,"","","","","",null,null,{"$f":"IFERROR(IFERROR(VLOOKUP(C20,#REF!,3,0)*D20,VLOOKUP(C20,#REF!,7,0)*D20),\"нет веса\")","v":"нет веса"},null,"Улица: Перепелкина",null,null,null,{"$f":"MID(L20,8,70)","v":"Перепелкина"},{"$f":"IF(LEFT(K31,4)=\"ваша\",VALUE(MID(K31,13,20))*100,0)","v":0}]
["",null,"","","","","",null,null,{"$f":"IFERROR(IFERROR(VLOOKUP(C21,#REF!,3,0)*D21,VLOOKUP(C21,#REF!,7,0)*D21),\"нет веса\")","v":"нет веса"},null,"Здание: 36",null,null,null,{"$f":"MID(L21,9,70)","v":"36"},{"$f":"IF(LEFT(K32,4)=\"ваша\",VALUE(MID(K32,13,20))*100,0)","v":0}]
["",null,"","","","","",null,null,{"$f":"IFERROR(IFERROR(VLOOKUP(C22,#REF!,3,0)*D22,VLOOKUP(C22,#REF!,7,0)*D22),\"нет веса\")","v":"нет веса"},null,"Квартира: -",null,null,null,{"$f":"MID(L22,11,70)","v":"-"},{"$f":"IF(LEFT(#REF!,4)=\"ваша\",VALUE(MID(#REF!,13,20))*100,0)","v":{"$error":"#REF!"}}]
["",null,null,null,"Итого:",{"$f":"SUM(F7:F22)","v":3480},"",null,null,{"$f":"IF(K40>0,M40,\"\")","v":""},"Комментарий :",null,null,null,null,null,{"$f":"IF(LEFT(K33,4)=\"ваша\",VALUE(MID(K33,13,20))*100,0)","v":0}]
[{"$f":"IF(L41>0,N41,\"\")","v":""},null,null,"скидка:",{"$f":"IF(F23>150000,10,IF(F23>100000,8,IF(F23>60000,5,IF(F23>30000,3,0))))","v":0},{"$f":"F23-(F23*E24/100)","v":3480},{"$f":"IFERROR(SUM(I7:I22)-F29+1,0)","v":1},null,null,null,null,null,null,null,null,{"$f":"N24","v":0},{"$f":"TEXT(SUM(MID(0&P24,LARGE(ISNUMBER(-MID(P24,ROW($1:$88),1))*ROW($1:$88),ROW($1:$15)+15)+1,1)*10^ROW($1:$15)/10),REPT(0,MIN(MAX(COUNT(1/(MID(P24,ROW($1:$88),1)+1))-15,),15)))&TEXT(SUM(MID(0&P24,LARGE(ISNUMBER(-MID(P24,ROW($1:$88),1))*ROW($1:$88),ROW($1:$15))+1,1)*10^ROW($1:$15)/10),REPT(0,MIN(COUNT(1/(MID(P24,ROW($1:$88),1)+1)),15)))","v":"0"}]
[{"$f":"SUM(A7:A23)/1000*1.3","v":1.9422000000000002E-2},null,{"$f":"IF(E25=F26,\"Доставка БЕСПЛАТНО\",IF(E25=D26,C26,IF(E25=D27,C27,IF(E25=D28,C28,IF(E25=F27,C27&\" + НПл\",IF(E25=F28,C28&\" + НПл\",\"Укажите ТК\"))))))","v":"AVIS EXPRESS  Тараз"},2,{"$f":"D28","v":1400},null,{"$f":"IF(I25 >0,TODAY(),\"\")","v":""},null,null,{"$f":"SUM(J7:J22)/1000","v":0},"Наименование","Количество","Цена","Вес","Всего",{"$f":"E25","v":1400},{"$f":"TEXT(SUM(MID(0&P25,LARGE(ISNUMBER(-MID(P25,ROW($1:$88),1))*ROW($1:$88),ROW($1:$15)+15)+1,1)*10^ROW($1:$15)/10),REPT(0,MIN(MAX(COUNT(1/(MID(P25,ROW($1:$88),1)+1))-15,),15)))&TEXT(SUM(MID(0&P25,LARGE(ISNUMBER(-MID(P25,ROW($1:$88),1))*ROW($1:$88),ROW($1:$15))+1,1)*10^ROW($1:$15)/10),REPT(0,MIN(COUNT(1/(MID(P25,ROW($1:$88),1)+1)),15)))","v":"1400"},{"$f":"E25","v":1400},{"$f":"TEXT(SUM(MID(0&R25,LARGE(ISNUMBER(-MID(R25,ROW($1:$88),1))*ROW($1:$88),ROW($1:$15)+15)+1,1)*10^ROW($1:$15)/10),REPT(0,MIN(MAX(COUNT(1/(MID(R25,ROW($1:$88),1)+1))-15,),15)))&TEXT(SUM(MID(0&R25,LARGE(ISNUMBER(-MID(R25,ROW($1:$88),1))*ROW($1:$88),ROW($1:$15))+1,1)*10^ROW($1:$15)/10),REPT(0,MIN(COUNT(1/(MID(R25,ROW($1:$88),1)+1)),15)))","v":"1400"},null,{"$f":"TEXT(SUM(MID(0&E25,LARGE(ISNUMBER(-MID(E25,ROW($1:$88),1))*ROW($1:$88),ROW($1:$15)+15)+1,1)*10^ROW($1:$15)/10),REPT(0,MIN(MAX(COUNT(1/(MID(E25,ROW($1:$88),1)+1))-15,),15)))&TEXT(SUM(MID(0&E25,LARGE(ISNUMBER(-MID(E25,ROW($1:$88),1))*ROW($1:$88),ROW($1:$15))+1,1)*10^ROW($1:$15)/10),REPT(0,MIN(COUNT(1/(MID(E25,ROW($1:$88),1)+1)),15)))","v":{"$error":"#NUM!"}}]
[null,null,{"$f":"IFERROR(\"AVIS С А М О В Ы В О З \"&\"  \"&VLOOKUP((LEFT(B34,(LEN(B34)))),'ТАРИФЫ ТК'!J17:L268,1,0),\"НЕТ ДОСТАВКИ\")","v":"AVIS С А М О В Ы В О З   Тараз"},{"$f":"IFERROR(VLOOKUP((LEFT(B34,(LEN(B34)))),'ТАРИФЫ ТК'!J17:L268,3,0)+0.001,\"НЕТ ДОСТАВКИ\")","v":1550.001},{"$f":"IFERROR(F24+D26,\"НЕТ ДОСТАВКИ\")","v":5030.0010000000002},{"$f":"IFERROR(D26&\" + НПл\",\"НЕТ ДОСТАВКИ\")","v":"1550,001 + НПл"},{"$f":"IFERROR(CEILING((F24+D26)*(1+$D$25/100),50),0)","v":5150},null,null,null,"Неодимовый магнит D20x10mm(Аксиал)`42 (сила притяжения 14 кг)",4,870,94,3480,{"$f":"N26","v":94},{"$f":"TEXT(SUM(MID(0&P26,LARGE(ISNUMBER(-MID(P26,ROW($1:$88),1))*ROW($1:$88),ROW($1:$15)+15)+1,1)*10^ROW($1:$15)/10),REPT(0,MIN(MAX(COUNT(1/(MID(P26,ROW($1:$88),1)+1))-15,),15)))&TEXT(SUM(MID(0&P26,LARGE(ISNUMBER(-MID(P26,ROW($1:$88),1))*ROW($1:$88),ROW($1:$15))+1,1)*10^ROW($1:$15)/10),REPT(0,MIN(COUNT(1/(MID(P26,ROW($1:$88),1)+1)),15)))","v":"94"}]
[null,null,{"$f":"IFERROR(\"AVIS Econom\"&\"  \"&VLOOKUP((LEFT(B34,(LEN(B34)))),'ТАРИФЫ ТК'!A4:A134,1,0),\"НЕТ ДОСТАВКИ\")","v":"AVIS Econom  Тараз"},{"$f":"IFERROR(VLOOKUP((LEFT(B34,(LEN(B34)))),'ТАРИФЫ ТК'!A4:C134,3,0),\"НЕТ ДОСТАВКИ\")","v":1300},{"$f":"IFERROR(F24+D27,\"НЕТ ДОСТАВКИ\")","v":4780},{"$f":"IFERROR(D27&\" + НПл\",\"НЕТ ДОСТАВКИ\")","v":"1300 + НПл"},{"$f":"IFERROR(CEILING((F24+D27)*(1+$D$25/100),50),0)","v":4900},null,null,null,"Общий вес:94",null,null,null,null,0,{"$f":"TEXT(SUM(MID(0&P27,LARGE(ISNUMBER(-MID(P27,ROW($1:$88),1))*ROW($1:$88),ROW($1:$15)+15)+1,1)*10^ROW($1:$15)/10),REPT(0,MIN(MAX(COUNT(1/(MID(P27,ROW($1:$88),1)+1))-15,),15)))&TEXT(SUM(MID(0&P27,LARGE(ISNUMBER(-MID(P27,ROW($1:$88),1))*ROW($1:$88),ROW($1:$15))+1,1)*10^ROW($1:$15)/10),REPT(0,MIN(COUNT(1/(MID(P27,ROW($1:$88),1)+1)),15)))","v":"0"}]
[null,null,{"$f":"IFERROR(IF(A29<1,\"AVIS EXPRESS\"&\"  \"&VLOOKUP((LEFT(B34,(LEN(B34)))),'ТАРИФЫ ТК'!E4:G20,1,0),\"AV ВИМАНИЕ:   В Е С    П О С Ы Л К И    Б О Л Ь Ш Е   0,5 КГ   !!!\"),\"НЕТ ДОСТАВКИ\")","v":"AVIS EXPRESS  Тараз"},{"$f":"IFERROR(VLOOKUP((LEFT(B34,(LEN(B34)))),'ТАРИФЫ ТК'!E4:G20,3,0),\"НЕТ ДОСТАВКИ\")","v":1400},{"$f":"IFERROR(F24+D28,\"НЕТ ДОСТАВКИ\")","v":4880},{"$f":"D28&\" + НПл\"","v":"1400 + НПл"},{"$f":"IFERROR(CEILING((F24+D28)*(1+$D$25/100),50),\"НЕТ ДОСТАВКИ\")","v":5000},null,null,null,"Итого:3500",null,null,null,null,0,{"$f":"TEXT(SUM(MID(0&P28,LARGE(ISNUMBER(-MID(P28,ROW($1:$88),1))*ROW($1:$88),ROW($1:$15)+15)+1,1)*10^ROW($1:$15)/10),REPT(0,MIN(MAX(COUNT(1/(MID(P28,ROW($1:$88),1)+1))-15,),15)))&TEXT(SUM(MID(0&P28,LARGE(ISNUMBER(-MID(P28,ROW($1:$88),1))*ROW($1:$88),ROW($1:$15))+1,1)*10^ROW($1:$15)/10),REPT(0,MIN(COUNT(1/(MID(P28,ROW($1:$88),1)+1)),15)))","v":"0"}]
[{"$f":"IFERROR(A25*1.5,\"Количество ??\")","v":2.9133000000000003E-2},null,null,"К ОПЛАТЕ:",{"$f":"IFERROR(F24+E25,0)","v":4880},{"$f":"IF(E25=C29,\"Доставка БЕСПЛАТНО\",IF(E25=D26,E26,IF(E25=D27,E27,IF(E25=D28,E28,IF(E25=F27,G27,IF(E25=F28,G28,IF(E25=F26,G26,\"Укажите ТК\")))))))","v":4880},{"$f":"IFERROR(CEILING((F24+E25)*1.03,50),0)","v":5050},null,null,{"$f":"IFERROR(J25*1.5,\"Количество ??\")","v":0},null,null,null,null,null,0,{"$f":"TEXT(SUM(MID(0&P29,LARGE(ISNUMBER(-MID(P29,ROW($1:$88),1))*ROW($1:$88),ROW($1:$15)+15)+1,1)*10^ROW($1:$15)/10),REPT(0,MIN(MAX(COUNT(1/(MID(P29,ROW($1:$88),1)+1))-15,),15)))&TEXT(SUM(MID(0&P29,LARGE(ISNUMBER(-MID(P29,ROW($1:$88),1))*ROW($1:$88),ROW($1:$15))+1,1)*10^ROW($1:$15)/10),REPT(0,MIN(COUNT(1/(MID(P29,ROW($1:$88),1)+1)),15)))","v":"0"}]
["rc11091kz",null,{"$f":"IFERROR((P14&\"        \"&LEFT(P15,8)&\" = \"&TEXT(R15,\"### ### ###\")&\" т.\"),\"НЕТ ДОСТАВКИ\")","v":"        0 =  т."},null,{"$f":"IFERROR(\"QIWI = \"&CEILING((E26*1.02),10),0)","v":"QIWI = 5140"},{"$f":"IFERROR(F29-F24,\"УКАЖИТЕ ТК\")","v":1400},null,null,null,null,null,null,null,null,null,0,{"$f":"TEXT(SUM(MID(0&P30,LARGE(ISNUMBER(-MID(P30,ROW($1:$88),1))*ROW($1:$88),ROW($1:$15)+15)+1,1)*10^ROW($1:$15)/10),REPT(0,MIN(MAX(COUNT(1/(MID(P30,ROW($1:$88),1)+1))-15,),15)))&TEXT(SUM(MID(0&P30,LARGE(ISNUMBER(-MID(P30,ROW($1:$88),1))*ROW($1:$88),ROW($1:$15))+1,1)*10^ROW($1:$15)/10),REPT(0,MIN(COUNT(1/(MID(P30,ROW($1:$88),1)+1)),15)))","v":"0"}]
[{"$f":"A1","v":"+KASPI+ 9641++0"},"ПОЛУЧАТЕЛЬ:","rc11091kz",null,null,null,null,null,null,null,null,null,null,null,null,0,{"$f":"TEXT(SUM(MID(0&P31,LARGE(ISNUMBER(-MID(P31,ROW($1:$88),1))*ROW($1:$88),ROW($1:$15)+15)+1,1)*10^ROW($1:$15)/10),REPT(0,MIN(MAX(COUNT(1/(MID(P31,ROW($1:$88),1)+1))-15,),15)))&TEXT(SUM(MID(0&P31,LARGE(ISNUMBER(-MID(P31,ROW($1:$88),1))*ROW($1:$88),ROW($1:$15))+1,1)*10^ROW($1:$15)/10),REPT(0,MIN(COUNT(1/(MID(P31,ROW($1:$88),1)+1)),15)))","v":"0"}]
[{"$f":"UPPER((B3))","v":"КУЗНЕЦОВА ЛАРИСА"},null,{"$f":"IFERROR(MID(НайтиСтрокуПоСлову(\"Комментарий: Имя :\",K1:K45),20,99),0)","v":0},null,null,null,null,null,null,null,"Назад",null,null,null,null,0,{"$f":"TEXT(SUM(MID(0&P32,LARGE(ISNUMBER(-MID(P32,ROW($1:$88),1))*ROW($1:$88),ROW($1:$15)+15)+1,1)*10^ROW($1:$15)/10),REPT(0,MIN(MAX(COUNT(1/(MID(P32,ROW($1:$88),1)+1))-15,),15)))&TEXT(SUM(MID(0&P32,LARGE(ISNUMBER(-MID(P32,ROW($1:$88),1))*ROW($1:$88),ROW($1:$15))+1,1)*10^ROW($1:$15)/10),REPT(0,MIN(COUNT(1/(MID(P32,ROW($1:$88),1)+1)),15)))","v":"0"}]
["Область: ",{"$f":"UPPER((P18))","v":""},{"$f":"IFERROR(ПоискСНачала(C32,\"Телефон\"),0)","v":0},null,{"$f":"IFERROR(ПоискМежду(C32,\"Телефон :\",\"Примечание\"),0)","v":0},{"$f":"IFERROR(IF(LEFT(ПоискСКонца(C32,\"Примечание : \"),2)=\"г \",MID(ПоискСКонца(C32,\"Примечание : \"),3,99),IF(LEFT(ПоискСКонца(C32,\"Примечание : \"),3)=\"г. \",MID(ПоискСКонца(C32,\"Примечание : \"),4,99),IF(LEFT(ПоискСКонца(C32,\"Примечание : \"),3)=\"гор\",MID(ПоискСКонца(C32,\"Примечание : \"),6,99),0))),0)","v":0},null,null,null,null,null,null,null,null,null,0,{"$f":"TEXT(SUM(MID(0&P33,LARGE(ISNUMBER(-MID(P33,ROW($1:$88),1))*ROW($1:$88),ROW($1:$15)+15)+1,1)*10^ROW($1:$15)/10),REPT(0,MIN(MAX(COUNT(1/(MID(P33,ROW($1:$88),1)+1))-15,),15)))&TEXT(SUM(MID(0&P33,LARGE(ISNUMBER(-MID(P33,ROW($1:$88),1))*ROW($1:$88),ROW($1:$15))+1,1)*10^ROW($1:$15)/10),REPT(0,MIN(COUNT(1/(MID(P33,ROW($1:$88),1)+1)),15)))","v":"0"}]
["Город: ",{"$f":"UPPER((P19))","v":"ТАРАЗ"},null,null,null,null,null,null,null,null,null,null,null,null,null,0,{"$f":"TEXT(SUM(MID(0&P34,LARGE(ISNUMBER(-MID(P34,ROW($1:$88),1))*ROW($1:$88),ROW($1:$15)+15)+1,1)*10^ROW($1:$15)/10),REPT(0,MIN(MAX(COUNT(1/(MID(P34,ROW($1:$88),1)+1))-15,),15)))&TEXT(SUM(MID(0&P34,LARGE(ISNUMBER(-MID(P34,ROW($1:$88),1))*ROW($1:$88),ROW($1:$15))+1,1)*10^ROW($1:$15)/10),REPT(0,MIN(COUNT(1/(MID(P34,ROW($1:$88),1)+1)),15)))","v":"0"}]
["Улица: ",{"$f":"UPPER((P20))","v":"ПЕРЕПЕЛКИНА"},null,null,null,null,null,null,null,null,null,null,null,null,null,0,{"$f":"TEXT(SUM(MID(0&P35,LARGE(ISNUMBER(-MID(P35,ROW($1:$88),1))*ROW($1:$88),ROW($1:$15)+15)+1,1)*10^ROW($1:$15)/10),REPT(0,MIN(MAX(COUNT(1/(MID(P35,ROW($1:$88),1)+1))-15,),15)))&TEXT(SUM(MID(0&P35,LARGE(ISNUMBER(-MID(P35,ROW($1:$88),1))*ROW($1:$88),ROW($1:$15))+1,1)*10^ROW($1:$15)/10),REPT(0,MIN(COUNT(1/(MID(P35,ROW($1:$88),1)+1)),15)))","v":"0"}]
["Здание: ",{"$f":"P21","v":"36"},null,null,null,null,null,null,null,null,null,null,null,null,null,0,{"$f":"TEXT(SUM(MID(0&P36,LARGE(ISNUMBER(-MID(P36,ROW($1:$88),1))*ROW($1:$88),ROW($1:$15)+15)+1,1)*10^ROW($1:$15)/10),REPT(0,MIN(MAX(COUNT(1/(MID(P36,ROW($1:$88),1)+1))-15,),15)))&TEXT(SUM(MID(0&P36,LARGE(ISNUMBER(-MID(P36,ROW($1:$88),1))*ROW($1:$88),ROW($1:$15))+1,1)*10^ROW($1:$15)/10),REPT(0,MIN(COUNT(1/(MID(P36,ROW($1:$88),1)+1)),15)))","v":"0"}]
["Квартира: ",{"$f":"P22","v":"-"},null,null,null,null,null,null,null,null,null,null,null,null,null,0,{"$f":"TEXT(SUM(MID(0&P37,LARGE(ISNUMBER(-MID(P37,ROW($1:$88),1))*ROW($1:$88),ROW($1:$15)+15)+1,1)*10^ROW($1:$15)/10),REPT(0,MIN(MAX(COUNT(1/(MID(P37,ROW($1:$88),1)+1))-15,),15)))&TEXT(SUM(MID(0&P37,LARGE(ISNUMBER(-MID(P37,ROW($1:$88),1))*ROW($1:$88),ROW($1:$15))+1,1)*10^ROW($1:$15)/10),REPT(0,MIN(COUNT(1/(MID(P37,ROW($1:$88),1)+1)),15)))","v":"0"}]
["Телефон: ",{"$f":"B4","v":"7-771-835-95-68   0----   ----"},null,null,null,null,null,null,null,null,null,null,null,null,null,0,{"$f":"TEXT(SUM(MID(0&P38,LARGE(ISNUMBER(-MID(P38,ROW($1:$88),1))*ROW($1:$88),ROW($1:$15)+15)+1,1)*10^ROW($1:$15)/10),REPT(0,MIN(MAX(COUNT(1/(MID(P38,ROW($1:$88),1)+1))-15,),15)))&TEXT(SUM(MID(0&P38,LARGE(ISNUMBER(-MID(P38,ROW($1:$88),1))*ROW($1:$88),ROW($1:$15))+1,1)*10^ROW($1:$15)/10),REPT(0,MIN(COUNT(1/(MID(P38,ROW($1:$88),1)+1)),15)))","v":"0"}]
["Индекс: ",{"$f":"P16","v":""},null,null,null,null,null,null,null,null,null,null,null,null,null,null,{"$f":"IF(LEFT(#REF!,4)=\"ваша\",VALUE(MID(#REF!,13,20))*100,0)","v":{"$error":"#REF!"}}]
["Компания:",null,null,null,null,null,null,null,null,null,null,null,null,null,null,null,{"$f":"IF(LEFT(#REF!,4)=\"ваша\",VALUE(MID(#REF!,13,20))*100,0)","v":{"$error":"#REF!"}}]
["ИИН:",{"$f":"F29","v":4880},null,null,null,null,null,null,null,null,null,null,null,null,null,null,{"$f":"IF(LEFT(#REF!,4)=\"ваша\",VALUE(MID(#REF!,13,20))*100,0)","v":{"$error":"#REF!"}}]
["------------------------","----------------------------------------------------","----------------------------------------------------","------------------------","------------------------","---------------------------","------------------------------","------------------------","------------------------",null,null,null,null,null,null,null,{"$f":"SUM(Q19:Q41)","v":{"$error":"#REF!"}}]

{"sheet":"+KASPI+1200820_2++0","index":3,"n_rows":42,"n_cols":21,"rows_kept":42,"cut":false,"hidden":false,"merged":[[27,6,27,8],[31,0,31,1],[37,1,37,2],[0,4,0,7],[1,4,1,8],[2,1,2,2],[3,1,3,2],[25,6,25,8],[26,6,26,8]]}
[{"$f":"IF(LEFT(C29,2)=\"сп\",P1&\" ► СП\",IF(E25=D26,P1,IF(H6<>0,P1&\"++\"&\"0\",IF(E25=D27,P1&\"++\"&\"0\",IF(E25=D28,P1&\"++\"&\"0\",IF(E25=D27,P1&\"++\"&\"0\",IF(E25=D28,P1&\"++\"&\"0\",IF(LEFT(C25,2)=\"AV\",P1&\"++\"&F29,P1))))))))","v":"+KASPI+1200820_2++0"},"2020-08-12",{"$f":"IF(E2>0,\"ОТПРАВЛЕНО\",IF(LEFT(C29,3)=\"ЗАК\",\"ЗАКАЗАНО в СПБ\",IF(G24>=0,\"ОПЛОЧЕНО\",\"ОЖИДАНИЕ ОПЛАТЫ\")))","v":"ОТПРАВЛЕНО"},{"$f":"'СПИСОК ЗАКАЗОВ'!B1","v":21},"2020-08-17",null,null,null,{"$f":"A1","v":"+KASPI+1200820_2++0"},null,"1200820_2",null,null,null,null,{"$f":"IF(G24>0,\"+\"&H6&\"+\"&Q1,Q1)","v":"+KASPI+1200820_2"},{"$f":"ПоискСКонца(K1,\"№\")","v":"1200820_2"}]
["Логин",{"$f":"L3","v":"Логин"},"Номер накл-ой",null,3611551,null,null,null,null,null,"Примечание"]
["ФИО",{"$f":"IF(C32=0,UPPER((P9)),UPPER(C33))","v":"АДИЛХАНОВ БАХТИАР"},null,null,null,null,null,null,null,null,"Логин","Логин"]
["Телефон",{"$f":"R12","v":"8-776-640-42-21   0----   ----"},null,null,{"$f":"IF(F4>0.5,\"оплачено\",IF(F4<0,\"ОПЛАТИТЬ= \"&G4,\"ОПЛАТИТЬ= \"&Q25))","v":"ОПЛАТИТЬ= 1400"},0,1100,null,null,null,"Дата заказа","дата заказа"]
["e-mail:",{"$f":"L11","v":"мыло"}]
["Вес","ПРИМЕЧАНИЯ","Наименование","Кол-во","Цена","Всего",{"$f":"IF(MAX(G7:G25)>0,MAX(G7:G25),\"\")","v":"2020-08-21"},{"$f":"IF(I7>0,\"НАЛ\",IF(I8>0,\"ПЕРЕВОД\",IF(I9>0,\"Beeline\",IF(I10>0,\"KASPI\",IF(I11>0,\"QIWI\",IF(I12>0,\"СЧЁТ Альфа-Банк\",0))))))","v":"KASPI"},{"$f":"SUM(I7:I28)","v":19400}]
[{"$f":"IF(L24>0,Q24*1/100,\"\")","v":""},"списано","Неодимовый магнит D5x1mm(Аксиал)`42 (сила притяжения 0,2 кг)",1000,18,{"$f":"IF(D7<>\"\",E7*D7,\"\")","v":18000},{"$f":"IF(I7 >0,TODAY(),\"\")","v":""},"НАЛ",null,{"$f":"IFERROR(IFERROR(VLOOKUP(C7,#REF!,3,0)*D7,VLOOKUP(C7,#REF!,7,0)*D7),\"нет веса\")","v":"нет веса"},"Заказ №2080"]
[{"$f":"IF(L25>0,Q25*1/100,\"\")","v":""},null,{"$f":"IF(L27<>\"\",K27,\"\")","v":""},{"$f":"IF(L27>0,L27,\"\")","v":""},{"$f":"IF(M27=\"уточняйте\",0,IF(L27>0,M27,\"\"))","v":""},"","","ПЕРЕВОД",null,{"$f":"IFERROR(IFERROR(VLOOKUP(C8,#REF!,3,0)*D8,VLOOKUP(C8,#REF!,7,0)*D8),\"нет веса\")","v":"нет веса"}]
[{"$f":"IF(L26>0,Q26*1/100,\"\")","v":""},null,"","","","","","Beeline",null,{"$f":"IFERROR(IFERROR(VLOOKUP(C9,#REF!,3,0)*D9,VLOOKUP(C9,#REF!,7,0)*D9),\"нет веса\")","v":"нет веса"},"Здравствуйте, Адилханов Бахтиар",null,null,null,null,{"$f":"MID(K9,15,70)","v":"Адилханов Бахтиар"},{"$f":"TEXT(SUM(MID(0&L9,LARGE(ISNUMBER(-MID(L9,ROW($1:$96),1))*ROW($1:$96),ROW($1:$23)+15)+1,1)*10^ROW($1:$23)/10),REPT(0,MIN(MAX(COUNT(1/(MID(L9,ROW($1:$96),1)+1))-15,),15)))&TEXT(SUM(MID(0&L9,LARGE(ISNUMBER(-MID(L9,ROW($1:$96),1))*ROW($1:$96),ROW($1:$23))+1,1)*10^ROW($1:$23)/10),REPT(0,MIN(COUNT(1/(MID(L9,ROW($1:$96),1)+1)),15)))","v":""}]
["",null,"","","","","2020-08-21","KASPI",{"$f":"F29","v":19400},{"$f":"IFERROR(IFERROR(VLOOKUP(C10,#REF!,3,0)*D10,VLOOKUP(C10,#REF!,7,0)*D10),\"нет веса\")","v":"нет веса"},"Мы получили Ваш заказ номер, 2080"]
["",null,"","","","","","QIWI",null,{"$f":"IFERROR(IFERROR(VLOOKUP(C11,#REF!,3,0)*D11,VLOOKUP(C11,#REF!,7,0)*D11),\"нет веса\")","v":"нет веса"},"Электронная почта","мыло"]
["",null,"","","","","","СЧЁТ Альфа-Банк",null,{"$f":"IFERROR(IFERROR(VLOOKUP(C12,#REF!,3,0)*D12,VLOOKUP(C12,#REF!,7,0)*D12),\"нет веса\")","v":"нет веса"},"Контактный телефон","87766404221",null,null,null,{"$f":"(L12&\"  \"&P13)","v":"87766404221  0"},{"$f":"TEXT(SUM(MID(0&P12,LARGE(ISNUMBER(-MID(P12,ROW($1:$99),1))*ROW($1:$99),ROW($1:$15)+30)+1,1)*10^ROW($1:$15)/10),REPT(0,MIN(MAX(COUNT(1/(MID(P12,ROW($1:$99),1)+1))-30,),15)))&TEXT(SUM(MID(0&P12,LARGE(ISNUMBER(-MID(P12,ROW($1:$99),1))*ROW($1:$99),ROW($1:$15)+15)+1,1)*10^ROW($1:$15)/10),REPT(0,MIN(MAX(COUNT(1/(MID(P12,ROW($1:$99),1)+1))-15,),15)))&TEXT(SUM(MID(0&P12,LARGE(ISNUMBER(-MID(P12,ROW($1:$99),1))*ROW($1:$99),ROW($1:$15))+1,1)*10^ROW($1:$15)/10),REPT(0,MIN(COUNT(1/(MID(P12,ROW($1:$99),1)+1)),15)))","v":"877664042210"},{"$f":"(MID(Q12,1,1))&\"-\"&(MID(Q12,2,3))&\"-\"&(MID(Q12,5,3))&\"-\"&(MID(Q12,8,2))&\"-\"&(MID(Q12,10,2))&\"   \"&(MID(Q12,12,1))&\"-\"&(MID(Q12,13,3))&\"-\"&(MID(Q12,16,3))&\"-\"&(MID(Q12,19,2))&\"-\"&(MID(Q12,21,2))&\"   \"&(MID(Q12,23,1))&\"-\"&(MID(Q12,24,3))&\"-\"&(MID(Q12,27,3))&\"-\"&(MID(Q12,30,2))&\"-\"&(MID(Q12,32,2))","v":"8-776-640-42-21   0----   ----"}]
["",null,"","","","","",null,null,{"$f":"IFERROR(IFERROR(VLOOKUP(C13,#REF!,3,0)*D13,VLOOKUP(C13,#REF!,7,0)*D13),\"нет веса\")","v":"нет веса"},null,null,null,null,null,{"$f":"IF(L13=\"-\",IFERROR(НайтиСтрокуПоСлову(\"Комментарий\",K27:K60),0),L13)","v":0}]
["",null,"","","","","",null,null,{"$f":"IFERROR(IFERROR(VLOOKUP(C14,#REF!,3,0)*D14,VLOOKUP(C14,#REF!,7,0)*D14),\"нет веса\")","v":"нет веса"},"Доставка:",null,null,null,null,{"$f":"MID(L14,23,70)","v":""}]
["",null,"","","","","",null,null,{"$f":"IFERROR(IFERROR(VLOOKUP(C15,#REF!,3,0)*D15,VLOOKUP(C15,#REF!,7,0)*D15),\"нет веса\")","v":"нет веса"},"Оплата:",null,null,null,null,{"$f":"IF(LEFT(P14,2)=\"EX\",MID(L15,11,70),L15)","v":0},{"$f":"TEXT(SUM(MID(0&P15,LARGE(ISNUMBER(-MID(P15,ROW($1:$88),1))*ROW($1:$88),ROW($1:$15)+15)+1,1)*10^ROW($1:$15)/10),REPT(0,MIN(MAX(COUNT(1/(MID(P15,ROW($1:$88),1)+1))-15,),15)))&TEXT(SUM(MID(0&P15,LARGE(ISNUMBER(-MID(P15,ROW($1:$88),1))*ROW($1:$88),ROW($1:$15))+1,1)*10^ROW($1:$15)/10),REPT(0,MIN(COUNT(1/(MID(P15,ROW($1:$88),1)+1)),15)))","v":"0"},{"$f":"SUMPRODUCT(--SUBSTITUTE(Q15:Q15,CHAR(160),))","v":0},{"$f":"LEN(Q15)","v":1},{"$f":"FLOOR(S15/3,1)","v":0}]
["",null,"","","","","",null,null,{"$f":"IFERROR(IFERROR(VLOOKUP(C16,#REF!,3,0)*D16,VLOOKUP(C16,#REF!,7,0)*D16),\"нет веса\")","v":"нет веса"},"Адрес доставки","Индекс: ",null,null,null,{"$f":"MID(L16,9,70)","v":""}]
["",null,"","","","","",null,null,{"$f":"IFERROR(IFERROR(VLOOKUP(C17,#REF!,3,0)*D17,VLOOKUP(C17,#REF!,7,0)*D17),\"нет веса\")","v":"нет веса"},null,"Страна: ",null,null,null,{"$f":"MID(L17,9,70)","v":""},{"$f":"IF(LEFT(K17,4)=\"ваша\",VALUE(MID(K17,13,20))*100,0)","v":0}]
["",null,"","","","","",null,null,{"$f":"IFERROR(IFERROR(VLOOKUP(C18,#REF!,3,0)*D18,VLOOKUP(C18,#REF!,7,0)*D18),\"нет веса\")","v":"нет веса"},null,"Область: ",null,null,null,{"$f":"MID(L18,10,70)","v":""}]
["",null,"","","","","",null,null,{"$f":"IFERROR(IFERROR(VLOOKUP(C19,#REF!,3,0)*D19,VLOOKUP(C19,#REF!,7,0)*D19),\"нет веса\")","v":"нет веса"},null,"Город: ",null,null,null,{"$f":"MID(L19,8,70)","v":""},{"$f":"IF(LEFT(K19,4)=\"ваша\",VALUE(MID(K19,13,20))*100,0)","v":0}]
["",null,"","","","","",null,null,{"$f":"IFERROR(IFERROR(VLOOKUP(C20,#REF!,3,0)*D20,VLOOKUP(C20,#REF!,7,0)*D20),\"нет веса\")","v":"нет веса"},null,"Улица: ",null,null,null,{"$f":"MID(L20,8,70)","v":""},{"$f":"IF(LEFT(K31,4)=\"ваша\",VALUE(MID(K31,13,20))*100,0)","v":0}]
["",null,"","","","","",null,null,{"$f":"IFERROR(IFERROR(VLOOKUP(C21,#REF!,3,0)*D21,VLOOKUP(C21,#REF!,7,0)*D21),\"нет веса\")","v":"нет веса"},null,"Здание: ",null,null,null,{"$f":"MID(L21,9,70)","v":""},{"$f":"IF(LEFT(K32,4)=\"ваша\",VALUE(MID(K32,13,20))*100,0)","v":0}]
["",null,"","","","","",null,null,{"$f":"IFERROR(IFERROR(VLOOKUP(C22,#REF!,3,0)*D22,VLOOKUP(C22,#REF!,7,0)*D22),\"нет веса\")","v":"нет веса"},null,"Квартира: ",null,null,null,{"$f":"MID(L22,11,70)","v":""},{"$f":"IF(LEFT(#REF!,4)=\"ваша\",VALUE(MID(#REF!,13,20))*100,0)","v":{"$error":"#REF!"}}]
["",null,null,null,"Итого:",{"$f":"SUM(F7:F22)","v":18000},"",null,null,{"$f":"IF(K40>0,M40,\"\")","v":""},"Наименование","Количество","Цена","Вес","Всего",null,{"$f":"IF(LEFT(K33,4)=\"ваша\",VALUE(MID(K33,13,20))*100,0)","v":0}]
[{"$f":"IF(L41>0,N41,\"\")","v":""},null,null,"скидка:",{"$f":"IF(F23>150000,10,IF(F23>100000,8,IF(F23>60000,5,IF(F23>30000,3,0))))","v":0},{"$f":"F23-(F23*E24/100)","v":18000},{"$f":"IFERROR(SUM(I7:I22)-F29+1,0)","v":1},null,null,null,null,null,null,null,null,{"$f":"N24","v":0},{"$f":"TEXT(SUM(MID(0&P24,LARGE(ISNUMBER(-MID(P24,ROW($1:$88),1))*ROW($1:$88),ROW($1:$15)+15)+1,1)*10^ROW($1:$15)/10),REPT(0,MIN(MAX(COUNT(1/(MID(P24,ROW($1:$88),1)+1))-15,),15)))&TEXT(SUM(MID(0&P24,LARGE(ISNUMBER(-MID(P24,ROW($1:$88),1))*ROW($1:$88),ROW($1:$15))+1,1)*10^ROW($1:$15)/10),REPT(0,MIN(COUNT(1/(MID(P24,ROW($1:$88),1)+1)),15)))","v":"0"}]
[{"$f":"SUM(A7:A23)/1000*1.3","v":0},null,{"$f":"IF(E25=F26,\"Доставка БЕСПЛАТНО\",IF(E25=D26,C26,IF(E25=D27,C27,IF(E25=D28,C28,IF(E25=F27,C27&\" + НПл\",IF(E25=F28,C28&\" + НПл\",\"Укажите ТК\"))))))","v":"AVIS EXPRESS  Тараз"},2,{"$f":"D28","v":1400},null,{"$f":"IF(I25 >0,TODAY(),\"\")","v":""},null,null,{"$f":"SUM(J7:J22)/1000","v":0},null,null,null,null,null,{"$f":"E25","v":1400},{"$f":"TEXT(SUM(MID(0&P25,LARGE(ISNUMBER(-MID(P25,ROW($1:$88),1))*ROW($1:$88),ROW($1:$15)+15)+1,1)*10^ROW($1:$15)/10),REPT(0,MIN(MAX(COUNT(1/(MID(P25,ROW($1:$88),1)+1))-15,),15)))&TEXT(SUM(MID(0&P25,LARGE(ISNUMBER(-MID(P25,ROW($1:$88),1))*ROW($1:$88),ROW($1:$15))+1,1)*10^ROW($1:$15)/10),REPT(0,MIN(COUNT(1/(MID(P25,ROW($1:$88),1)+1)),15)))","v":"1400"},{"$f":"E25","v":1400},{"$f":"TEXT(SUM(MID(0&R25,LARGE(ISNUMBER(-MID(R25,ROW($1:$88),1))*ROW($1:$88),ROW($1:$15)+15)+1,1)*10^ROW($1:$15)/10),REPT(0,MIN(MAX(COUNT(1/(MID(R25,ROW($1:$88),1)+1))-15,),15)))&TEXT(SUM(MID(0&R25,LARGE(ISNUMBER(-MID(R25,ROW($1:$88),1))*ROW($1:$88),ROW($1:$15))+1,1)*10^ROW($1:$15)/10),REPT(0,MIN(COUNT(1/(MID(R25,ROW($1:$88),1)+1)),15)))","v":"1400"},null,{"$f":"TEXT(SUM(MID(0&E25,LARGE(ISNUMBER(-MID(E25,ROW($1:$88),1))*ROW($1:$88),ROW($1:$15)+15)+1,1)*10^ROW($1:$15)/10),REPT(0,MIN(MAX(COUNT(1/(MID(E25,ROW($1:$88),1)+1))-15,),15)))&TEXT(SUM(MID(0&E25,LARGE(ISNUMBER(-MID(E25,ROW($1:$88),1))*ROW($1:$88),ROW($1:$15))+1,1)*10^ROW($1:$15)/10),REPT(0,MIN(COUNT(1/(MID(E25,ROW($1:$88),1)+1)),15)))","v":{"$error":"#NUM!"}}]
[null,null,{"$f":"IFERROR(\"AVIS С А М О В Ы В О З \"&\"  \"&VLOOKUP((LEFT(B34,(LEN(B34)))),'ТАРИФЫ ТК'!J17:L268,1,0),\"НЕТ ДОСТАВКИ\")","v":"AVIS С А М О В Ы В О З   Тараз"},{"$f":"IFERROR(VLOOKUP((LEFT(B34,(LEN(B34)))),'ТАРИФЫ ТК'!J17:L268,3,0)+0.001,\"НЕТ ДОСТАВКИ\")","v":1550.001},{"$f":"IFERROR(F24+D26,\"НЕТ ДОСТАВКИ\")","v":19550.001},{"$f":"IFERROR(D26&\" + НПл\",\"НЕТ ДОСТАВКИ\")","v":"1550,001 + НПл"},{"$f":"IFERROR(CEILING((F24+D26)*(1+$D$25/100),50),0)","v":19950},null,null,null,null,null,null,null,null,{"$f":"N26","v":0},{"$f":"TEXT(SUM(MID(0&P26,LARGE(ISNUMBER(-MID(P26,ROW($1:$88),1))*ROW($1:$88),ROW($1:$15)+15)+1,1)*10^ROW($1:$15)/10),REPT(0,MIN(MAX(COUNT(1/(MID(P26,ROW($1:$88),1)+1))-15,),15)))&TEXT(SUM(MID(0&P26,LARGE(ISNUMBER(-MID(P26,ROW($1:$88),1))*ROW($1:$88),ROW($1:$15))+1,1)*10^ROW($1:$15)/10),REPT(0,MIN(COUNT(1/(MID(P26,ROW($1:$88),1)+1)),15)))","v":"0"}]
[null,null,{"$f":"IFERROR(\"AVIS Econom\"&\"  \"&VLOOKUP((LEFT(B34,(LEN(B34)))),'ТАРИФЫ ТК'!A4:A134,1,0),\"НЕТ ДОСТАВКИ\")","v":"AVIS Econom  Тараз"},{"$f":"IFERROR(VLOOKUP((LEFT(B34,(LEN(B34)))),'ТАРИФЫ ТК'!A4:C134,3,0),\"НЕТ ДОСТАВКИ\")","v":1300},{"$f":"IFERROR(F24+D27,\"НЕТ ДОСТАВКИ\")","v":19300},{"$f":"IFERROR(D27&\" + НПл\",\"НЕТ ДОСТАВКИ\")","v":"1300 + НПл"},{"$f":"IFERROR(CEILING((F24+D27)*(1+$D$25/100),50),0)","v":19700},null,null,null,null,null,null,null,null,0,{"$f":"TEXT(SUM(MID(0&P27,LARGE(ISNUMBER(-MID(P27,ROW($1:$88),1))*ROW($1:$88),ROW($1:$15)+15)+1,1)*10^ROW($1:$15)/10),REPT(0,MIN(MAX(COUNT(1/(MID(P27,ROW($1:$88),1)+1))-15,),15)))&TEXT(SUM(MID(0&P27,LARGE(ISNUMBER(-MID(P27,ROW($1:$88),1))*ROW($1:$88),ROW($1:$15))+1,1)*10^ROW($1:$15)/10),REPT(0,MIN(COUNT(1/(MID(P27,ROW($1:$88),1)+1)),15)))","v":"0"}]
[null,null,{"$f":"IFERROR(IF(A29<1,\"AVIS EXPRESS\"&\"  \"&VLOOKUP((LEFT(B34,(LEN(B34)))),'ТАРИФЫ ТК'!E4:G20,1,0),\"AV ВИМАНИЕ:   В Е С    П О С Ы Л К И    Б О Л Ь Ш Е   0,5 КГ   !!!\"),\"НЕТ ДОСТАВКИ\")","v":"AVIS EXPRESS  Тараз"},{"$f":"IFERROR(VLOOKUP((LEFT(B34,(LEN(B34)))),'ТАРИФЫ ТК'!E4:G20,3,0),\"НЕТ ДОСТАВКИ\")","v":1400},{"$f":"IFERROR(F24+D28,\"НЕТ ДОСТАВКИ\")","v":19400},{"$f":"D28&\" + НПл\"","v":"1400 + НПл"},{"$f":"IFERROR(CEILING((F24+D28)*(1+$D$25/100),50),\"НЕТ ДОСТАВКИ\")","v":19800},null,null,null,null,null,null,null,null,0,{"$f":"TEXT(SUM(MID(0&P28,LARGE(ISNUMBER(-MID(P28,ROW($1:$88),1))*ROW($1:$88),ROW($1:$15)+15)+1,1)*10^ROW($1:$15)/10),REPT(0,MIN(MAX(COUNT(1/(MID(P28,ROW($1:$88),1)+1))-15,),15)))&TEXT(SUM(MID(0&P28,LARGE(ISNUMBER(-MID(P28,ROW($1:$88),1))*ROW($1:$88),ROW($1:$15))+1,1)*10^ROW($1:$15)/10),REPT(0,MIN(COUNT(1/(MID(P28,ROW($1:$88),1)+1)),15)))","v":"0"}]
[{"$f":"IFERROR(A25*1.5,\"Количество ??\")","v":0},null,null,"К ОПЛАТЕ:",{"$f":"IFERROR(F24+E25,0)","v":19400},{"$f":"IF(E25=C29,\"Доставка БЕСПЛАТНО\",IF(E25=D26,E26,IF(E25=D27,E27,IF(E25=D28,E28,IF(E25=F27,G27,IF(E25=F28,G28,IF(E25=F26,G26,\"Укажите ТК\")))))))","v":19400},{"$f":"IFERROR(CEILING((F24+E25)*1.03,50),0)","v":20000},null,null,{"$f":"IFERROR(J25*1.5,\"Количество ??\")","v":0},null,null,null,null,null,0,{"$f":"TEXT(SUM(MID(0&P29,LARGE(ISNUMBER(-MID(P29,ROW($1:$88),1))*ROW($1:$88),ROW($1:$15)+15)+1,1)*10^ROW($1:$15)/10),REPT(0,MIN(MAX(COUNT(1/(MID(P29,ROW($1:$88),1)+1))-15,),15)))&TEXT(SUM(MID(0&P29,LARGE(ISNUMBER(-MID(P29,ROW($1:$88),1))*ROW($1:$88),ROW($1:$15))+1,1)*10^ROW($1:$15)/10),REPT(0,MIN(COUNT(1/(MID(P29,ROW($1:$88),1)+1)),15)))","v":"0"}]
["rc11091kz",null,{"$f":"IFERROR((P14&\"        \"&LEFT(P15,8)&\" = \"&TEXT(R15,\"### ### ###\")&\" т.\"),\"НЕТ ДОСТАВКИ\")","v":"        0 =  т."},null,{"$f":"IFERROR(\"QIWI = \"&CEILING((E26*1.02),10),0)","v":"QIWI = 19950"},{"$f":"IFERROR(F29-F24,\"УКАЖИТЕ ТК\")","v":1400},null,null,null,null,null,null,null,null,null,0,{"$f":"TEXT(SUM(MID(0&P30,LARGE(ISNUMBER(-MID(P30,ROW($1:$88),1))*ROW($1:$88),ROW($1:$15)+15)+1,1)*10^ROW($1:$15)/10),REPT(0,MIN(MAX(COUNT(1/(MID(P30,ROW($1:$88),1)+1))-15,),15)))&TEXT(SUM(MID(0&P30,LARGE(ISNUMBER(-MID(P30,ROW($1:$88),1))*ROW($1:$88),ROW($1:$15))+1,1)*10^ROW($1:$15)/10),REPT(0,MIN(COUNT(1/(MID(P30,ROW($1:$88),1)+1)),15)))","v":"0"}]
[{"$f":"A1","v":"+KASPI+1200820_2++0"},"ПОЛУЧАТЕЛЬ:","rc11091kz",null,null,null,null,null,null,null,null,null,null,null,null,0,{"$f":"TEXT(SUM(MID(0&P31,LARGE(ISNUMBER(-MID(P31,ROW($1:$88),1))*ROW($1:$88),ROW($1:$15)+15)+1,1)*10^ROW($1:$15)/10),REPT(0,MIN(MAX(COUNT(1/(MID(P31,ROW($1:$88),1)+1))-15,),15)))&TEXT(SUM(MID(0&P31,LARGE(ISNUMBER(-MID(P31,ROW($1:$88),1))*ROW($1:$88),ROW($1:$15))+1,1)*10^ROW($1:$15)/10),REPT(0,MIN(COUNT(1/(MID(P31,ROW($1:$88),1)+1)),15)))","v":"0"}]
[{"$f":"UPPER((B3))","v":"АДИЛХАНОВ БАХТИАР"},null,{"$f":"IFERROR(MID(НайтиСтрокуПоСлову(\"Комментарий: Имя :\",K1:K45),20,99),0)","v":0},null,null,null,null,null,null,null,null,null,null,null,null,0,{"$f":"TEXT(SUM(MID(0&P32,LARGE(ISNUMBER(-MID(P32,ROW($1:$88),1))*ROW($1:$88),ROW($1:$15)+15)+1,1)*10^ROW($1:$15)/10),REPT(0,MIN(MAX(COUNT(1/(MID(P32,ROW($1:$88),1)+1))-15,),15)))&TEXT(SUM(MID(0&P32,LARGE(ISNUMBER(-MID(P32,ROW($1:$88),1))*ROW($1:$88),ROW($1:$15))+1,1)*10^ROW($1:$15)/10),REPT(0,MIN(COUNT(1/(MID(P32,ROW($1:$88),1)+1)),15)))","v":"0"}]
["Область: ",{"$f":"UPPER((P18))","v":""},{"$f":"IFERROR(ПоискСНачала(C32,\"Телефон\"),0)","v":0},null,{"$f":"IFERROR(ПоискМежду(C32,\"Телефон :\",\"Примечание\"),0)","v":0},{"$f":"IFERROR(IF(LEFT(ПоискСКонца(C32,\"Примечание : \"),2)=\"г \",MID(ПоискСКонца(C32,\"Примечание : \"),3,99),IF(LEFT(ПоискСКонца(C32,\"Примечание : \"),3)=\"г. \",MID(ПоискСКонца(C32,\"Примечание : \"),4,99),IF(LEFT(ПоискСКонца(C32,\"Примечание : \"),3)=\"гор\",MID(ПоискСКонца(C32,\"Примечание : \"),6,99),0))),0)","v":0},null,null,null,null,null,null,null,null,null,0,{"$f":"TEXT(SUM(MID(0&P33,LARGE(ISNUMBER(-MID(P33,ROW($1:$88),1))*ROW($1:$88),ROW($1:$15)+15)+1,1)*10^ROW($1:$15)/10),REPT(0,MIN(MAX(COUNT(1/(MID(P33,ROW($1:$88),1)+1))-15,),15)))&TEXT(SUM(MID(0&P33,LARGE(ISNUMBER(-MID(P33,ROW($1:$88),1))*ROW($1:$88),ROW($1:$15))+1,1)*10^ROW($1:$15)/10),REPT(0,MIN(COUNT(1/(MID(P33,ROW($1:$88),1)+1)),15)))","v":"0"}]
["Город: ","Тараз",null,null,null,null,null,null,null,null,null,null,null,null,null,0,{"$f":"TEXT(SUM(MID(0&P34,LARGE(ISNUMBER(-MID(P34,ROW($1:$88),1))*ROW($1:$88),ROW($1:$15)+15)+1,1)*10^ROW($1:$15)/10),REPT(0,MIN(MAX(COUNT(1/(MID(P34,ROW($1:$88),1)+1))-15,),15)))&TEXT(SUM(MID(0&P34,LARGE(ISNUMBER(-MID(P34,ROW($1:$88),1))*ROW($1:$88),ROW($1:$15))+1,1)*10^ROW($1:$15)/10),REPT(0,MIN(COUNT(1/(MID(P34,ROW($1:$88),1)+1)),15)))","v":"0"}]
["Улица: ","Жансая",null,null,null,null,null,null,null,null,null,null,null,null,null,0,{"$f":"TEXT(SUM(MID(0&P35,LARGE(ISNUMBER(-MID(P35,ROW($1:$88),1))*ROW($1:$88),ROW($1:$15)+15)+1,1)*10^ROW($1:$15)/10),REPT(0,MIN(MAX(COUNT(1/(MID(P35,ROW($1:$88),1)+1))-15,),15)))&TEXT(SUM(MID(0&P35,LARGE(ISNUMBER(-MID(P35,ROW($1:$88),1))*ROW($1:$88),ROW($1:$15))+1,1)*10^ROW($1:$15)/10),REPT(0,MIN(COUNT(1/(MID(P35,ROW($1:$88),1)+1)),15)))","v":"0"}]
["Здание: ",43,null,null,null,null,null,null,null,null,null,null,null,null,null,0,{"$f":"TEXT(SUM(MID(0&P36,LARGE(ISNUMBER(-MID(P36,ROW($1:$88),1))*ROW($1:$88),ROW($1:$15)+15)+1,1)*10^ROW($1:$15)/10),REPT(0,MIN(MAX(COUNT(1/(MID(P36,ROW($1:$88),1)+1))-15,),15)))&TEXT(SUM(MID(0&P36,LARGE(ISNUMBER(-MID(P36,ROW($1:$88),1))*ROW($1:$88),ROW($1:$15))+1,1)*10^ROW($1:$15)/10),REPT(0,MIN(COUNT(1/(MID(P36,ROW($1:$88),1)+1)),15)))","v":"0"}]
["Квартира: ",87,null,null,null,null,null,null,null,null,null,null,null,null,null,0,{"$f":"TEXT(SUM(MID(0&P37,LARGE(ISNUMBER(-MID(P37,ROW($1:$88),1))*ROW($1:$88),ROW($1:$15)+15)+1,1)*10^ROW($1:$15)/10),REPT(0,MIN(MAX(COUNT(1/(MID(P37,ROW($1:$88),1)+1))-15,),15)))&TEXT(SUM(MID(0&P37,LARGE(ISNUMBER(-MID(P37,ROW($1:$88),1))*ROW($1:$88),ROW($1:$15))+1,1)*10^ROW($1:$15)/10),REPT(0,MIN(COUNT(1/(MID(P37,ROW($1:$88),1)+1)),15)))","v":"0"}]
["Телефон: ",{"$f":"B4","v":"8-776-640-42-21   0----   ----"},null,null,null,null,null,null,null,null,null,null,null,null,null,0,{"$f":"TEXT(SUM(MID(0&P38,LARGE(ISNUMBER(-MID(P38,ROW($1:$88),1))*ROW($1:$88),ROW($1:$15)+15)+1,1)*10^ROW($1:$15)/10),REPT(0,MIN(MAX(COUNT(1/(MID(P38,ROW($1:$88),1)+1))-15,),15)))&TEXT(SUM(MID(0&P38,LARGE(ISNUMBER(-MID(P38,ROW($1:$88),1))*ROW($1:$88),ROW($1:$15))+1,1)*10^ROW($1:$15)/10),REPT(0,MIN(COUNT(1/(MID(P38,ROW($1:$88),1)+1)),15)))","v":"0"}]
["Индекс: ",{"$f":"P16","v":""},null,null,null,null,null,null,null,null,null,null,null,null,null,null,{"$f":"IF(LEFT(#REF!,4)=\"ваша\",VALUE(MID(#REF!,13,20))*100,0)","v":{"$error":"#REF!"}}]
["Компания:",null,null,null,null,null,null,null,null,null,null,null,null,null,null,null,{"$f":"IF(LEFT(#REF!,4)=\"ваша\",VALUE(MID(#REF!,13,20))*100,0)","v":{"$error":"#REF!"}}]
["ИИН:",{"$f":"F29","v":19400},null,null,null,null,null,null,null,null,null,null,null,null,null,null,{"$f":"IF(LEFT(#REF!,4)=\"ваша\",VALUE(MID(#REF!,13,20))*100,0)","v":{"$error":"#REF!"}}]
["------------------------","----------------------------------------------------","----------------------------------------------------","------------------------","------------------------","---------------------------","------------------------------","------------------------","------------------------",null,null,null,null,null,null,null,{"$f":"SUM(Q19:Q41)","v":{"$error":"#REF!"}}]

{"sheet":" 9639++11550","index":4,"n_rows":42,"n_cols":21,"rows_kept":42,"cut":false,"hidden":false,"merged":[[27,6,27,8],[31,0,31,1],[37,1,37,2],[0,4,0,7],[1,4,1,8],[2,1,2,2],[3,1,3,2],[25,6,25,8],[26,6,26,8]]}
[{"$f":"IF(LEFT(C29,2)=\"сп\",P1&\" ► СП\",IF(E25=D26,P1,IF(H6<>0,P1&\"++\"&\"0\",IF(E25=D27,P1&\"++\"&\"0\",IF(E25=D28,P1&\"++\"&\"0\",IF(E25=D27,P1&\"++\"&\"0\",IF(E25=D28,P1&\"++\"&\"0\",IF(LEFT(C25,2)=\"AV\",P1&\"++\"&F29,P1))))))))","v":" 9639++11550"},{"$f":"L4","v":"2020-08-15T15:08:12"},{"$f":"IF(E2>0,\"ОТПРАВЛЕНО\",IF(LEFT(C29,3)=\"ЗАК\",\"ЗАКАЗАНО в СПБ\",IF(G24>=0,\"ОПЛОЧЕНО\",\"ОЖИДАНИЕ ОПЛАТЫ\")))","v":"ОТПРАВЛЕНО"},{"$f":"'СПИСОК ЗАКАЗОВ'!B1","v":21},"2020-08-17",null,null,null,{"$f":"A1","v":" 9639++11550"},null,"Заказ № 9639",null,null,null,null,{"$f":"IF(G24>0,\"+\"&H6&\"+\"&Q1,Q1)","v":" 9639"},{"$f":"ПоискСКонца(K1,\"№\")","v":" 9639"}]
["Логин",{"$f":"L3","v":0},"Номер накл-ой",null,3611552,null,null,null,null,null,"Примечание"]
["ФИО",{"$f":"IF(C32=0,UPPER((P9)),UPPER(C33))","v":"НУРЖАН ИСАБАЕВ"},null,null,null,null,null,null,null,null,"Логин"]
["Телефон",{"$f":"R12","v":"7-700-404-04-50   0----   ----"},null,null,{"$f":"IF(F4>0.5,\"оплачено\",IF(F4<0,\"ОПЛАТИТЬ= \"&G4,\"ОПЛАТИТЬ= \"&Q25))","v":"ОПЛАТИТЬ= 1400"},0,1100,null,null,null,"Дата заказа","2020-08-15T15:08:12"]
["e-mail:",{"$f":"L11","v":"-"}]
["Вес","ПРИМЕЧАНИЯ","Наименование","Кол-во","Цена","Всего",{"$f":"IF(MAX(G7:G25)>0,MAX(G7:G25),\"\")","v":""},{"$f":"IF(I7>0,\"НАЛ\",IF(I8>0,\"ПЕРЕВОД\",IF(I9>0,\"Beeline\",IF(I10>0,\"KASPI\",IF(I11>0,\"QIWI\",IF(I12>0,\"СЧЁТ Альфа-Банк\",0))))))","v":0},{"$f":"SUM(I7:I28)","v":0}]
[{"$f":"IF(L24>0,Q24*1/100,\"\")","v":""},"списано",{"$f":"IF(L26<>\"\",K26,\"\")","v":"Неодимовый магнит D50x30mm(Аксиал)`42 (сила притяжения 120 кг)"},{"$f":"IF(L26>0,L26,\"\")","v":1},{"$f":"IF(M26=\"уточняйте\",0,IF(L26>0,M26,\"\"))","v":9900},{"$f":"IF(D7<>\"\",E7*D7,\"\")","v":9900},{"$f":"IF(I7 >0,TODAY(),\"\")","v":""},"НАЛ",null,{"$f":"IFERROR(IFERROR(VLOOKUP(C7,#REF!,3,0)*D7,VLOOKUP(C7,#REF!,7,0)*D7),\"нет веса\")","v":"нет веса"},"Заказ №9639"]
[{"$f":"IF(L25>0,Q25*1/100,\"\")","v":14},null,{"$f":"IF(L27<>\"\",K27,\"\")","v":""},{"$f":"IF(L27>0,L27,\"\")","v":""},{"$f":"IF(M27=\"уточняйте\",0,IF(L27>0,M27,\"\"))","v":""},"","","ПЕРЕВОД",null,{"$f":"IFERROR(IFERROR(VLOOKUP(C8,#REF!,3,0)*D8,VLOOKUP(C8,#REF!,7,0)*D8),\"нет веса\")","v":"нет веса"}]
[{"$f":"IF(L26>0,Q26*1/100,\"\")","v":4.42},null,"","","","","","Beeline",null,{"$f":"IFERROR(IFERROR(VLOOKUP(C9,#REF!,3,0)*D9,VLOOKUP(C9,#REF!,7,0)*D9),\"нет веса\")","v":"нет веса"},"Здравствуйте, Нуржан Исабаев",null,null,null,null,{"$f":"MID(K9,15,70)","v":"Нуржан Исабаев"},{"$f":"TEXT(SUM(MID(0&L9,LARGE(ISNUMBER(-MID(L9,ROW($1:$96),1))*ROW($1:$96),ROW($1:$23)+15)+1,1)*10^ROW($1:$23)/10),REPT(0,MIN(MAX(COUNT(1/(MID(L9,ROW($1:$96),1)+1))-15,),15)))&TEXT(SUM(MID(0&L9,LARGE(ISNUMBER(-MID(L9,ROW($1:$96),1))*ROW($1:$96),ROW($1:$23))+1,1)*10^ROW($1:$23)/10),REPT(0,MIN(COUNT(1/(MID(L9,ROW($1:$96),1)+1)),15)))","v":""}]
["",null,"","","","","","KASPI",null,{"$f":"IFERROR(IFERROR(VLOOKUP(C10,#REF!,3,0)*D10,VLOOKUP(C10,#REF!,7,0)*D10),\"нет веса\")","v":"нет веса"},"Мы получили Ваш заказ номер, 9639"]
["",null,"","","","","","QIWI",null,{"$f":"IFERROR(IFERROR(VLOOKUP(C11,#REF!,3,0)*D11,VLOOKUP(C11,#REF!,7,0)*D11),\"нет веса\")","v":"нет веса"},"Электронная почта:","-"]
["",null,"","","","","","СЧЁТ Альфа-Банк",null,{"$f":"IFERROR(IFERROR(VLOOKUP(C12,#REF!,3,0)*D12,VLOOKUP(C12,#REF!,7,0)*D12),\"нет веса\")","v":"нет веса"},"Контактный телефон:","+7 (700) 404-04-50",null,null,null,{"$f":"(L12&\"  \"&P13)","v":"+7 (700) 404-04-50  0"},{"$f":"TEXT(SUM(MID(0&P12,LARGE(ISNUMBER(-MID(P12,ROW($1:$99),1))*ROW($1:$99),ROW($1:$15)+30)+1,1)*10^ROW($1:$15)/10),REPT(0,MIN(MAX(COUNT(1/(MID(P12,ROW($1:$99),1)+1))-30,),15)))&TEXT(SUM(MID(0&P12,LARGE(ISNUMBER(-MID(P12,ROW($1:$99),1))*ROW($1:$99),ROW($1:$15)+15)+1,1)*10^ROW($1:$15)/10),REPT(0,MIN(MAX(COUNT(1/(MID(P12,ROW($1:$99),1)+1))-15,),15)))&TEXT(SUM(MID(0&P12,LARGE(ISNUMBER(-MID(P12,ROW($1:$99),1))*ROW($1:$99),ROW($1:$15))+1,1)*10^ROW($1:$15)/10),REPT(0,MIN(COUNT(1/(MID(P12,ROW($1:$99),1)+1)),15)))","v":"770040404500"},{"$f":"(MID(Q12,1,1))&\"-\"&(MID(Q12,2,3))&\"-\"&(MID(Q12,5,3))&\"-\"&(MID(Q12,8,2))&\"-\"&(MID(Q12,10,2))&\"   \"&(MID(Q12,12,1))&\"-\"&(MID(Q12,13,3))&\"-\"&(MID(Q12,16,3))&\"-\"&(MID(Q12,19,2))&\"-\"&(MID(Q12,21,2))&\"   \"&(MID(Q12,23,1))&\"-\"&(MID(Q12,24,3))&\"-\"&(MID(Q12,27,3))&\"-\"&(MID(Q12,30,2))&\"-\"&(MID(Q12,32,2))","v":"7-700-404-04-50   0----   ----"}]
["",null,"","","","","",null,null,{"$f":"IFERROR(IFERROR(VLOOKUP(C13,#REF!,3,0)*D13,VLOOKUP(C13,#REF!,7,0)*D13),\"нет веса\")","v":"нет веса"},"Доставка:","-",null,null,null,{"$f":"IF(L13=\"-\",IFERROR(НайтиСтрокуПоСлову(\"Комментарий\",K27:K60),0),L13)","v":0}]
["",null,"","","","","",null,null,{"$f":"IFERROR(IFERROR(VLOOKUP(C14,#REF!,3,0)*D14,VLOOKUP(C14,#REF!,7,0)*D14),\"нет веса\")","v":"нет веса"},"Оплата:","-",null,null,null,{"$f":"MID(L14,23,70)","v":""}]
["",null,"","","","","",null,null,{"$f":"IFERROR(IFERROR(VLOOKUP(C15,#REF!,3,0)*D15,VLOOKUP(C15,#REF!,7,0)*D15),\"нет веса\")","v":"нет веса"},null,null,null,null,null,{"$f":"IF(LEFT(P14,2)=\"EX\",MID(L15,11,70),L15)","v":0},{"$f":"TEXT(SUM(MID(0&P15,LARGE(ISNUMBER(-MID(P15,ROW($1:$88),1))*ROW($1:$88),ROW($1:$15)+15)+1,1)*10^ROW($1:$15)/10),REPT(0,MIN(MAX(COUNT(1/(MID(P15,ROW($1:$88),1)+1))-15,),15)))&TEXT(SUM(MID(0&P15,LARGE(ISNUMBER(-MID(P15,ROW($1:$88),1))*ROW($1:$88),ROW($1:$15))+1,1)*10^ROW($1:$15)/10),REPT(0,MIN(COUNT(1/(MID(P15,ROW($1:$88),1)+1)),15)))","v":"0"},{"$f":"SUMPRODUCT(--SUBSTITUTE(Q15:Q15,CHAR(160),))","v":0},{"$f":"LEN(Q15)","v":1},{"$f":"FLOOR(S15/3,1)","v":0}]
["",null,"","","","","",null,null,{"$f":"IFERROR(IFERROR(VLOOKUP(C16,#REF!,3,0)*D16,VLOOKUP(C16,#REF!,7,0)*D16),\"нет веса\")","v":"нет веса"},"Адрес доставки:","Индекс:",null,null,null,{"$f":"MID(L16,9,70)","v":""}]
["",null,"","","","","",null,null,{"$f":"IFERROR(IFERROR(VLOOKUP(C17,#REF!,3,0)*D17,VLOOKUP(C17,#REF!,7,0)*D17),\"нет веса\")","v":"нет веса"},null,"Страна:",null,null,null,{"$f":"MID(L17,9,70)","v":""},{"$f":"IF(LEFT(K17,4)=\"ваша\",VALUE(MID(K17,13,20))*100,0)","v":0}]
["",null,"","","","","",null,null,{"$f":"IFERROR(IFERROR(VLOOKUP(C18,#REF!,3,0)*D18,VLOOKUP(C18,#REF!,7,0)*D18),\"нет веса\")","v":"нет веса"},null,"Область:",null,null,null,{"$f":"MID(L18,10,70)","v":""}]
["",null,"","","","","",null,null,{"$f":"IFERROR(IFERROR(VLOOKUP(C19,#REF!,3,0)*D19,VLOOKUP(C19,#REF!,7,0)*D19),\"нет веса\")","v":"нет веса"},null,"Город: Караганда",null,null,null,{"$f":"MID(L19,8,70)","v":"Караганда"},{"$f":"IF(LEFT(K19,4)=\"ваша\",VALUE(MID(K19,13,20))*100,0)","v":0}]
["",null,"","","","","",null,null,{"$f":"IFERROR(IFERROR(VLOOKUP(C20,#REF!,3,0)*D20,VLOOKUP(C20,#REF!,7,0)*D20),\"нет веса\")","v":"нет веса"},null,"Улица: Н. Назарбаева",null,null,null,{"$f":"MID(L20,8,70)","v":"Н. Назарбаева"},{"$f":"IF(LEFT(K31,4)=\"ваша\",VALUE(MID(K31,13,20))*100,0)","v":0}]
["",null,"","","","","",null,null,{"$f":"IFERROR(IFERROR(VLOOKUP(C21,#REF!,3,0)*D21,VLOOKUP(C21,#REF!,7,0)*D21),\"нет веса\")","v":"нет веса"},null,"Здание: 59",null,null,null,{"$f":"MID(L21,9,70)","v":"59"},{"$f":"IF(LEFT(K32,4)=\"ваша\",VALUE(MID(K32,13,20))*100,0)","v":0}]
["",null,"","","","","",null,null,{"$f":"IFERROR(IFERROR(VLOOKUP(C22,#REF!,3,0)*D22,VLOOKUP(C22,#REF!,7,0)*D22),\"нет веса\")","v":"нет веса"},null,"Квартира: 130",null,null,null,{"$f":"MID(L22,11,70)","v":"130"},{"$f":"IF(LEFT(#REF!,4)=\"ваша\",VALUE(MID(#REF!,13,20))*100,0)","v":{"$error":"#REF!"}}]
["",null,null,null,"Итого:",{"$f":"SUM(F7:F22)","v":9900},"",null,null,{"$f":"IF(K40>0,M40,\"\")","v":""},"Комментарий :",null,null,null,null,null,{"$f":"IF(LEFT(K33,4)=\"ваша\",VALUE(MID(K33,13,20))*100,0)","v":0}]
[{"$f":"IF(L41>0,N41,\"\")","v":""},null,null,"скидка:",{"$f":"IF(F23>150000,10,IF(F23>100000,8,IF(F23>60000,5,IF(F23>30000,3,0))))","v":0},{"$f":"F23-(F23*E24/100)","v":9900},{"$f":"IFERROR(SUM(I7:I22)-F29+1,0)","v":-11549},null,null,null,null,null,null,null,null,{"$f":"N24","v":0},{"$f":"TEXT(SUM(MID(0&P24,LARGE(ISNUMBER(-MID(P24,ROW($1:$88),1))*ROW($1:$88),ROW($1:$15)+15)+1,1)*10^ROW($1:$15)/10),REPT(0,MIN(MAX(COUNT(1/(MID(P24,ROW($1:$88),1)+1))-15,),15)))&TEXT(SUM(MID(0&P24,LARGE(ISNUMBER(-MID(P24,ROW($1:$88),1))*ROW($1:$88),ROW($1:$15))+1,1)*10^ROW($1:$15)/10),REPT(0,MIN(COUNT(1/(MID(P24,ROW($1:$88),1)+1)),15)))","v":"0"}]
[{"$f":"SUM(A7:A23)/1000*1.3","v":2.3946000000000005E-2},null,{"$f":"IF(E25=F26,\"Доставка БЕСПЛАТНО\",IF(E25=D26,C26,IF(E25=D27,C27,IF(E25=D28,C28,IF(E25=F27,C27&\" + НПл\",IF(E25=F28,C28&\" + НПл\",\"Укажите ТК\"))))))","v":"AVIS EXPRESS  Караганда + НПл"},2,{"$f":"F28","v":"1400 + НПл"},null,{"$f":"IF(I25 >0,TODAY(),\"\")","v":""},null,null,{"$f":"SUM(J7:J22)/1000","v":0},"Наименование","Количество","Цена","Вес","Всего",{"$f":"E25","v":"1400 + НПл"},{"$f":"TEXT(SUM(MID(0&P25,LARGE(ISNUMBER(-MID(P25,ROW($1:$88),1))*ROW($1:$88),ROW($1:$15)+15)+1,1)*10^ROW($1:$15)/10),REPT(0,MIN(MAX(COUNT(1/(MID(P25,ROW($1:$88),1)+1))-15,),15)))&TEXT(SUM(MID(0&P25,LARGE(ISNUMBER(-MID(P25,ROW($1:$88),1))*ROW($1:$88),ROW($1:$15))+1,1)*10^ROW($1:$15)/10),REPT(0,MIN(COUNT(1/(MID(P25,ROW($1:$88),1)+1)),15)))","v":"1400"},{"$f":"E25","v":"1400 + НПл"},{"$f":"TEXT(SUM(MID(0&R25,LARGE(ISNUMBER(-MID(R25,ROW($1:$88),1))*ROW($1:$88),ROW($1:$15)+15)+1,1)*10^ROW($1:$15)/10),REPT(0,MIN(MAX(COUNT(1/(MID(R25,ROW($1:$88),1)+1))-15,),15)))&TEXT(SUM(MID(0&R25,LARGE(ISNUMBER(-MID(R25,ROW($1:$88),1))*ROW($1:$88),ROW($1:$15))+1,1)*10^ROW($1:$15)/10),REPT(0,MIN(COUNT(1/(MID(R25,ROW($1:$88),1)+1)),15)))","v":"1400"},null,{"$f":"TEXT(SUM(MID(0&E25,LARGE(ISNUMBER(-MID(E25,ROW($1:$88),1))*ROW($1:$88),ROW($1:$15)+15)+1,1)*10^ROW($1:$15)/10),REPT(0,MIN(MAX(COUNT(1/(MID(E25,ROW($1:$88),1)+1))-15,),15)))&TEXT(SUM(MID(0&E25,LARGE(ISNUMBER(-MID(E25,ROW($1:$88),1))*ROW($1:$88),ROW($1:$15))+1,1)*10^ROW($1:$15)/10),REPT(0,MIN(COUNT(1/(MID(E25,ROW($1:$88),1)+1)),15)))","v":{"$error":"#NUM!"}}]
[null,null,{"$f":"IFERROR(\"AVIS С А М О В Ы В О З \"&\"  \"&VLOOKUP((LEFT(B34,(LEN(B34)))),'ТАРИФЫ ТК'!J17:L268,1,0),\"НЕТ ДОСТАВКИ\")","v":"AVIS С А М О В Ы В О З   Караганда"},{"$f":"IFERROR(VLOOKUP((LEFT(B34,(LEN(B34)))),'ТАРИФЫ ТК'!J17:L268,3,0)+0.001,\"НЕТ ДОСТАВКИ\")","v":1550.001},{"$f":"IFERROR(F24+D26,\"НЕТ ДОСТАВКИ\")","v":11450.001},{"$f":"IFERROR(D26&\" + НПл\",\"НЕТ ДОСТАВКИ\")","v":"1550,001 + НПл"},{"$f":"IFERROR(CEILING((F24+D26)*(1+$D$25/100),50),0)","v":11700},null,null,null,"Неодимовый магнит D50x30mm(Аксиал)`42 (сила притяжения 120 кг)",1,9900,442,9900,{"$f":"N26","v":442},{"$f":"TEXT(SUM(MID(0&P26,LARGE(ISNUMBER(-MID(P26,ROW($1:$88),1))*ROW($1:$88),ROW($1:$15)+15)+1,1)*10^ROW($1:$15)/10),REPT(0,MIN(MAX(COUNT(1/(MID(P26,ROW($1:$88),1)+1))-15,),15)))&TEXT(SUM(MID(0&P26,LARGE(ISNUMBER(-MID(P26,ROW($1:$88),1))*ROW($1:$88),ROW($1:$15))+1,1)*10^ROW($1:$15)/10),REPT(0,MIN(COUNT(1/(MID(P26,ROW($1:$88),1)+1)),15)))","v":"442"}]
[null,null,{"$f":"IFERROR(\"AVIS Econom\"&\"  \"&VLOOKUP((LEFT(B34,(LEN(B34)))),'ТАРИФЫ ТК'!A4:A134,1,0),\"НЕТ ДОСТАВКИ\")","v":"AVIS Econom  Караганда"},{"$f":"IFERROR(VLOOKUP((LEFT(B34,(LEN(B34)))),'ТАРИФЫ ТК'!A4:C134,3,0),\"НЕТ ДОСТАВКИ\")","v":1300},{"$f":"IFERROR(F24+D27,\"НЕТ ДОСТАВКИ\")","v":11200},{"$f":"IFERROR(D27&\" + НПл\",\"НЕТ ДОСТАВКИ\")","v":"1300 + НПл"},{"$f":"IFERROR(CEILING((F24+D27)*(1+$D$25/100),50),0)","v":11450},null,null,null,"Общий вес:442",null,null,null,null,0,{"$f":"TEXT(SUM(MID(0&P27,LARGE(ISNUMBER(-MID(P27,ROW($1:$88),1))*ROW($1:$88),ROW($1:$15)+15)+1,1)*10^ROW($1:$15)/10),REPT(0,MIN(MAX(COUNT(1/(MID(P27,ROW($1:$88),1)+1))-15,),15)))&TEXT(SUM(MID(0&P27,LARGE(ISNUMBER(-MID(P27,ROW($1:$88),1))*ROW($1:$88),ROW($1:$15))+1,1)*10^ROW($1:$15)/10),REPT(0,MIN(COUNT(1/(MID(P27,ROW($1:$88),1)+1)),15)))","v":"0"}]
[null,null,{"$f":"IFERROR(IF(A29<1,\"AVIS EXPRESS\"&\"  \"&VLOOKUP((LEFT(B34,(LEN(B34)))),'ТАРИФЫ ТК'!E4:G20,1,0),\"AV ВИМАНИЕ:   В Е С    П О С Ы Л К И    Б О Л Ь Ш Е   0,5 КГ   !!!\"),\"НЕТ ДОСТАВКИ\")","v":"AVIS EXPRESS  Караганда"},{"$f":"IFERROR(VLOOKUP((LEFT(B34,(LEN(B34)))),'ТАРИФЫ ТК'!E4:G20,3,0),\"НЕТ ДОСТАВКИ\")","v":1400},{"$f":"IFERROR(F24+D28,\"НЕТ ДОСТАВКИ\")","v":11300},{"$f":"D28&\" + НПл\"","v":"1400 + НПл"},{"$f":"IFERROR(CEILING((F24+D28)*(1+$D$25/100),50),\"НЕТ ДОСТАВКИ\")","v":11550},null,null,null,"Итого:9900",null,null,null,null,0,{"$f":"TEXT(SUM(MID(0&P28,LARGE(ISNUMBER(-MID(P28,ROW($1:$88),1))*ROW($1:$88),ROW($1:$15)+15)+1,1)*10^ROW($1:$15)/10),REPT(0,MIN(MAX(COUNT(1/(MID(P28,ROW($1:$88),1)+1))-15,),15)))&TEXT(SUM(MID(0&P28,LARGE(ISNUMBER(-MID(P28,ROW($1:$88),1))*ROW($1:$88),ROW($1:$15))+1,1)*10^ROW($1:$15)/10),REPT(0,MIN(COUNT(1/(MID(P28,ROW($1:$88),1)+1)),15)))","v":"0"}]
[{"$f":"IFERROR(A25*1.5,\"Количество ??\")","v":3.5919000000000006E-2},null,null,"К ОПЛАТЕ:",{"$f":"IFERROR(F24+E25,0)","v":0},{"$f":"IF(E25=C29,\"Доставка БЕСПЛАТНО\",IF(E25=D26,E26,IF(E25=D27,E27,IF(E25=D28,E28,IF(E25=F27,G27,IF(E25=F28,G28,IF(E25=F26,G26,\"Укажите ТК\")))))))","v":11550},{"$f":"IFERROR(CEILING((F24+E25)*1.03,50),0)","v":0},null,null,{"$f":"IFERROR(J25*1.5,\"Количество ??\")","v":0},null,null,null,null,null,0,{"$f":"TEXT(SUM(MID(0&P29,LARGE(ISNUMBER(-MID(P29,ROW($1:$88),1))*ROW($1:$88),ROW($1:$15)+15)+1,1)*10^ROW($1:$15)/10),REPT(0,MIN(MAX(COUNT(1/(MID(P29,ROW($1:$88),1)+1))-15,),15)))&TEXT(SUM(MID(0&P29,LARGE(ISNUMBER(-MID(P29,ROW($1:$88),1))*ROW($1:$88),ROW($1:$15))+1,1)*10^ROW($1:$15)/10),REPT(0,MIN(COUNT(1/(MID(P29,ROW($1:$88),1)+1)),15)))","v":"0"}]
["rc11091kz",null,{"$f":"IFERROR((P14&\"        \"&LEFT(P15,8)&\" = \"&TEXT(R15,\"### ### ###\")&\" т.\"),\"НЕТ ДОСТАВКИ\")","v":"        0 =  т."},null,{"$f":"IFERROR(\"QIWI = \"&CEILING((E26*1.02),10),0)","v":"QIWI = 11680"},{"$f":"IFERROR(F29-F24,\"УКАЖИТЕ ТК\")","v":1650},null,null,null,null,null,null,null,null,null,0,{"$f":"TEXT(SUM(MID(0&P30,LARGE(ISNUMBER(-MID(P30,ROW($1:$88),1))*ROW($1:$88),ROW($1:$15)+15)+1,1)*10^ROW($1:$15)/10),REPT(0,MIN(MAX(COUNT(1/(MID(P30,ROW($1:$88),1)+1))-15,),15)))&TEXT(SUM(MID(0&P30,LARGE(ISNUMBER(-MID(P30,ROW($1:$88),1))*ROW($1:$88),ROW($1:$15))+1,1)*10^ROW($1:$15)/10),REPT(0,MIN(COUNT(1/(MID(P30,ROW($1:$88),1)+1)),15)))","v":"0"}]
[{"$f":"A1","v":" 9639++11550"},"ПОЛУЧАТЕЛЬ:","rc11091kz",null,null,null,null,null,null,null,null,null,null,null,null,0,{"$f":"TEXT(SUM(MID(0&P31,LARGE(ISNUMBER(-MID(P31,ROW($1:$88),1))*ROW($1:$88),ROW($1:$15)+15)+1,1)*10^ROW($1:$15)/10),REPT(0,MIN(MAX(COUNT(1/(MID(P31,ROW($1:$88),1)+1))-15,),15)))&TEXT(SUM(MID(0&P31,LARGE(ISNUMBER(-MID(P31,ROW($1:$88),1))*ROW($1:$88),ROW($1:$15))+1,1)*10^ROW($1:$15)/10),REPT(0,MIN(COUNT(1/(MID(P31,ROW($1:$88),1)+1)),15)))","v":"0"}]
[{"$f":"UPPER((B3))","v":"НУРЖАН ИСАБАЕВ"},null,{"$f":"IFERROR(MID(НайтиСтрокуПоСлову(\"Комментарий: Имя :\",K1:K45),20,99),0)","v":0},null,null,null,null,null,null,null,"Назад",null,null,null,null,0,{"$f":"TEXT(SUM(MID(0&P32,LARGE(ISNUMBER(-MID(P32,ROW($1:$88),1))*ROW($1:$88),ROW($1:$15)+15)+1,1)*10^ROW($1:$15)/10),REPT(0,MIN(MAX(COUNT(1/(MID(P32,ROW($1:$88),1)+1))-15,),15)))&TEXT(SUM(MID(0&P32,LARGE(ISNUMBER(-MID(P32,ROW($1:$88),1))*ROW($1:$88),ROW($1:$15))+1,1)*10^ROW($1:$15)/10),REPT(0,MIN(COUNT(1/(MID(P32,ROW($1:$88),1)+1)),15)))","v":"0"}]
["Область: ",{"$f":"UPPER((P18))","v":""},{"$f":"IFERROR(ПоискСНачала(C32,\"Телефон\"),0)","v":0},null,{"$f":"IFERROR(ПоискМежду(C32,\"Телефон :\",\"Примечание\"),0)","v":0},{"$f":"IFERROR(IF(LEFT(ПоискСКонца(C32,\"Примечание : \"),2)=\"г \",MID(ПоискСКонца(C32,\"Примечание : \"),3,99),IF(LEFT(ПоискСКонца(C32,\"Примечание : \"),3)=\"г. \",MID(ПоискСКонца(C32,\"Примечание : \"),4,99),IF(LEFT(ПоискСКонца(C32,\"Примечание : \"),3)=\"гор\",MID(ПоискСКонца(C32,\"Примечание : \"),6,99),0))),0)","v":0},null,null,null,null,null,null,null,null,null,0,{"$f":"TEXT(SUM(MID(0&P33,LARGE(ISNUMBER(-MID(P33,ROW($1:$88),1))*ROW($1:$88),ROW($1:$15)+15)+1,1)*10^ROW($1:$15)/10),REPT(0,MIN(MAX(COUNT(1/(MID(P33,ROW($1:$88),1)+1))-15,),15)))&TEXT(SUM(MID(0&P33,LARGE(ISNUMBER(-MID(P33,ROW($1:$88),1))*ROW($1:$88),ROW($1:$15))+1,1)*10^ROW($1:$15)/10),REPT(0,MIN(COUNT(1/(MID(P33,ROW($1:$88),1)+1)),15)))","v":"0"}]
["Город: ",{"$f":"UPPER((P19))","v":"КАРАГАНДА"},null,null,null,null,null,null,null,null,null,null,null,null,null,0,{"$f":"TEXT(SUM(MID(0&P34,LARGE(ISNUMBER(-MID(P34,ROW($1:$88),1))*ROW($1:$88),ROW($1:$15)+15)+1,1)*10^ROW($1:$15)/10),REPT(0,MIN(MAX(COUNT(1/(MID(P34,ROW($1:$88),1)+1))-15,),15)))&TEXT(SUM(MID(0&P34,LARGE(ISNUMBER(-MID(P34,ROW($1:$88),1))*ROW($1:$88),ROW($1:$15))+1,1)*10^ROW($1:$15)/10),REPT(0,MIN(COUNT(1/(MID(P34,ROW($1:$88),1)+1)),15)))","v":"0"}]
["Улица: ",{"$f":"UPPER((P20))","v":"Н. НАЗАРБАЕВА"},null,null,null,null,null,null,null,null,null,null,null,null,null,0,{"$f":"TEXT(SUM(MID(0&P35,LARGE(ISNUMBER(-MID(P35,ROW($1:$88),1))*ROW($1:$88),ROW($1:$15)+15)+1,1)*10^ROW($1:$15)/10),REPT(0,MIN(MAX(COUNT(1/(MID(P35,ROW($1:$88),1)+1))-15,),15)))&TEXT(SUM(MID(0&P35,LARGE(ISNUMBER(-MID(P35,ROW($1:$88),1))*ROW($1:$88),ROW($1:$15))+1,1)*10^ROW($1:$15)/10),REPT(0,MIN(COUNT(1/(MID(P35,ROW($1:$88),1)+1)),15)))","v":"0"}]
["Здание: ",{"$f":"P21","v":"59"},null,null,null,null,null,null,null,null,null,null,null,null,null,0,{"$f":"TEXT(SUM(MID(0&P36,LARGE(ISNUMBER(-MID(P36,ROW($1:$88),1))*ROW($1:$88),ROW($1:$15)+15)+1,1)*10^ROW($1:$15)/10),REPT(0,MIN(MAX(COUNT(1/(MID(P36,ROW($1:$88),1)+1))-15,),15)))&TEXT(SUM(MID(0&P36,LARGE(ISNUMBER(-MID(P36,ROW($1:$88),1))*ROW($1:$88),ROW($1:$15))+1,1)*10^ROW($1:$15)/10),REPT(0,MIN(COUNT(1/(MID(P36,ROW($1:$88),1)+1)),15)))","v":"0"}]
["Квартира: ",{"$f":"P22","v":"130"},null,null,null,null,null,null,null,null,null,null,null,null,null,0,{"$f":"TEXT(SUM(MID(0&P37,LARGE(ISNUMBER(-MID(P37,ROW($1:$88),1))*ROW($1:$88),ROW($1:$15)+15)+1,1)*10^ROW($1:$15)/10),REPT(0,MIN(MAX(COUNT(1/(MID(P37,ROW($1:$88),1)+1))-15,),15)))&TEXT(SUM(MID(0&P37,LARGE(ISNUMBER(-MID(P37,ROW($1:$88),1))*ROW($1:$88),ROW($1:$15))+1,1)*10^ROW($1:$15)/10),REPT(0,MIN(COUNT(1/(MID(P37,ROW($1:$88),1)+1)),15)))","v":"0"}]
["Телефон: ",{"$f":"B4","v":"7-700-404-04-50   0----   ----"},null,null,null,null,null,null,null,null,null,null,null,null,null,0,{"$f":"TEXT(SUM(MID(0&P38,LARGE(ISNUMBER(-MID(P38,ROW($1:$88),1))*ROW($1:$88),ROW($1:$15)+15)+1,1)*10^ROW($1:$15)/10),REPT(0,MIN(MAX(COUNT(1/(MID(P38,ROW($1:$88),1)+1))-15,),15)))&TEXT(SUM(MID(0&P38,LARGE(ISNUMBER(-MID(P38,ROW($1:$88),1))*ROW($1:$88),ROW($1:$15))+1,1)*10^ROW($1:$15)/10),REPT(0,MIN(COUNT(1/(MID(P38,ROW($1:$88),1)+1)),15)))","v":"0"}]
["Индекс: ",{"$f":"P16","v":""},null,null,null,null,null,null,null,null,null,null,null,null,null,null,{"$f":"IF(LEFT(#REF!,4)=\"ваша\",VALUE(MID(#REF!,13,20))*100,0)","v":{"$error":"#REF!"}}]
["Компания:",null,null,null,null,null,null,null,null,null,null,null,null,null,null,null,{"$f":"IF(LEFT(#REF!,4)=\"ваша\",VALUE(MID(#REF!,13,20))*100,0)","v":{"$error":"#REF!"}}]
["ИИН:",{"$f":"F29","v":11550},null,null,null,null,null,null,null,null,null,null,null,null,null,null,{"$f":"IF(LEFT(#REF!,4)=\"ваша\",VALUE(MID(#REF!,13,20))*100,0)","v":{"$error":"#REF!"}}]
["------------------------","----------------------------------------------------","----------------------------------------------------","------------------------","------------------------","---------------------------","------------------------------","------------------------","------------------------",null,null,null,null,null,null,null,{"$f":"SUM(Q19:Q41)","v":{"$error":"#REF!"}}]

{"sheet":" 9640++25950","index":5,"n_rows":42,"n_cols":21,"rows_kept":42,"cut":false,"hidden":false,"merged":[[27,6,27,8],[31,0,31,1],[37,1,37,2],[0,4,0,7],[1,4,1,8],[2,1,2,2],[3,1,3,2],[25,6,25,8],[26,6,26,8]]}
[{"$f":"IF(LEFT(C29,2)=\"сп\",P1&\" ► СП\",IF(E25=D26,P1,IF(H6<>0,P1&\"++\"&\"0\",IF(E25=D27,P1&\"++\"&\"0\",IF(E25=D28,P1&\"++\"&\"0\",IF(E25=D27,P1&\"++\"&\"0\",IF(E25=D28,P1&\"++\"&\"0\",IF(LEFT(C25,2)=\"AV\",P1&\"++\"&F29,P1))))))))","v":" 9640++25950"},{"$f":"L4","v":"2020-08-16T18:08:49"},{"$f":"IF(E2>0,\"ОТПРАВЛЕНО\",IF(LEFT(C29,3)=\"ЗАК\",\"ЗАКАЗАНО в СПБ\",IF(G24>=0,\"ОПЛОЧЕНО\",\"ОЖИДАНИЕ ОПЛАТЫ\")))","v":"ОТПРАВЛЕНО"},{"$f":"'СПИСОК ЗАКАЗОВ'!B1","v":21},"2020-08-17",null,null,null,{"$f":"A1","v":" 9640++25950"},null,"Заказ № 9640",null,null,null,null,{"$f":"IF(G24>0,\"+\"&H6&\"+\"&Q1,Q1)","v":" 9640"},{"$f":"ПоискСКонца(K1,\"№\")","v":" 9640"}]
["Логин",{"$f":"L3","v":0},"Номер накл-ой",null,3611553,null,null,null,null,null,"Примечание"]
["ФИО",{"$f":"IF(C32=0,UPPER((P9)),UPPER(C33))","v":"ОСТАПЕНКО НИКОЛАЙ"},null,null,null,null,null,null,null,null,"Логин"]
["Телефон",{"$f":"R12","v":"7-775-974-53-71   0----   ----"},null,null,{"$f":"IF(F4>0.5,\"оплачено\",IF(F4<0,\"ОПЛАТИТЬ= \"&G4,\"ОПЛАТИТЬ= \"&Q25))","v":"ОПЛАТИТЬ= 1400"},0,1100,null,null,null,"Дата заказа","2020-08-16T18:08:49"]
["e-mail:",{"$f":"L11","v":"-"}]
["Вес","ПРИМЕЧАНИЯ","Наименование","Кол-во","Цена","Всего",{"$f":"IF(MAX(G7:G25)>0,MAX(G7:G25),\"\")","v":""},{"$f":"IF(I7>0,\"НАЛ\",IF(I8>0,\"ПЕРЕВОД\",IF(I9>0,\"Beeline\",IF(I10>0,\"KASPI\",IF(I11>0,\"QIWI\",IF(I12>0,\"СЧЁТ Альфа-Банк\",0))))))","v":0},{"$f":"SUM(I7:I28)","v":0}]
[{"$f":"IF(L24>0,Q24*1/100,\"\")","v":""},"11:48 нет ответа",{"$f":"IF(L26<>\"\",K26,\"\")","v":"Неодимовый магнит D5x2mm(Аксиал)`42 (сила притяжения 0,35 кг)"},{"$f":"IF(L26>0,L26,\"\")","v":1000},{"$f":"IF(M26=\"уточняйте\",0,IF(L26>0,M26,\"\"))","v":24},{"$f":"IF(D7<>\"\",E7*D7,\"\")","v":24000},{"$f":"IF(I7 >0,TODAY(),\"\")","v":""},"НАЛ",null,{"$f":"IFERROR(IFERROR(VLOOKUP(C7,#REF!,3,0)*D7,VLOOKUP(C7,#REF!,7,0)*D7),\"нет веса\")","v":"нет веса"},"Заказ №9640"]
[{"$f":"IF(L25>0,Q25*1/100,\"\")","v":14},null,{"$f":"IF(L27<>\"\",K27,\"\")","v":""},{"$f":"IF(L27>0,L27,\"\")","v":""},{"$f":"IF(M27=\"уточняйте\",0,IF(L27>0,M27,\"\"))","v":""},"","","ПЕРЕВОД",null,{"$f":"IFERROR(IFERROR(VLOOKUP(C8,#REF!,3,0)*D8,VLOOKUP(C8,#REF!,7,0)*D8),\"нет веса\")","v":"нет веса"}]
[{"$f":"IF(L26>0,Q26*1/100,\"\")","v":2.9},null,"","","","","","Beeline",null,{"$f":"IFERROR(IFERROR(VLOOKUP(C9,#REF!,3,0)*D9,VLOOKUP(C9,#REF!,7,0)*D9),\"нет веса\")","v":"нет веса"},"Здравствуйте, Остапенко Николай",null,null,null,null,{"$f":"MID(K9,15,70)","v":"Остапенко Николай"},{"$f":"TEXT(SUM(MID(0&L9,LARGE(ISNUMBER(-MID(L9,ROW($1:$96),1))*ROW($1:$96),ROW($1:$23)+15)+1,1)*10^ROW($1:$23)/10),REPT(0,MIN(MAX(COUNT(1/(MID(L9,ROW($1:$96),1)+1))-15,),15)))&TEXT(SUM(MID(0&L9,LARGE(ISNUMBER(-MID(L9,ROW($1:$96),1))*ROW($1:$96),ROW($1:$23))+1,1)*10^ROW($1:$23)/10),REPT(0,MIN(COUNT(1/(MID(L9,ROW($1:$96),1)+1)),15)))","v":""}]
["",null,"","","","","","KASPI",null,{"$f":"IFERROR(IFERROR(VLOOKUP(C10,#REF!,3,0)*D10,VLOOKUP(C10,#REF!,7,0)*D10),\"нет веса\")","v":"нет веса"},"Мы получили Ваш заказ номер, 9640"]
["",null,"","","","","","QIWI",null,{"$f":"IFERROR(IFERROR(VLOOKUP(C11,#REF!,3,0)*D11,VLOOKUP(C11,#REF!,7,0)*D11),\"нет веса\")","v":"нет веса"},"Электронная почта:","-"]
["",null,"","","","","","СЧЁТ Альфа-Банк",null,{"$f":"IFERROR(IFERROR(VLOOKUP(C12,#REF!,3,0)*D12,VLOOKUP(C12,#REF!,7,0)*D12),\"нет веса\")","v":"нет веса"},"Контактный телефон:","+7 (775) 974-53-71",null,null,null,{"$f":"(L12&\"  \"&P13)","v":"+7 (775) 974-53-71  0"},{"$f":"TEXT(SUM(MID(0&P12,LARGE(ISNUMBER(-MID(P12,ROW($1:$99),1))*ROW($1:$99),ROW($1:$15)+30)+1,1)*10^ROW($1:$15)/10),REPT(0,MIN(MAX(COUNT(1/(MID(P12,ROW($1:$99),1)+1))-30,),15)))&TEXT(SUM(MID(0&P12,LARGE(ISNUMBER(-MID(P12,ROW($1:$99),1))*ROW($1:$99),ROW($1:$15)+15)+1,1)*10^ROW($1:$15)/10),REPT(0,MIN(MAX(COUNT(1/(MID(P12,ROW($1:$99),1)+1))-15,),15)))&TEXT(SUM(MID(0&P12,LARGE(ISNUMBER(-MID(P12,ROW($1:$99),1))*ROW($1:$99),ROW($1:$15))+1,1)*10^ROW($1:$15)/10),REPT(0,MIN(COUNT(1/(MID(P12,ROW($1:$99),1)+1)),15)))","v":"777597453710"},{"$f":"(MID(Q12,1,1))&\"-\"&(MID(Q12,2,3))&\"-\"&(MID(Q12,5,3))&\"-\"&(MID(Q12,8,2))&\"-\"&(MID(Q12,10,2))&\"   \"&(MID(Q12,12,1))&\"-\"&(MID(Q12,13,3))&\"-\"&(MID(Q12,16,3))&\"-\"&(MID(Q12,19,2))&\"-\"&(MID(Q12,21,2))&\"   \"&(MID(Q12,23,1))&\"-\"&(MID(Q12,24,3))&\"-\"&(MID(Q12,27,3))&\"-\"&(MID(Q12,30,2))&\"-\"&(MID(Q12,32,2))","v":"7-775-974-53-71   0----   ----"}]
["",null,"","","","","",null,null,{"$f":"IFERROR(IFERROR(VLOOKUP(C13,#REF!,3,0)*D13,VLOOKUP(C13,#REF!,7,0)*D13),\"нет веса\")","v":"нет веса"},"Доставка:","-",null,null,null,{"$f":"IF(L13=\"-\",IFERROR(НайтиСтрокуПоСлову(\"Комментарий\",K27:K60),0),L13)","v":0}]
["",null,"","","","","",null,null,{"$f":"IFERROR(IFERROR(VLOOKUP(C14,#REF!,3,0)*D14,VLOOKUP(C14,#REF!,7,0)*D14),\"нет веса\")","v":"нет веса"},"Оплата:","-",null,null,null,{"$f":"MID(L14,23,70)","v":""}]
["",null,"","","","","",null,null,{"$f":"IFERROR(IFERROR(VLOOKUP(C15,#REF!,3,0)*D15,VLOOKUP(C15,#REF!,7,0)*D15),\"нет веса\")","v":"нет веса"},null,null,null,null,null,{"$f":"IF(LEFT(P14,2)=\"EX\",MID(L15,11,70),L15)","v":0},{"$f":"TEXT(SUM(MID(0&P15,LARGE(ISNUMBER(-MID(P15,ROW($1:$88),1))*ROW($1:$88),ROW($1:$15)+15)+1,1)*10^ROW($1:$15)/10),REPT(0,MIN(MAX(COUNT(1/(MID(P15,ROW($1:$88),1)+1))-15,),15)))&TEXT(SUM(MID(0&P15,LARGE(ISNUMBER(-MID(P15,ROW($1:$88),1))*ROW($1:$88),ROW($1:$15))+1,1)*10^ROW($1:$15)/10),REPT(0,MIN(COUNT(1/(MID(P15,ROW($1:$88),1)+1)),15)))","v":"0"},{"$f":"SUMPRODUCT(--SUBSTITUTE(Q15:Q15,CHAR(160),))","v":0},{"$f":"LEN(Q15)","v":1},{"$f":"FLOOR(S15/3,1)","v":0}]
["",null,"","","","","",null,null,{"$f":"IFERROR(IFERROR(VLOOKUP(C16,#REF!,3,0)*D16,VLOOKUP(C16,#REF!,7,0)*D16),\"нет веса\")","v":"нет веса"},"Адрес доставки:","Индекс:",null,null,null,{"$f":"MID(L16,9,70)","v":""}]
["",null,"","","","","",null,null,{"$f":"IFERROR(IFERROR(VLOOKUP(C17,#REF!,3,0)*D17,VLOOKUP(C17,#REF!,7,0)*D17),\"нет веса\")","v":"нет веса"},null,"Страна:",null,null,null,{"$f":"MID(L17,9,70)","v":""},{"$f":"IF(LEFT(K17,4)=\"ваша\",VALUE(MID(K17,13,20))*100,0)","v":0}]
["",null,"","","","","",null,null,{"$f":"IFERROR(IFERROR(VLOOKUP(C18,#REF!,3,0)*D18,VLOOKUP(C18,#REF!,7,0)*D18),\"нет веса\")","v":"нет веса"},null,"Область:",null,null,null,{"$f":"MID(L18,10,70)","v":""}]
["",null,"","","","","",null,null,{"$f":"IFERROR(IFERROR(VLOOKUP(C19,#REF!,3,0)*D19,VLOOKUP(C19,#REF!,7,0)*D19),\"нет веса\")","v":"нет веса"},null,"Город: Нур-Султан",null,null,null,{"$f":"MID(L19,8,70)","v":"Нур-Султан"},{"$f":"IF(LEFT(K19,4)=\"ваша\",VALUE(MID(K19,13,20))*100,0)","v":0}]
["",null,"","","","","",null,null,{"$f":"IFERROR(IFERROR(VLOOKUP(C20,#REF!,3,0)*D20,VLOOKUP(C20,#REF!,7,0)*D20),\"нет веса\")","v":"нет веса"},null,"Улица: Улица Косшыгулулы дом 20",null,null,null,{"$f":"MID(L20,8,70)","v":"Улица Косшыгулулы дом 20"},{"$f":"IF(LEFT(K31,4)=\"ваша\",VALUE(MID(K31,13,20))*100,0)","v":0}]
["",null,"","","","","",null,null,{"$f":"IFERROR(IFERROR(VLOOKUP(C21,#REF!,3,0)*D21,VLOOKUP(C21,#REF!,7,0)*D21),\"нет веса\")","v":"нет веса"},null,"Здание: 20",null,null,null,{"$f":"MID(L21,9,70)","v":"20"},{"$f":"IF(LEFT(K32,4)=\"ваша\",VALUE(MID(K32,13,20))*100,0)","v":0}]
["",null,"","","","","",null,null,{"$f":"IFERROR(IFERROR(VLOOKUP(C22,#REF!,3,0)*D22,VLOOKUP(C22,#REF!,7,0)*D22),\"нет веса\")","v":"нет веса"},null,"Квартира: 63",null,null,null,{"$f":"MID(L22,11,70)","v":"63"},{"$f":"IF(LEFT(#REF!,4)=\"ваша\",VALUE(MID(#REF!,13,20))*100,0)","v":{"$error":"#REF!"}}]
["",null,null,null,"Итого:",{"$f":"SUM(F7:F22)","v":24000},"",null,null,{"$f":"IF(K40>0,M40,\"\")","v":""},"Комментарий :",null,null,null,null,null,{"$f":"IF(LEFT(K33,4)=\"ваша\",VALUE(MID(K33,13,20))*100,0)","v":0}]
[{"$f":"IF(L41>0,N41,\"\")","v":""},null,null,"скидка:",{"$f":"IF(F23>150000,10,IF(F23>100000,8,IF(F23>60000,5,IF(F23>30000,3,0))))","v":0},{"$f":"F23-(F23*E24/100)","v":24000},{"$f":"IFERROR(SUM(I7:I22)-F29+1,0)","v":-25949},null,null,null,null,null,null,null,null,{"$f":"N24","v":0},{"$f":"TEXT(SUM(MID(0&P24,LARGE(ISNUMBER(-MID(P24,ROW($1:$88),1))*ROW($1:$88),ROW($1:$15)+15)+1,1)*10^ROW($1:$15)/10),REPT(0,MIN(MAX(COUNT(1/(MID(P24,ROW($1:$88),1)+1))-15,),15)))&TEXT(SUM(MID(0&P24,LARGE(ISNUMBER(-MID(P24,ROW($1:$88),1))*ROW($1:$88),ROW($1:$15))+1,1)*10^ROW($1:$15)/10),REPT(0,MIN(COUNT(1/(MID(P24,ROW($1:$88),1)+1)),15)))","v":"0"}]
[{"$f":"SUM(A7:A23)/1000*1.3","v":2.197E-2},null,{"$f":"IF(E25=F26,\"Доставка БЕСПЛАТНО\",IF(E25=D26,C26,IF(E25=D27,C27,IF(E25=D28,C28,IF(E25=F27,C27&\" + НПл\",IF(E25=F28,C28&\" + НПл\",\"Укажите ТК\"))))))","v":"AVIS EXPRESS  Нур-Султан + НПл"},2,{"$f":"F28","v":"1400 + НПл"},null,{"$f":"IF(I25 >0,TODAY(),\"\")","v":""},null,null,{"$f":"SUM(J7:J22)/1000","v":0},"Наименование","Количество","Цена","Вес","Всего",{"$f":"E25","v":"1400 + НПл"},{"$f":"TEXT(SUM(MID(0&P25,LARGE(ISNUMBER(-MID(P25,ROW($1:$88),1))*ROW($1:$88),ROW($1:$15)+15)+1,1)*10^ROW($1:$15)/10),REPT(0,MIN(MAX(COUNT(1/(MID(P25,ROW($1:$88),1)+1))-15,),15)))&TEXT(SUM(MID(0&P25,LARGE(ISNUMBER(-MID(P25,ROW($1:$88),1))*ROW($1:$88),ROW($1:$15))+1,1)*10^ROW($1:$15)/10),REPT(0,MIN(COUNT(1/(MID(P25,ROW($1:$88),1)+1)),15)))","v":"1400"},{"$f":"E25","v":"1400 + НПл"},{"$f":"TEXT(SUM(MID(0&R25,LARGE(ISNUMBER(-MID(R25,ROW($1:$88),1))*ROW($1:$88),ROW($1:$15)+15)+1,1)*10^ROW($1:$15)/10),REPT(0,MIN(MAX(COUNT(1/(MID(R25,ROW($1:$88),1)+1))-15,),15)))&TEXT(SUM(MID(0&R25,LARGE(ISNUMBER(-MID(R25,ROW($1:$88),1))*ROW($1:$88),ROW($1:$15))+1,1)*10^ROW($1:$15)/10),REPT(0,MIN(COUNT(1/(MID(R25,ROW($1:$88),1)+1)),15)))","v":"1400"},null,{"$f":"TEXT(SUM(MID(0&E25,LARGE(ISNUMBER(-MID(E25,ROW($1:$88),1))*ROW($1:$88),ROW($1:$15)+15)+1,1)*10^ROW($1:$15)/10),REPT(0,MIN(MAX(COUNT(1/(MID(E25,ROW($1:$88),1)+1))-15,),15)))&TEXT(SUM(MID(0&E25,LARGE(ISNUMBER(-MID(E25,ROW($1:$88),1))*ROW($1:$88),ROW($1:$15))+1,1)*10^ROW($1:$15)/10),REPT(0,MIN(COUNT(1/(MID(E25,ROW($1:$88),1)+1)),15)))","v":{"$error":"#NUM!"}}]
[null,null,{"$f":"IFERROR(\"AVIS С А М О В Ы В О З \"&\"  \"&VLOOKUP((LEFT(B34,(LEN(B34)))),'ТАРИФЫ ТК'!J17:L268,1,0),\"НЕТ ДОСТАВКИ\")","v":"НЕТ ДОСТАВКИ"},{"$f":"IFERROR(VLOOKUP((LEFT(B34,(LEN(B34)))),'ТАРИФЫ ТК'!J17:L268,3,0)+0.001,\"НЕТ ДОСТАВКИ\")","v":"НЕТ ДОСТАВКИ"},{"$f":"IFERROR(F24+D26,\"НЕТ ДОСТАВКИ\")","v":"НЕТ ДОСТАВКИ"},{"$f":"IFERROR(D26&\" + НПл\",\"НЕТ ДОСТАВКИ\")","v":"НЕТ ДОСТАВКИ + НПл"},{"$f":"IFERROR(CEILING((F24+D26)*(1+$D$25/100),50),0)","v":0},null,null,null,"Неодимовый магнит D5x2mm(Аксиал)`42 (сила притяжения 0,35 кг)",1000,24,290,24000,{"$f":"N26","v":290},{"$f":"TEXT(SUM(MID(0&P26,LARGE(ISNUMBER(-MID(P26,ROW($1:$88),1))*ROW($1:$88),ROW($1:$15)+15)+1,1)*10^ROW($1:$15)/10),REPT(0,MIN(MAX(COUNT(1/(MID(P26,ROW($1:$88),1)+1))-15,),15)))&TEXT(SUM(MID(0&P26,LARGE(ISNUMBER(-MID(P26,ROW($1:$88),1))*ROW($1:$88),ROW($1:$15))+1,1)*10^ROW($1:$15)/10),REPT(0,MIN(COUNT(1/(MID(P26,ROW($1:$88),1)+1)),15)))","v":"290"}]
[null,null,{"$f":"IFERROR(\"AVIS Econom\"&\"  \"&VLOOKUP((LEFT(B34,(LEN(B34)))),'ТАРИФЫ ТК'!A4:A134,1,0),\"НЕТ ДОСТАВКИ\")","v":"AVIS Econom  Нур-Султан"},{"$f":"IFERROR(VLOOKUP((LEFT(B34,(LEN(B34)))),'ТАРИФЫ ТК'!A4:C134,3,0),\"НЕТ ДОСТАВКИ\")","v":1300},{"$f":"IFERROR(F24+D27,\"НЕТ ДОСТАВКИ\")","v":25300},{"$f":"IFERROR(D27&\" + НПл\",\"НЕТ ДОСТАВКИ\")","v":"1300 + НПл"},{"$f":"IFERROR(CEILING((F24+D27)*(1+$D$25/100),50),0)","v":25850},null,null,null,"Общий вес:290",null,null,null,null,0,{"$f":"TEXT(SUM(MID(0&P27,LARGE(ISNUMBER(-MID(P27,ROW($1:$88),1))*ROW($1:$88),ROW($1:$15)+15)+1,1)*10^ROW($1:$15)/10),REPT(0,MIN(MAX(COUNT(1/(MID(P27,ROW($1:$88),1)+1))-15,),15)))&TEXT(SUM(MID(0&P27,LARGE(ISNUMBER(-MID(P27,ROW($1:$88),1))*ROW($1:$88),ROW($1:$15))+1,1)*10^ROW($1:$15)/10),REPT(0,MIN(COUNT(1/(MID(P27,ROW($1:$88),1)+1)),15)))","v":"0"}]
[null,null,{"$f":"IFERROR(IF(A29<1,\"AVIS EXPRESS\"&\"  \"&VLOOKUP((LEFT(B34,(LEN(B34)))),'ТАРИФЫ ТК'!E4:G20,1,0),\"AV ВИМАНИЕ:   В Е С    П О С Ы Л К И    Б О Л Ь Ш Е   0,5 КГ   !!!\"),\"НЕТ ДОСТАВКИ\")","v":"AVIS EXPRESS  Нур-Султан"},{"$f":"IFERROR(VLOOKUP((LEFT(B34,(LEN(B34)))),'ТАРИФЫ ТК'!E4:G20,3,0),\"НЕТ ДОСТАВКИ\")","v":1400},{"$f":"IFERROR(F24+D28,\"НЕТ ДОСТАВКИ\")","v":25400},{"$f":"D28&\" + НПл\"","v":"1400 + НПл"},{"$f":"IFERROR(CEILING((F24+D28)*(1+$D$25/100),50),\"НЕТ ДОСТАВКИ\")","v":25950},null,null,null,"Итого:24000",null,null,null,null,0,{"$f":"TEXT(SUM(MID(0&P28,LARGE(ISNUMBER(-MID(P28,ROW($1:$88),1))*ROW($1:$88),ROW($1:$15)+15)+1,1)*10^ROW($1:$15)/10),REPT(0,MIN(MAX(COUNT(1/(MID(P28,ROW($1:$88),1)+1))-15,),15)))&TEXT(SUM(MID(0&P28,LARGE(ISNUMBER(-MID(P28,ROW($1:$88),1))*ROW($1:$88),ROW($1:$15))+1,1)*10^ROW($1:$15)/10),REPT(0,MIN(COUNT(1/(MID(P28,ROW($1:$88),1)+1)),15)))","v":"0"}]
[{"$f":"IFERROR(A25*1.5,\"Количество ??\")","v":3.2954999999999998E-2},null,null,"К ОПЛАТЕ:",{"$f":"IFERROR(F24+E25,0)","v":0},{"$f":"IF(E25=C29,\"Доставка БЕСПЛАТНО\",IF(E25=D26,E26,IF(E25=D27,E27,IF(E25=D28,E28,IF(E25=F27,G27,IF(E25=F28,G28,IF(E25=F26,G26,\"Укажите ТК\")))))))","v":25950},{"$f":"IFERROR(CEILING((F24+E25)*1.03,50),0)","v":0},null,null,{"$f":"IFERROR(J25*1.5,\"Количество ??\")","v":0},null,null,null,null,null,0,{"$f":"TEXT(SUM(MID(0&P29,LARGE(ISNUMBER(-MID(P29,ROW($1:$88),1))*ROW($1:$88),ROW($1:$15)+15)+1,1)*10^ROW($1:$15)/10),REPT(0,MIN(MAX(COUNT(1/(MID(P29,ROW($1:$88),1)+1))-15,),15)))&TEXT(SUM(MID(0&P29,LARGE(ISNUMBER(-MID(P29,ROW($1:$88),1))*ROW($1:$88),ROW($1:$15))+1,1)*10^ROW($1:$15)/10),REPT(0,MIN(COUNT(1/(MID(P29,ROW($1:$88),1)+1)),15)))","v":"0"}]
["rc11091kz",null,{"$f":"IFERROR((P14&\"        \"&LEFT(P15,8)&\" = \"&TEXT(R15,\"### ### ###\")&\" т.\"),\"НЕТ ДОСТАВКИ\")","v":"        0 =  т."},null,{"$f":"IFERROR(\"QIWI = \"&CEILING((E26*1.02),10),0)","v":0},{"$f":"IFERROR(F29-F24,\"УКАЖИТЕ ТК\")","v":1950},null,null,null,null,null,null,null,null,null,0,{"$f":"TEXT(SUM(MID(0&P30,LARGE(ISNUMBER(-MID(P30,ROW($1:$88),1))*ROW($1:$88),ROW($1:$15)+15)+1,1)*10^ROW($1:$15)/10),REPT(0,MIN(MAX(COUNT(1/(MID(P30,ROW($1:$88),1)+1))-15,),15)))&TEXT(SUM(MID(0&P30,LARGE(ISNUMBER(-MID(P30,ROW($1:$88),1))*ROW($1:$88),ROW($1:$15))+1,1)*10^ROW($1:$15)/10),REPT(0,MIN(COUNT(1/(MID(P30,ROW($1:$88),1)+1)),15)))","v":"0"}]
[{"$f":"A1","v":" 9640++25950"},"ПОЛУЧАТЕЛЬ:","rc11091kz",null,null,null,null,null,null,null,null,null,null,null,null,0,{"$f":"TEXT(SUM(MID(0&P31,LARGE(ISNUMBER(-MID(P31,ROW($1:$88),1))*ROW($1:$88),ROW($1:$15)+15)+1,1)*10^ROW($1:$15)/10),REPT(0,MIN(MAX(COUNT(1/(MID(P31,ROW($1:$88),1)+1))-15,),15)))&TEXT(SUM(MID(0&P31,LARGE(ISNUMBER(-MID(P31,ROW($1:$88),1))*ROW($1:$88),ROW($1:$15))+1,1)*10^ROW($1:$15)/10),REPT(0,MIN(COUNT(1/(MID(P31,ROW($1:$88),1)+1)),15)))","v":"0"}]
[{"$f":"UPPER((B3))","v":"ОСТАПЕНКО НИКОЛАЙ"},null,{"$f":"IFERROR(MID(НайтиСтрокуПоСлову(\"Комментарий: Имя :\",K1:K45),20,99),0)","v":0},null,null,null,null,null,null,null,"Назад",null,null,null,null,0,{"$f":"TEXT(SUM(MID(0&P32,LARGE(ISNUMBER(-MID(P32,ROW($1:$88),1))*ROW($1:$88),ROW($1:$15)+15)+1,1)*10^ROW($1:$15)/10),REPT(0,MIN(MAX(COUNT(1/(MID(P32,ROW($1:$88),1)+1))-15,),15)))&TEXT(SUM(MID(0&P32,LARGE(ISNUMBER(-MID(P32,ROW($1:$88),1))*ROW($1:$88),ROW($1:$15))+1,1)*10^ROW($1:$15)/10),REPT(0,MIN(COUNT(1/(MID(P32,ROW($1:$88),1)+1)),15)))","v":"0"}]
["Область: ",{"$f":"UPPER((P18))","v":""},{"$f":"IFERROR(ПоискСНачала(C32,\"Телефон\"),0)","v":0},null,{"$f":"IFERROR(ПоискМежду(C32,\"Телефон :\",\"Примечание\"),0)","v":0},{"$f":"IFERROR(IF(LEFT(ПоискСКонца(C32,\"Примечание : \"),2)=\"г \",MID(ПоискСКонца(C32,\"Примечание : \"),3,99),IF(LEFT(ПоискСКонца(C32,\"Примечание : \"),3)=\"г. \",MID(ПоискСКонца(C32,\"Примечание : \"),4,99),IF(LEFT(ПоискСКонца(C32,\"Примечание : \"),3)=\"гор\",MID(ПоискСКонца(C32,\"Примечание : \"),6,99),0))),0)","v":0},null,null,null,null,null,null,null,null,null,0,{"$f":"TEXT(SUM(MID(0&P33,LARGE(ISNUMBER(-MID(P33,ROW($1:$88),1))*ROW($1:$88),ROW($1:$15)+15)+1,1)*10^ROW($1:$15)/10),REPT(0,MIN(MAX(COUNT(1/(MID(P33,ROW($1:$88),1)+1))-15,),15)))&TEXT(SUM(MID(0&P33,LARGE(ISNUMBER(-MID(P33,ROW($1:$88),1))*ROW($1:$88),ROW($1:$15))+1,1)*10^ROW($1:$15)/10),REPT(0,MIN(COUNT(1/(MID(P33,ROW($1:$88),1)+1)),15)))","v":"0"}]
["Город: ",{"$f":"UPPER((P19))","v":"НУР-СУЛТАН"},null,null,null,null,null,null,null,null,null,null,null,null,null,0,{"$f":"TEXT(SUM(MID(0&P34,LARGE(ISNUMBER(-MID(P34,ROW($1:$88),1))*ROW($1:$88),ROW($1:$15)+15)+1,1)*10^ROW($1:$15)/10),REPT(0,MIN(MAX(COUNT(1/(MID(P34,ROW($1:$88),1)+1))-15,),15)))&TEXT(SUM(MID(0&P34,LARGE(ISNUMBER(-MID(P34,ROW($1:$88),1))*ROW($1:$88),ROW($1:$15))+1,1)*10^ROW($1:$15)/10),REPT(0,MIN(COUNT(1/(MID(P34,ROW($1:$88),1)+1)),15)))","v":"0"}]
["Улица: ",{"$f":"UPPER((P20))","v":"УЛИЦА КОСШЫГУЛУЛЫ ДОМ 20"},null,null,null,null,null,null,null,null,null,null,null,null,null,0,{"$f":"TEXT(SUM(MID(0&P35,LARGE(ISNUMBER(-MID(P35,ROW($1:$88),1))*ROW($1:$88),ROW($1:$15)+15)+1,1)*10^ROW($1:$15)/10),REPT(0,MIN(MAX(COUNT(1/(MID(P35,ROW($1:$88),1)+1))-15,),15)))&TEXT(SUM(MID(0&P35,LARGE(ISNUMBER(-MID(P35,ROW($1:$88),1))*ROW($1:$88),ROW($1:$15))+1,1)*10^ROW($1:$15)/10),REPT(0,MIN(COUNT(1/(MID(P35,ROW($1:$88),1)+1)),15)))","v":"0"}]
["Здание: ",20,null,null,null,null,null,null,null,null,null,null,null,null,null,0,{"$f":"TEXT(SUM(MID(0&P36,LARGE(ISNUMBER(-MID(P36,ROW($1:$88),1))*ROW($1:$88),ROW($1:$15)+15)+1,1)*10^ROW($1:$15)/10),REPT(0,MIN(MAX(COUNT(1/(MID(P36,ROW($1:$88),1)+1))-15,),15)))&TEXT(SUM(MID(0&P36,LARGE(ISNUMBER(-MID(P36,ROW($1:$88),1))*ROW($1:$88),ROW($1:$15))+1,1)*10^ROW($1:$15)/10),REPT(0,MIN(COUNT(1/(MID(P36,ROW($1:$88),1)+1)),15)))","v":"0"}]
["Квартира: ",null,null,null,null,null,null,null,null,null,null,null,null,null,null,0,{"$f":"TEXT(SUM(MID(0&P37,LARGE(ISNUMBER(-MID(P37,ROW($1:$88),1))*ROW($1:$88),ROW($1:$15)+15)+1,1)*10^ROW($1:$15)/10),REPT(0,MIN(MAX(COUNT(1/(MID(P37,ROW($1:$88),1)+1))-15,),15)))&TEXT(SUM(MID(0&P37,LARGE(ISNUMBER(-MID(P37,ROW($1:$88),1))*ROW($1:$88),ROW($1:$15))+1,1)*10^ROW($1:$15)/10),REPT(0,MIN(COUNT(1/(MID(P37,ROW($1:$88),1)+1)),15)))","v":"0"}]
["Телефон: ",{"$f":"B4","v":"7-775-974-53-71   0----   ----"},null,null,null,null,null,null,null,null,null,null,null,null,null,0,{"$f":"TEXT(SUM(MID(0&P38,LARGE(ISNUMBER(-MID(P38,ROW($1:$88),1))*ROW($1:$88),ROW($1:$15)+15)+1,1)*10^ROW($1:$15)/10),REPT(0,MIN(MAX(COUNT(1/(MID(P38,ROW($1:$88),1)+1))-15,),15)))&TEXT(SUM(MID(0&P38,LARGE(ISNUMBER(-MID(P38,ROW($1:$88),1))*ROW($1:$88),ROW($1:$15))+1,1)*10^ROW($1:$15)/10),REPT(0,MIN(COUNT(1/(MID(P38,ROW($1:$88),1)+1)),15)))","v":"0"}]
["Индекс: ",{"$f":"P16","v":""},null,null,null,null,null,null,null,null,null,null,null,null,null,null,{"$f":"IF(LEFT(#REF!,4)=\"ваша\",VALUE(MID(#REF!,13,20))*100,0)","v":{"$error":"#REF!"}}]
["Компания:",null,null,null,null,null,null,null,null,null,null,null,null,null,null,null,{"$f":"IF(LEFT(#REF!,4)=\"ваша\",VALUE(MID(#REF!,13,20))*100,0)","v":{"$error":"#REF!"}}]
["ИИН:",{"$f":"F29","v":25950},null,null,null,null,null,null,null,null,null,null,null,null,null,null,{"$f":"IF(LEFT(#REF!,4)=\"ваша\",VALUE(MID(#REF!,13,20))*100,0)","v":{"$error":"#REF!"}}]
["------------------------","----------------------------------------------------","----------------------------------------------------","------------------------","------------------------","---------------------------","------------------------------","------------------------","------------------------",null,null,null,null,null,null,null,{"$f":"SUM(Q19:Q41)","v":{"$error":"#REF!"}}]

{"sheet":"170820++29000","index":6,"n_rows":42,"n_cols":21,"rows_kept":42,"cut":false,"hidden":false,"merged":[[27,6,27,8],[31,0,31,1],[37,1,37,2],[0,4,0,7],[1,4,1,8],[2,1,2,2],[3,1,3,2],[25,6,25,8],[26,6,26,8]]}
[{"$f":"IF(LEFT(C29,2)=\"сп\",P1&\" ► СП\",IF(E25=D26,P1,IF(H6<>0,P1&\"++\"&\"0\",IF(E25=D27,P1&\"++\"&\"0\",IF(E25=D28,P1&\"++\"&\"0\",IF(E25=D27,P1&\"++\"&\"0\",IF(E25=D28,P1&\"++\"&\"0\",IF(LEFT(C25,2)=\"AV\",P1&\"++\"&F29,P1))))))))","v":"170820++29000"},"2020-08-17",{"$f":"IF(E2>0,\"ОТПРАВЛЕНО\",IF(LEFT(C29,3)=\"ЗАК\",\"ЗАКАЗАНО в СПБ\",IF(G24>=0,\"ОПЛОЧЕНО\",\"ОЖИДАНИЕ ОПЛАТЫ\")))","v":"ОТПРАВЛЕНО"},{"$f":"'СПИСОК ЗАКАЗОВ'!B1","v":21},"2020-08-17",null,null,null,{"$f":"A1","v":"170820++29000"},null,170820,null,null,null,null,{"$f":"IF(G24>0,\"+\"&H6&\"+\"&Q1,Q1)","v":"170820"},{"$f":"ПоискСКонца(K1,\"№\")","v":"170820"}]
["Логин",{"$f":"L3","v":"Логин"},"Номер накл-ой",null,3611554,null,null,null,null,null,"Примечание"]
["ФИО",{"$f":"IF(C32=0,UPPER((P9)),UPPER(C33))","v":"РАКИШЕВ АБЗАЛ"},null,null,null,null,null,null,null,null,"Логин","Логин"]
["Телефон",{"$f":"R12","v":"8-701-105-64-80   0----   ----"},null,null,{"$f":"IF(F4>0.5,\"оплачено\",IF(F4<0,\"ОПЛАТИТЬ= \"&G4,\"ОПЛАТИТЬ= \"&Q25))","v":"ОПЛАТИТЬ= 1400"},0,1100,null,null,null,"Дата заказа","дата заказа"]
["e-mail:",{"$f":"L11","v":"мыло"}]
["Вес","ПРИМЕЧАНИЯ","Наименование","Кол-во","Цена","Всего",{"$f":"IF(MAX(G7:G25)>0,MAX(G7:G25),\"\")","v":""},{"$f":"IF(I7>0,\"НАЛ\",IF(I8>0,\"ПЕРЕВОД\",IF(I9>0,\"Beeline\",IF(I10>0,\"KASPI\",IF(I11>0,\"QIWI\",IF(I12>0,\"СЧЁТ Альфа-Банк\",0))))))","v":0},{"$f":"SUM(I7:I28)","v":0}]
[{"$f":"IF(L24>0,Q24*1/100,\"\")","v":""},"списано","Неодимовый магнит D10x2mm(Аксиал)`42 (сила притяжения 1,8 кг)",500,54,{"$f":"IF(D7<>\"\",E7*D7,\"\")","v":27000},{"$f":"IF(I7 >0,TODAY(),\"\")","v":""},"НАЛ",null,{"$f":"IFERROR(IFERROR(VLOOKUP(C7,#REF!,3,0)*D7,VLOOKUP(C7,#REF!,7,0)*D7),\"нет веса\")","v":"нет веса"},"Заказ №2080"]
[{"$f":"IF(L25>0,Q25*1/100,\"\")","v":""},null,{"$f":"IF(L27<>\"\",K27,\"\")","v":""},{"$f":"IF(L27>0,L27,\"\")","v":""},{"$f":"IF(M27=\"уточняйте\",0,IF(L27>0,M27,\"\"))","v":""},"","","ПЕРЕВОД",null,{"$f":"IFERROR(IFERROR(VLOOKUP(C8,#REF!,3,0)*D8,VLOOKUP(C8,#REF!,7,0)*D8),\"нет веса\")","v":"нет веса"}]
[{"$f":"IF(L26>0,Q26*1/100,\"\")","v":""},null,"","","","","","Beeline",null,{"$f":"IFERROR(IFERROR(VLOOKUP(C9,#REF!,3,0)*D9,VLOOKUP(C9,#REF!,7,0)*D9),\"нет веса\")","v":"нет веса"},"Здравствуйте, Ракишев Абзал",null,null,null,null,{"$f":"MID(K9,15,70)","v":"Ракишев Абзал"},{"$f":"TEXT(SUM(MID(0&L9,LARGE(ISNUMBER(-MID(L9,ROW($1:$96),1))*ROW($1:$96),ROW($1:$23)+15)+1,1)*10^ROW($1:$23)/10),REPT(0,MIN(MAX(COUNT(1/(MID(L9,ROW($1:$96),1)+1))-15,),15)))&TEXT(SUM(MID(0&L9,LARGE(ISNUMBER(-MID(L9,ROW($1:$96),1))*ROW($1:$96),ROW($1:$23))+1,1)*10^ROW($1:$23)/10),REPT(0,MIN(COUNT(1/(MID(L9,ROW($1:$96),1)+1)),15)))","v":""}]
["",null,"","","","","","KASPI",null,{"$f":"IFERROR(IFERROR(VLOOKUP(C10,#REF!,3,0)*D10,VLOOKUP(C10,#REF!,7,0)*D10),\"нет веса\")","v":"нет веса"},"Мы получили Ваш заказ номер, 2080"]
["",null,"","","","","","QIWI",null,{"$f":"IFERROR(IFERROR(VLOOKUP(C11,#REF!,3,0)*D11,VLOOKUP(C11,#REF!,7,0)*D11),\"нет веса\")","v":"нет веса"},"Электронная почта","мыло"]
["",null,"","","","","","СЧЁТ Альфа-Банк",null,{"$f":"IFERROR(IFERROR(VLOOKUP(C12,#REF!,3,0)*D12,VLOOKUP(C12,#REF!,7,0)*D12),\"нет веса\")","v":"нет веса"},"Контактный телефон","87011056480",null,null,null,{"$f":"(L12&\"  \"&P13)","v":"87011056480  0"},{"$f":"TEXT(SUM(MID(0&P12,LARGE(ISNUMBER(-MID(P12,ROW($1:$99),1))*ROW($1:$99),ROW($1:$15)+30)+1,1)*10^ROW($1:$15)/10),REPT(0,MIN(MAX(COUNT(1/(MID(P12,ROW($1:$99),1)+1))-30,),15)))&TEXT(SUM(MID(0&P12,LARGE(ISNUMBER(-MID(P12,ROW($1:$99),1))*ROW($1:$99),ROW($1:$15)+15)+1,1)*10^ROW($1:$15)/10),REPT(0,MIN(MAX(COUNT(1/(MID(P12,ROW($1:$99),1)+1))-15,),15)))&TEXT(SUM(MID(0&P12,LARGE(ISNUMBER(-MID(P12,ROW($1:$99),1))*ROW($1:$99),ROW($1:$15))+1,1)*10^ROW($1:$15)/10),REPT(0,MIN(COUNT(1/(MID(P12,ROW($1:$99),1)+1)),15)))","v":"870110564800"},{"$f":"(MID(Q12,1,1))&\"-\"&(MID(Q12,2,3))&\"-\"&(MID(Q12,5,3))&\"-\"&(MID(Q12,8,2))&\"-\"&(MID(Q12,10,2))&\"   \"&(MID(Q12,12,1))&\"-\"&(MID(Q12,13,3))&\"-\"&(MID(Q12,16,3))&\"-\"&(MID(Q12,19,2))&\"-\"&(MID(Q12,21,2))&\"   \"&(MID(Q12,23,1))&\"-\"&(MID(Q12,24,3))&\"-\"&(MID(Q12,27,3))&\"-\"&(MID(Q12,30,2))&\"-\"&(MID(Q12,32,2))","v":"8-701-105-64-80   0----   ----"}]
["",null,"","","","","",null,null,{"$f":"IFERROR(IFERROR(VLOOKUP(C13,#REF!,3,0)*D13,VLOOKUP(C13,#REF!,7,0)*D13),\"нет веса\")","v":"нет веса"},null,null,null,null,null,{"$f":"IF(L13=\"-\",IFERROR(НайтиСтрокуПоСлову(\"Комментарий\",K27:K60),0),L13)","v":0}]
["",null,"","","","","",null,null,{"$f":"IFERROR(IFERROR(VLOOKUP(C14,#REF!,3,0)*D14,VLOOKUP(C14,#REF!,7,0)*D14),\"нет веса\")","v":"нет веса"},"Доставка:",null,null,null,null,{"$f":"MID(L14,23,70)","v":""}]
["",null,"","","","","",null,null,{"$f":"IFERROR(IFERROR(VLOOKUP(C15,#REF!,3,0)*D15,VLOOKUP(C15,#REF!,7,0)*D15),\"нет веса\")","v":"нет веса"},"Оплата:",null,null,null,null,{"$f":"IF(LEFT(P14,2)=\"EX\",MID(L15,11,70),L15)","v":0},{"$f":"TEXT(SUM(MID(0&P15,LARGE(ISNUMBER(-MID(P15,ROW($1:$88),1))*ROW($1:$88),ROW($1:$15)+15)+1,1)*10^ROW($1:$15)/10),REPT(0,MIN(MAX(COUNT(1/(MID(P15,ROW($1:$88),1)+1))-15,),15)))&TEXT(SUM(MID(0&P15,LARGE(ISNUMBER(-MID(P15,ROW($1:$88),1))*ROW($1:$88),ROW($1:$15))+1,1)*10^ROW($1:$15)/10),REPT(0,MIN(COUNT(1/(MID(P15,ROW($1:$88),1)+1)),15)))","v":"0"},{"$f":"SUMPRODUCT(--SUBSTITUTE(Q15:Q15,CHAR(160),))","v":0},{"$f":"LEN(Q15)","v":1},{"$f":"FLOOR(S15/3,1)","v":0}]
["",null,"","","","","",null,null,{"$f":"IFERROR(IFERROR(VLOOKUP(C16,#REF!,3,0)*D16,VLOOKUP(C16,#REF!,7,0)*D16),\"нет веса\")","v":"нет веса"},"Адрес доставки","Индекс: ",null,null,null,{"$f":"MID(L16,9,70)","v":""}]
["",null,"","","","","",null,null,{"$f":"IFERROR(IFERROR(VLOOKUP(C17,#REF!,3,0)*D17,VLOOKUP(C17,#REF!,7,0)*D17),\"нет веса\")","v":"нет веса"},null,"Страна: ",null,null,null,{"$f":"MID(L17,9,70)","v":""},{"$f":"IF(LEFT(K17,4)=\"ваша\",VALUE(MID(K17,13,20))*100,0)","v":0}]
["",null,"","","","","",null,null,{"$f":"IFERROR(IFERROR(VLOOKUP(C18,#REF!,3,0)*D18,VLOOKUP(C18,#REF!,7,0)*D18),\"нет веса\")","v":"нет веса"},null,"Область: ",null,null,null,{"$f":"MID(L18,10,70)","v":""}]
["",null,"","","","","",null,null,{"$f":"IFERROR(IFERROR(VLOOKUP(C19,#REF!,3,0)*D19,VLOOKUP(C19,#REF!,7,0)*D19),\"нет веса\")","v":"нет веса"},null,"Город: ",null,null,null,{"$f":"MID(L19,8,70)","v":""},{"$f":"IF(LEFT(K19,4)=\"ваша\",VALUE(MID(K19,13,20))*100,0)","v":0}]
["",null,"","","","","",null,null,{"$f":"IFERROR(IFERROR(VLOOKUP(C20,#REF!,3,0)*D20,VLOOKUP(C20,#REF!,7,0)*D20),\"нет веса\")","v":"нет веса"},null,"Улица: ",null,null,null,{"$f":"MID(L20,8,70)","v":""},{"$f":"IF(LEFT(K31,4)=\"ваша\",VALUE(MID(K31,13,20))*100,0)","v":0}]
["",null,"","","","","",null,null,{"$f":"IFERROR(IFERROR(VLOOKUP(C21,#REF!,3,0)*D21,VLOOKUP(C21,#REF!,7,0)*D21),\"нет веса\")","v":"нет веса"},null,"Здание: ",null,null,null,{"$f":"MID(L21,9,70)","v":""},{"$f":"IF(LEFT(K32,4)=\"ваша\",VALUE(MID(K32,13,20))*100,0)","v":0}]
["",null,"","","","","",null,null,{"$f":"IFERROR(IFERROR(VLOOKUP(C22,#REF!,3,0)*D22,VLOOKUP(C22,#REF!,7,0)*D22),\"нет веса\")","v":"нет веса"},null,"Квартира: ",null,null,null,{"$f":"MID(L22,11,70)","v":""},{"$f":"IF(LEFT(#REF!,4)=\"ваша\",VALUE(MID(#REF!,13,20))*100,0)","v":{"$error":"#REF!"}}]
["",null,null,null,"Итого:",{"$f":"SUM(F7:F22)","v":27000},"",null,null,{"$f":"IF(K40>0,M40,\"\")","v":""},"Наименование","Количество","Цена","Вес","Всего",null,{"$f":"IF(LEFT(K33,4)=\"ваша\",VALUE(MID(K33,13,20))*100,0)","v":0}]
[{"$f":"IF(L41>0,N41,\"\")","v":""},null,null,"скидка:",{"$f":"IF(F23>150000,10,IF(F23>100000,8,IF(F23>60000,5,IF(F23>30000,3,0))))","v":0},{"$f":"F23-(F23*E24/100)","v":27000},{"$f":"IFERROR(SUM(I7:I22)-F29+1,0)","v":-28999},null,null,null,null,null,null,null,null,{"$f":"N24","v":0},{"$f":"TEXT(SUM(MID(0&P24,LARGE(ISNUMBER(-MID(P24,ROW($1:$88),1))*ROW($1:$88),ROW($1:$15)+15)+1,1)*10^ROW($1:$15)/10),REPT(0,MIN(MAX(COUNT(1/(MID(P24,ROW($1:$88),1)+1))-15,),15)))&TEXT(SUM(MID(0&P24,LARGE(ISNUMBER(-MID(P24,ROW($1:$88),1))*ROW($1:$88),ROW($1:$15))+1,1)*10^ROW($1:$15)/10),REPT(0,MIN(COUNT(1/(MID(P24,ROW($1:$88),1)+1)),15)))","v":"0"}]
[{"$f":"SUM(A7:A23)/1000*1.3","v":0},null,{"$f":"IF(E25=F26,\"Доставка БЕСПЛАТНО\",IF(E25=D26,C26,IF(E25=D27,C27,IF(E25=D28,C28,IF(E25=F27,C27&\" + НПл\",IF(E25=F28,C28&\" + НПл\",\"Укажите ТК\"))))))","v":"AVIS EXPRESS  Кокшетау + НПл"},2,{"$f":"F28","v":"1400 + НПл"},null,{"$f":"IF(I25 >0,TODAY(),\"\")","v":""},null,null,{"$f":"SUM(J7:J22)/1000","v":0},null,null,null,null,null,{"$f":"E25","v":"1400 + НПл"},{"$f":"TEXT(SUM(MID(0&P25,LARGE(ISNUMBER(-MID(P25,ROW($1:$88),1))*ROW($1:$88),ROW($1:$15)+15)+1,1)*10^ROW($1:$15)/10),REPT(0,MIN(MAX(COUNT(1/(MID(P25,ROW($1:$88),1)+1))-15,),15)))&TEXT(SUM(MID(0&P25,LARGE(ISNUMBER(-MID(P25,ROW($1:$88),1))*ROW($1:$88),ROW($1:$15))+1,1)*10^ROW($1:$15)/10),REPT(0,MIN(COUNT(1/(MID(P25,ROW($1:$88),1)+1)),15)))","v":"1400"},{"$f":"E25","v":"1400 + НПл"},{"$f":"TEXT(SUM(MID(0&R25,LARGE(ISNUMBER(-MID(R25,ROW($1:$88),1))*ROW($1:$88),ROW($1:$15)+15)+1,1)*10^ROW($1:$15)/10),REPT(0,MIN(MAX(COUNT(1/(MID(R25,ROW($1:$88),1)+1))-15,),15)))&TEXT(SUM(MID(0&R25,LARGE(ISNUMBER(-MID(R25,ROW($1:$88),1))*ROW($1:$88),ROW($1:$15))+1,1)*10^ROW($1:$15)/10),REPT(0,MIN(COUNT(1/(MID(R25,ROW($1:$88),1)+1)),15)))","v":"1400"},null,{"$f":"TEXT(SUM(MID(0&E25,LARGE(ISNUMBER(-MID(E25,ROW($1:$88),1))*ROW($1:$88),ROW($1:$15)+15)+1,1)*10^ROW($1:$15)/10),REPT(0,MIN(MAX(COUNT(1/(MID(E25,ROW($1:$88),1)+1))-15,),15)))&TEXT(SUM(MID(0&E25,LARGE(ISNUMBER(-MID(E25,ROW($1:$88),1))*ROW($1:$88),ROW($1:$15))+1,1)*10^ROW($1:$15)/10),REPT(0,MIN(COUNT(1/(MID(E25,ROW($1:$88),1)+1)),15)))","v":{"$error":"#NUM!"}}]
[null,null,{"$f":"IFERROR(\"AVIS С А М О В Ы В О З \"&\"  \"&VLOOKUP((LEFT(B34,(LEN(B34)))),'ТАРИФЫ ТК'!J17:L268,1,0),\"НЕТ ДОСТАВКИ\")","v":"AVIS С А М О В Ы В О З   Кокшетау"},{"$f":"IFERROR(VLOOKUP((LEFT(B34,(LEN(B34)))),'ТАРИФЫ ТК'!J17:L268,3,0)+0.001,\"НЕТ ДОСТАВКИ\")","v":1550.001},{"$f":"IFERROR(F24+D26,\"НЕТ ДОСТАВКИ\")","v":28550.001},{"$f":"IFERROR(D26&\" + НПл\",\"НЕТ ДОСТАВКИ\")","v":"1550,001 + НПл"},{"$f":"IFERROR(CEILING((F24+D26)*(1+$D$25/100),50),0)","v":29150},null,null,null,null,null,null,null,null,{"$f":"N26","v":0},{"$f":"TEXT(SUM(MID(0&P26,LARGE(ISNUMBER(-MID(P26,ROW($1:$88),1))*ROW($1:$88),ROW($1:$15)+15)+1,1)*10^ROW($1:$15)/10),REPT(0,MIN(MAX(COUNT(1/(MID(P26,ROW($1:$88),1)+1))-15,),15)))&TEXT(SUM(MID(0&P26,LARGE(ISNUMBER(-MID(P26,ROW($1:$88),1))*ROW($1:$88),ROW($1:$15))+1,1)*10^ROW($1:$15)/10),REPT(0,MIN(COUNT(1/(MID(P26,ROW($1:$88),1)+1)),15)))","v":"0"}]
[null,null,{"$f":"IFERROR(\"AVIS Econom\"&\"  \"&VLOOKUP((LEFT(B34,(LEN(B34)))),'ТАРИФЫ ТК'!A4:A134,1,0),\"НЕТ ДОСТАВКИ\")","v":"AVIS Econom  Кокшетау"},{"$f":"IFERROR(VLOOKUP((LEFT(B34,(LEN(B34)))),'ТАРИФЫ ТК'!A4:C134,3,0),\"НЕТ ДОСТАВКИ\")","v":1300},{"$f":"IFERROR(F24+D27,\"НЕТ ДОСТАВКИ\")","v":28300},{"$f":"IFERROR(D27&\" + НПл\",\"НЕТ ДОСТАВКИ\")","v":"1300 + НПл"},{"$f":"IFERROR(CEILING((F24+D27)*(1+$D$25/100),50),0)","v":28900},null,null,null,null,null,null,null,null,0,{"$f":"TEXT(SUM(MID(0&P27,LARGE(ISNUMBER(-MID(P27,ROW($1:$88),1))*ROW($1:$88),ROW($1:$15)+15)+1,1)*10^ROW($1:$15)/10),REPT(0,MIN(MAX(COUNT(1/(MID(P27,ROW($1:$88),1)+1))-15,),15)))&TEXT(SUM(MID(0&P27,LARGE(ISNUMBER(-MID(P27,ROW($1:$88),1))*ROW($1:$88),ROW($1:$15))+1,1)*10^ROW($1:$15)/10),REPT(0,MIN(COUNT(1/(MID(P27,ROW($1:$88),1)+1)),15)))","v":"0"}]
[null,null,{"$f":"IFERROR(IF(A29<1,\"AVIS EXPRESS\"&\"  \"&VLOOKUP((LEFT(B34,(LEN(B34)))),'ТАРИФЫ ТК'!E4:G20,1,0),\"AV ВИМАНИЕ:   В Е С    П О С Ы Л К И    Б О Л Ь Ш Е   0,5 КГ   !!!\"),\"НЕТ ДОСТАВКИ\")","v":"AVIS EXPRESS  Кокшетау"},{"$f":"IFERROR(VLOOKUP((LEFT(B34,(LEN(B34)))),'ТАРИФЫ ТК'!E4:G20,3,0),\"НЕТ ДОСТАВКИ\")","v":1400},{"$f":"IFERROR(F24+D28,\"НЕТ ДОСТАВКИ\")","v":28400},{"$f":"D28&\" + НПл\"","v":"1400 + НПл"},{"$f":"IFERROR(CEILING((F24+D28)*(1+$D$25/100),50),\"НЕТ ДОСТАВКИ\")","v":29000},null,null,null,null,null,null,null,null,0,{"$f":"TEXT(SUM(MID(0&P28,LARGE(ISNUMBER(-MID(P28,ROW($1:$88),1))*ROW($1:$88),ROW($1:$15)+15)+1,1)*10^ROW($1:$15)/10),REPT(0,MIN(MAX(COUNT(1/(MID(P28,ROW($1:$88),1)+1))-15,),15)))&TEXT(SUM(MID(0&P28,LARGE(ISNUMBER(-MID(P28,ROW($1:$88),1))*ROW($1:$88),ROW($1:$15))+1,1)*10^ROW($1:$15)/10),REPT(0,MIN(COUNT(1/(MID(P28,ROW($1:$88),1)+1)),15)))","v":"0"}]
[{"$f":"IFERROR(A25*1.5,\"Количество ??\")","v":0},null,null,"К ОПЛАТЕ:",{"$f":"IFERROR(F24+E25,0)","v":0},{"$f":"IF(E25=C29,\"Доставка БЕСПЛАТНО\",IF(E25=D26,E26,IF(E25=D27,E27,IF(E25=D28,E28,IF(E25=F27,G27,IF(E25=F28,G28,IF(E25=F26,G26,\"Укажите ТК\")))))))","v":29000},{"$f":"IFERROR(CEILING((F24+E25)*1.03,50),0)","v":0},null,null,{"$f":"IFERROR(J25*1.5,\"Количество ??\")","v":0},null,null,null,null,null,0,{"$f":"TEXT(SUM(MID(0&P29,LARGE(ISNUMBER(-MID(P29,ROW($1:$88),1))*ROW($1:$88),ROW($1:$15)+15)+1,1)*10^ROW($1:$15)/10),REPT(0,MIN(MAX(COUNT(1/(MID(P29,ROW($1:$88),1)+1))-15,),15)))&TEXT(SUM(MID(0&P29,LARGE(ISNUMBER(-MID(P29,ROW($1:$88),1))*ROW($1:$88),ROW($1:$15))+1,1)*10^ROW($1:$15)/10),REPT(0,MIN(COUNT(1/(MID(P29,ROW($1:$88),1)+1)),15)))","v":"0"}]
["rc11091kz",null,{"$f":"IFERROR((P14&\"        \"&LEFT(P15,8)&\" = \"&TEXT(R15,\"### ### ###\")&\" т.\"),\"НЕТ ДОСТАВКИ\")","v":"        0 =  т."},null,{"$f":"IFERROR(\"QIWI = \"&CEILING((E26*1.02),10),0)","v":"QIWI = 29130"},{"$f":"IFERROR(F29-F24,\"УКАЖИТЕ ТК\")","v":2000},null,null,null,null,null,null,null,null,null,0,{"$f":"TEXT(SUM(MID(0&P30,LARGE(ISNUMBER(-MID(P30,ROW($1:$88),1))*ROW($1:$88),ROW($1:$15)+15)+1,1)*10^ROW($1:$15)/10),REPT(0,MIN(MAX(COUNT(1/(MID(P30,ROW($1:$88),1)+1))-15,),15)))&TEXT(SUM(MID(0&P30,LARGE(ISNUMBER(-MID(P30,ROW($1:$88),1))*ROW($1:$88),ROW($1:$15))+1,1)*10^ROW($1:$15)/10),REPT(0,MIN(COUNT(1/(MID(P30,ROW($1:$88),1)+1)),15)))","v":"0"}]
[{"$f":"A1","v":"170820++29000"},"ПОЛУЧАТЕЛЬ:","rc11091kz",null,null,null,null,null,null,null,null,null,null,null,null,0,{"$f":"TEXT(SUM(MID(0&P31,LARGE(ISNUMBER(-MID(P31,ROW($1:$88),1))*ROW($1:$88),ROW($1:$15)+15)+1,1)*10^ROW($1:$15)/10),REPT(0,MIN(MAX(COUNT(1/(MID(P31,ROW($1:$88),1)+1))-15,),15)))&TEXT(SUM(MID(0&P31,LARGE(ISNUMBER(-MID(P31,ROW($1:$88),1))*ROW($1:$88),ROW($1:$15))+1,1)*10^ROW($1:$15)/10),REPT(0,MIN(COUNT(1/(MID(P31,ROW($1:$88),1)+1)),15)))","v":"0"}]
[{"$f":"UPPER((B3))","v":"РАКИШЕВ АБЗАЛ"},null,{"$f":"IFERROR(MID(НайтиСтрокуПоСлову(\"Комментарий: Имя :\",K1:K45),20,99),0)","v":0},null,null,null,null,null,null,null,null,null,null,null,null,0,{"$f":"TEXT(SUM(MID(0&P32,LARGE(ISNUMBER(-MID(P32,ROW($1:$88),1))*ROW($1:$88),ROW($1:$15)+15)+1,1)*10^ROW($1:$15)/10),REPT(0,MIN(MAX(COUNT(1/(MID(P32,ROW($1:$88),1)+1))-15,),15)))&TEXT(SUM(MID(0&P32,LARGE(ISNUMBER(-MID(P32,ROW($1:$88),1))*ROW($1:$88),ROW($1:$15))+1,1)*10^ROW($1:$15)/10),REPT(0,MIN(COUNT(1/(MID(P32,ROW($1:$88),1)+1)),15)))","v":"0"}]
["Область: ",{"$f":"UPPER((P18))","v":""},{"$f":"IFERROR(ПоискСНачала(C32,\"Телефон\"),0)","v":0},null,{"$f":"IFERROR(ПоискМежду(C32,\"Телефон :\",\"Примечание\"),0)","v":0},{"$f":"IFERROR(IF(LEFT(ПоискСКонца(C32,\"Примечание : \"),2)=\"г \",MID(ПоискСКонца(C32,\"Примечание : \"),3,99),IF(LEFT(ПоискСКонца(C32,\"Примечание : \"),3)=\"г. \",MID(ПоискСКонца(C32,\"Примечание : \"),4,99),IF(LEFT(ПоискСКонца(C32,\"Примечание : \"),3)=\"гор\",MID(ПоискСКонца(C32,\"Примечание : \"),6,99),0))),0)","v":0},null,null,null,null,null,null,null,null,null,0,{"$f":"TEXT(SUM(MID(0&P33,LARGE(ISNUMBER(-MID(P33,ROW($1:$88),1))*ROW($1:$88),ROW($1:$15)+15)+1,1)*10^ROW($1:$15)/10),REPT(0,MIN(MAX(COUNT(1/(MID(P33,ROW($1:$88),1)+1))-15,),15)))&TEXT(SUM(MID(0&P33,LARGE(ISNUMBER(-MID(P33,ROW($1:$88),1))*ROW($1:$88),ROW($1:$15))+1,1)*10^ROW($1:$15)/10),REPT(0,MIN(COUNT(1/(MID(P33,ROW($1:$88),1)+1)),15)))","v":"0"}]
["Город: ","Кокшетау",null,null,null,null,null,null,null,null,null,null,null,null,null,0,{"$f":"TEXT(SUM(MID(0&P34,LARGE(ISNUMBER(-MID(P34,ROW($1:$88),1))*ROW($1:$88),ROW($1:$15)+15)+1,1)*10^ROW($1:$15)/10),REPT(0,MIN(MAX(COUNT(1/(MID(P34,ROW($1:$88),1)+1))-15,),15)))&TEXT(SUM(MID(0&P34,LARGE(ISNUMBER(-MID(P34,ROW($1:$88),1))*ROW($1:$88),ROW($1:$15))+1,1)*10^ROW($1:$15)/10),REPT(0,MIN(COUNT(1/(MID(P34,ROW($1:$88),1)+1)),15)))","v":"0"}]
["Улица: ","Акан-Сере",null,null,null,null,null,null,null,null,null,null,null,null,null,0,{"$f":"TEXT(SUM(MID(0&P35,LARGE(ISNUMBER(-MID(P35,ROW($1:$88),1))*ROW($1:$88),ROW($1:$15)+15)+1,1)*10^ROW($1:$15)/10),REPT(0,MIN(MAX(COUNT(1/(MID(P35,ROW($1:$88),1)+1))-15,),15)))&TEXT(SUM(MID(0&P35,LARGE(ISNUMBER(-MID(P35,ROW($1:$88),1))*ROW($1:$88),ROW($1:$15))+1,1)*10^ROW($1:$15)/10),REPT(0,MIN(COUNT(1/(MID(P35,ROW($1:$88),1)+1)),15)))","v":"0"}]
["Здание: ",113,null,null,null,null,null,null,null,null,null,null,null,null,null,0,{"$f":"TEXT(SUM(MID(0&P36,LARGE(ISNUMBER(-MID(P36,ROW($1:$88),1))*ROW($1:$88),ROW($1:$15)+15)+1,1)*10^ROW($1:$15)/10),REPT(0,MIN(MAX(COUNT(1/(MID(P36,ROW($1:$88),1)+1))-15,),15)))&TEXT(SUM(MID(0&P36,LARGE(ISNUMBER(-MID(P36,ROW($1:$88),1))*ROW($1:$88),ROW($1:$15))+1,1)*10^ROW($1:$15)/10),REPT(0,MIN(COUNT(1/(MID(P36,ROW($1:$88),1)+1)),15)))","v":"0"}]
["Квартира: ",68,null,null,null,null,null,null,null,null,null,null,null,null,null,0,{"$f":"TEXT(SUM(MID(0&P37,LARGE(ISNUMBER(-MID(P37,ROW($1:$88),1))*ROW($1:$88),ROW($1:$15)+15)+1,1)*10^ROW($1:$15)/10),REPT(0,MIN(MAX(COUNT(1/(MID(P37,ROW($1:$88),1)+1))-15,),15)))&TEXT(SUM(MID(0&P37,LARGE(ISNUMBER(-MID(P37,ROW($1:$88),1))*ROW($1:$88),ROW($1:$15))+1,1)*10^ROW($1:$15)/10),REPT(0,MIN(COUNT(1/(MID(P37,ROW($1:$88),1)+1)),15)))","v":"0"}]
["Телефон: ",{"$f":"B4","v":"8-701-105-64-80   0----   ----"},null,null,null,null,null,null,null,null,null,null,null,null,null,0,{"$f":"TEXT(SUM(MID(0&P38,LARGE(ISNUMBER(-MID(P38,ROW($1:$88),1))*ROW($1:$88),ROW($1:$15)+15)+1,1)*10^ROW($1:$15)/10),REPT(0,MIN(MAX(COUNT(1/(MID(P38,ROW($1:$88),1)+1))-15,),15)))&TEXT(SUM(MID(0&P38,LARGE(ISNUMBER(-MID(P38,ROW($1:$88),1))*ROW($1:$88),ROW($1:$15))+1,1)*10^ROW($1:$15)/10),REPT(0,MIN(COUNT(1/(MID(P38,ROW($1:$88),1)+1)),15)))","v":"0"}]
["Индекс: ",{"$f":"P16","v":""},null,null,null,null,null,null,null,null,null,null,null,null,null,null,{"$f":"IF(LEFT(#REF!,4)=\"ваша\",VALUE(MID(#REF!,13,20))*100,0)","v":{"$error":"#REF!"}}]
["Компания:",null,null,null,null,null,null,null,null,null,null,null,null,null,null,null,{"$f":"IF(LEFT(#REF!,4)=\"ваша\",VALUE(MID(#REF!,13,20))*100,0)","v":{"$error":"#REF!"}}]
["ИИН:",{"$f":"F29","v":29000},null,null,null,null,null,null,null,null,null,null,null,null,null,null,{"$f":"IF(LEFT(#REF!,4)=\"ваша\",VALUE(MID(#REF!,13,20))*100,0)","v":{"$error":"#REF!"}}]
["------------------------","----------------------------------------------------","----------------------------------------------------","------------------------","------------------------","---------------------------","------------------------------","------------------------","------------------------",null,null,null,null,null,null,null,{"$f":"SUM(Q19:Q41)","v":{"$error":"#REF!"}}]

{"sheet":"140820++29300","index":7,"n_rows":42,"n_cols":21,"rows_kept":42,"cut":false,"hidden":false,"merged":[[27,6,27,8],[31,0,31,1],[37,1,37,2],[0,4,0,7],[1,4,1,8],[2,1,2,2],[3,1,3,2],[25,6,25,8],[26,6,26,8]]}
[{"$f":"IF(LEFT(C29,2)=\"сп\",P1&\" ► СП\",IF(E25=D26,P1,IF(H6<>0,P1&\"++\"&\"0\",IF(E25=D27,P1&\"++\"&\"0\",IF(E25=D28,P1&\"++\"&\"0\",IF(E25=D27,P1&\"++\"&\"0\",IF(E25=D28,P1&\"++\"&\"0\",IF(LEFT(C25,2)=\"AV\",P1&\"++\"&F29,P1))))))))","v":"140820++29300"},"2020-08-14",{"$f":"IF(E2>0,\"ОТПРАВЛЕНО\",IF(LEFT(C29,3)=\"ЗАК\",\"ЗАКАЗАНО в СПБ\",IF(G24>=0,\"ОПЛОЧЕНО\",\"ОЖИДАНИЕ ОПЛАТЫ\")))","v":"ОТПРАВЛЕНО"},{"$f":"'СПИСОК ЗАКАЗОВ'!B1","v":21},"2020-08-14",null,null,null,{"$f":"A1","v":"140820++29300"},null,140820,null,null,null,null,{"$f":"IF(G24>0,\"+\"&H6&\"+\"&Q1,Q1)","v":"140820"},{"$f":"ПоискСКонца(K1,\"№\")","v":"140820"}]
["Логин",{"$f":"L3","v":"Логин"},"Номер накл-ой",null,3611550,null,null,null,null,null,"Примечание"]
["ФИО",{"$f":"IF(C32=0,UPPER((P9)),UPPER(C33))","v":"АБУЛКАСИМОВ БАУЫРЖАН"},null,null,null,null,null,null,null,null,"Логин","Логин"]
["Телефон",{"$f":"R12","v":"8-702-673-12-82   0----   ----"},null,null,{"$f":"IF(F4>0.5,\"оплачено\",IF(F4<0,\"ОПЛАТИТЬ= \"&G4,\"ОПЛАТИТЬ= \"&Q25))","v":"ОПЛАТИТЬ= 1400"},0,1100,null,null,null,"Дата заказа","дата заказа"]
["e-mail:",{"$f":"L11","v":"мыло"}]
["Вес","ПРИМЕЧАНИЯ","Наименование","Кол-во","Цена","Всего",{"$f":"IF(MAX(G7:G25)>0,MAX(G7:G25),\"\")","v":""},{"$f":"IF(I7>0,\"НАЛ\",IF(I8>0,\"ПЕРЕВОД\",IF(I9>0,\"Beeline\",IF(I10>0,\"KASPI\",IF(I11>0,\"QIWI\",IF(I12>0,\"СЧЁТ Альфа-Банк\",0))))))","v":0},{"$f":"SUM(I7:I28)","v":0}]
[{"$f":"IF(L24>0,Q24*1/100,\"\")","v":""},"списано","Неодимовый магнит D50x20mm(Аксиал)`35 (сила притяжения 100 кг)",3,9100,{"$f":"IF(D7<>\"\",E7*D7,\"\")","v":27300},{"$f":"IF(I7 >0,TODAY(),\"\")","v":""},"НАЛ",null,{"$f":"IFERROR(IFERROR(VLOOKUP(C7,#REF!,3,0)*D7,VLOOKUP(C7,#REF!,7,0)*D7),\"нет веса\")","v":"нет веса"},"Заказ №2080"]
[{"$f":"IF(L25>0,Q25*1/100,\"\")","v":""},null,{"$f":"IF(L27<>\"\",K27,\"\")","v":""},{"$f":"IF(L27>0,L27,\"\")","v":""},{"$f":"IF(M27=\"уточняйте\",0,IF(L27>0,M27,\"\"))","v":""},"","","ПЕРЕВОД",null,{"$f":"IFERROR(IFERROR(VLOOKUP(C8,#REF!,3,0)*D8,VLOOKUP(C8,#REF!,7,0)*D8),\"нет веса\")","v":"нет веса"}]
[{"$f":"IF(L26>0,Q26*1/100,\"\")","v":""},null,"","","","","","Beeline",null,{"$f":"IFERROR(IFERROR(VLOOKUP(C9,#REF!,3,0)*D9,VLOOKUP(C9,#REF!,7,0)*D9),\"нет веса\")","v":"нет веса"},"Здравствуйте, Абулкасимов Бауыржан",null,null,null,null,{"$f":"MID(K9,15,70)","v":"Абулкасимов Бауыржан"},{"$f":"TEXT(SUM(MID(0&L9,LARGE(ISNUMBER(-MID(L9,ROW($1:$96),1))*ROW($1:$96),ROW($1:$23)+15)+1,1)*10^ROW($1:$23)/10),REPT(0,MIN(MAX(COUNT(1/(MID(L9,ROW($1:$96),1)+1))-15,),15)))&TEXT(SUM(MID(0&L9,LARGE(ISNUMBER(-MID(L9,ROW($1:$96),1))*ROW($1:$96),ROW($1:$23))+1,1)*10^ROW($1:$23)/10),REPT(0,MIN(COUNT(1/(MID(L9,ROW($1:$96),1)+1)),15)))","v":""}]
["",null,"","","","","","KASPI",null,{"$f":"IFERROR(IFERROR(VLOOKUP(C10,#REF!,3,0)*D10,VLOOKUP(C10,#REF!,7,0)*D10),\"нет веса\")","v":"нет веса"},"Мы получили Ваш заказ номер, 2080"]
["",null,"","","","","","QIWI",null,{"$f":"IFERROR(IFERROR(VLOOKUP(C11,#REF!,3,0)*D11,VLOOKUP(C11,#REF!,7,0)*D11),\"нет веса\")","v":"нет веса"},"Электронная почта","мыло"]
["",null,"","","","","","СЧЁТ Альфа-Банк",null,{"$f":"IFERROR(IFERROR(VLOOKUP(C12,#REF!,3,0)*D12,VLOOKUP(C12,#REF!,7,0)*D12),\"нет веса\")","v":"нет веса"},"Контактный телефон","87026731282",null,null,null,{"$f":"(L12&\"  \"&P13)","v":"87026731282  0"},{"$f":"TEXT(SUM(MID(0&P12,LARGE(ISNUMBER(-MID(P12,ROW($1:$99),1))*ROW($1:$99),ROW($1:$15)+30)+1,1)*10^ROW($1:$15)/10),REPT(0,MIN(MAX(COUNT(1/(MID(P12,ROW($1:$99),1)+1))-30,),15)))&TEXT(SUM(MID(0&P12,LARGE(ISNUMBER(-MID(P12,ROW($1:$99),1))*ROW($1:$99),ROW($1:$15)+15)+1,1)*10^ROW($1:$15)/10),REPT(0,MIN(MAX(COUNT(1/(MID(P12,ROW($1:$99),1)+1))-15,),15)))&TEXT(SUM(MID(0&P12,LARGE(ISNUMBER(-MID(P12,ROW($1:$99),1))*ROW($1:$99),ROW($1:$15))+1,1)*10^ROW($1:$15)/10),REPT(0,MIN(COUNT(1/(MID(P12,ROW($1:$99),1)+1)),15)))","v":"870267312820"},{"$f":"(MID(Q12,1,1))&\"-\"&(MID(Q12,2,3))&\"-\"&(MID(Q12,5,3))&\"-\"&(MID(Q12,8,2))&\"-\"&(MID(Q12,10,2))&\"   \"&(MID(Q12,12,1))&\"-\"&(MID(Q12,13,3))&\"-\"&(MID(Q12,16,3))&\"-\"&(MID(Q12,19,2))&\"-\"&(MID(Q12,21,2))&\"   \"&(MID(Q12,23,1))&\"-\"&(MID(Q12,24,3))&\"-\"&(MID(Q12,27,3))&\"-\"&(MID(Q12,30,2))&\"-\"&(MID(Q12,32,2))","v":"8-702-673-12-82   0----   ----"}]
["",null,"","","","","",null,null,{"$f":"IFERROR(IFERROR(VLOOKUP(C13,#REF!,3,0)*D13,VLOOKUP(C13,#REF!,7,0)*D13),\"нет веса\")","v":"нет веса"},null,null,null,null,null,{"$f":"IF(L13=\"-\",IFERROR(НайтиСтрокуПоСлову(\"Комментарий\",K27:K60),0),L13)","v":0}]
["",null,"","","","","",null,null,{"$f":"IFERROR(IFERROR(VLOOKUP(C14,#REF!,3,0)*D14,VLOOKUP(C14,#REF!,7,0)*D14),\"нет веса\")","v":"нет веса"},"Доставка:",null,null,null,null,{"$f":"MID(L14,23,70)","v":""}]
["",null,"","","","","",null,null,{"$f":"IFERROR(IFERROR(VLOOKUP(C15,#REF!,3,0)*D15,VLOOKUP(C15,#REF!,7,0)*D15),\"нет веса\")","v":"нет веса"},"Оплата:",null,null,null,null,{"$f":"IF(LEFT(P14,2)=\"EX\",MID(L15,11,70),L15)","v":0},{"$f":"TEXT(SUM(MID(0&P15,LARGE(ISNUMBER(-MID(P15,ROW($1:$88),1))*ROW($1:$88),ROW($1:$15)+15)+1,1)*10^ROW($1:$15)/10),REPT(0,MIN(MAX(COUNT(1/(MID(P15,ROW($1:$88),1)+1))-15,),15)))&TEXT(SUM(MID(0&P15,LARGE(ISNUMBER(-MID(P15,ROW($1:$88),1))*ROW($1:$88),ROW($1:$15))+1,1)*10^ROW($1:$15)/10),REPT(0,MIN(COUNT(1/(MID(P15,ROW($1:$88),1)+1)),15)))","v":"0"},{"$f":"SUMPRODUCT(--SUBSTITUTE(Q15:Q15,CHAR(160),))","v":0},{"$f":"LEN(Q15)","v":1},{"$f":"FLOOR(S15/3,1)","v":0}]
["",null,"","","","","",null,null,{"$f":"IFERROR(IFERROR(VLOOKUP(C16,#REF!,3,0)*D16,VLOOKUP(C16,#REF!,7,0)*D16),\"нет веса\")","v":"нет веса"},"Адрес доставки","Индекс: ",null,null,null,{"$f":"MID(L16,9,70)","v":""}]
["",null,"","","","","",null,null,{"$f":"IFERROR(IFERROR(VLOOKUP(C17,#REF!,3,0)*D17,VLOOKUP(C17,#REF!,7,0)*D17),\"нет веса\")","v":"нет веса"},null,"Страна: ",null,null,null,{"$f":"MID(L17,9,70)","v":""},{"$f":"IF(LEFT(K17,4)=\"ваша\",VALUE(MID(K17,13,20))*100,0)","v":0}]
["",null,"","","","","",null,null,{"$f":"IFERROR(IFERROR(VLOOKUP(C18,#REF!,3,0)*D18,VLOOKUP(C18,#REF!,7,0)*D18),\"нет веса\")","v":"нет веса"},null,"Область: ",null,null,null,{"$f":"MID(L18,10,70)","v":""}]
["",null,"","","","","",null,null,{"$f":"IFERROR(IFERROR(VLOOKUP(C19,#REF!,3,0)*D19,VLOOKUP(C19,#REF!,7,0)*D19),\"нет веса\")","v":"нет веса"},null,"Город: ",null,null,null,{"$f":"MID(L19,8,70)","v":""},{"$f":"IF(LEFT(K19,4)=\"ваша\",VALUE(MID(K19,13,20))*100,0)","v":0}]
["",null,"","","","","",null,null,{"$f":"IFERROR(IFERROR(VLOOKUP(C20,#REF!,3,0)*D20,VLOOKUP(C20,#REF!,7,0)*D20),\"нет веса\")","v":"нет веса"},null,"Улица: ",null,null,null,{"$f":"MID(L20,8,70)","v":""},{"$f":"IF(LEFT(K31,4)=\"ваша\",VALUE(MID(K31,13,20))*100,0)","v":0}]
["",null,"","","","","",null,null,{"$f":"IFERROR(IFERROR(VLOOKUP(C21,#REF!,3,0)*D21,VLOOKUP(C21,#REF!,7,0)*D21),\"нет веса\")","v":"нет веса"},null,"Здание: ",null,null,null,{"$f":"MID(L21,9,70)","v":""},{"$f":"IF(LEFT(K32,4)=\"ваша\",VALUE(MID(K32,13,20))*100,0)","v":0}]
["",null,"","","","","",null,null,{"$f":"IFERROR(IFERROR(VLOOKUP(C22,#REF!,3,0)*D22,VLOOKUP(C22,#REF!,7,0)*D22),\"нет веса\")","v":"нет веса"},null,"Квартира: ",null,null,null,{"$f":"MID(L22,11,70)","v":""},{"$f":"IF(LEFT(#REF!,4)=\"ваша\",VALUE(MID(#REF!,13,20))*100,0)","v":{"$error":"#REF!"}}]
["",null,null,null,"Итого:",{"$f":"SUM(F7:F22)","v":27300},"",null,null,{"$f":"IF(K40>0,M40,\"\")","v":""},"Наименование","Количество","Цена","Вес","Всего",null,{"$f":"IF(LEFT(K33,4)=\"ваша\",VALUE(MID(K33,13,20))*100,0)","v":0}]
[{"$f":"IF(L41>0,N41,\"\")","v":""},null,null,"скидка:",{"$f":"IF(F23>150000,10,IF(F23>100000,8,IF(F23>60000,5,IF(F23>30000,3,0))))","v":0},{"$f":"F23-(F23*E24/100)","v":27300},{"$f":"IFERROR(SUM(I7:I22)-F29+1,0)","v":-29299},null,null,null,null,null,null,null,null,{"$f":"N24","v":0},{"$f":"TEXT(SUM(MID(0&P24,LARGE(ISNUMBER(-MID(P24,ROW($1:$88),1))*ROW($1:$88),ROW($1:$15)+15)+1,1)*10^ROW($1:$15)/10),REPT(0,MIN(MAX(COUNT(1/(MID(P24,ROW($1:$88),1)+1))-15,),15)))&TEXT(SUM(MID(0&P24,LARGE(ISNUMBER(-MID(P24,ROW($1:$88),1))*ROW($1:$88),ROW($1:$15))+1,1)*10^ROW($1:$15)/10),REPT(0,MIN(COUNT(1/(MID(P24,ROW($1:$88),1)+1)),15)))","v":"0"}]
[{"$f":"SUM(A7:A23)/1000*1.3","v":0},null,{"$f":"IF(E25=F26,\"Доставка БЕСПЛАТНО\",IF(E25=D26,C26,IF(E25=D27,C27,IF(E25=D28,C28,IF(E25=F27,C27&\" + НПл\",IF(E25=F28,C28&\" + НПл\",\"Укажите ТК\"))))))","v":"AVIS Econom  Семей + НПл"},2,{"$f":"F27","v":"1400 + НПл"},null,{"$f":"IF(I25 >0,TODAY(),\"\")","v":""},null,null,{"$f":"SUM(J7:J22)/1000","v":0},null,null,null,null,null,{"$f":"E25","v":"1400 + НПл"},{"$f":"TEXT(SUM(MID(0&P25,LARGE(ISNUMBER(-MID(P25,ROW($1:$88),1))*ROW($1:$88),ROW($1:$15)+15)+1,1)*10^ROW($1:$15)/10),REPT(0,MIN(MAX(COUNT(1/(MID(P25,ROW($1:$88),1)+1))-15,),15)))&TEXT(SUM(MID(0&P25,LARGE(ISNUMBER(-MID(P25,ROW($1:$88),1))*ROW($1:$88),ROW($1:$15))+1,1)*10^ROW($1:$15)/10),REPT(0,MIN(COUNT(1/(MID(P25,ROW($1:$88),1)+1)),15)))","v":"1400"},{"$f":"E25","v":"1400 + НПл"},{"$f":"TEXT(SUM(MID(0&R25,LARGE(ISNUMBER(-MID(R25,ROW($1:$88),1))*ROW($1:$88),ROW($1:$15)+15)+1,1)*10^ROW($1:$15)/10),REPT(0,MIN(MAX(COUNT(1/(MID(R25,ROW($1:$88),1)+1))-15,),15)))&TEXT(SUM(MID(0&R25,LARGE(ISNUMBER(-MID(R25,ROW($1:$88),1))*ROW($1:$88),ROW($1:$15))+1,1)*10^ROW($1:$15)/10),REPT(0,MIN(COUNT(1/(MID(R25,ROW($1:$88),1)+1)),15)))","v":"1400"},null,{"$f":"TEXT(SUM(MID(0&E25,LARGE(ISNUMBER(-MID(E25,ROW($1:$88),1))*ROW($1:$88),ROW($1:$15)+15)+1,1)*10^ROW($1:$15)/10),REPT(0,MIN(MAX(COUNT(1/(MID(E25,ROW($1:$88),1)+1))-15,),15)))&TEXT(SUM(MID(0&E25,LARGE(ISNUMBER(-MID(E25,ROW($1:$88),1))*ROW($1:$88),ROW($1:$15))+1,1)*10^ROW($1:$15)/10),REPT(0,MIN(COUNT(1/(MID(E25,ROW($1:$88),1)+1)),15)))","v":{"$error":"#NUM!"}}]
[null,null,{"$f":"IFERROR(\"AVIS С А М О В Ы В О З \"&\"  \"&VLOOKUP((LEFT(B34,(LEN(B34)))),'ТАРИФЫ ТК'!J17:L268,1,0),\"НЕТ ДОСТАВКИ\")","v":"AVIS С А М О В Ы В О З   Семей"},{"$f":"IFERROR(VLOOKUP((LEFT(B34,(LEN(B34)))),'ТАРИФЫ ТК'!J17:L268,3,0)+0.001,\"НЕТ ДОСТАВКИ\")","v":2100.0010000000002},{"$f":"IFERROR(F24+D26,\"НЕТ ДОСТАВКИ\")","v":29400.001},{"$f":"IFERROR(D26&\" + НПл\",\"НЕТ ДОСТАВКИ\")","v":"2100,001 + НПл"},{"$f":"IFERROR(CEILING((F24+D26)*(1+$D$25/100),50),0)","v":30000},null,null,null,null,null,null,null,null,{"$f":"N26","v":0},{"$f":"TEXT(SUM(MID(0&P26,LARGE(ISNUMBER(-MID(P26,ROW($1:$88),1))*ROW($1:$88),ROW($1:$15)+15)+1,1)*10^ROW($1:$15)/10),REPT(0,MIN(MAX(COUNT(1/(MID(P26,ROW($1:$88),1)+1))-15,),15)))&TEXT(SUM(MID(0&P26,LARGE(ISNUMBER(-MID(P26,ROW($1:$88),1))*ROW($1:$88),ROW($1:$15))+1,1)*10^ROW($1:$15)/10),REPT(0,MIN(COUNT(1/(MID(P26,ROW($1:$88),1)+1)),15)))","v":"0"}]
[null,null,{"$f":"IFERROR(\"AVIS Econom\"&\"  \"&VLOOKUP((LEFT(B34,(LEN(B34)))),'ТАРИФЫ ТК'!A4:A134,1,0),\"НЕТ ДОСТАВКИ\")","v":"AVIS Econom  Семей"},1400,{"$f":"IFERROR(F24+D27,\"НЕТ ДОСТАВКИ\")","v":28700},{"$f":"IFERROR(D27&\" + НПл\",\"НЕТ ДОСТАВКИ\")","v":"1400 + НПл"},{"$f":"IFERROR(CEILING((F24+D27)*(1+$D$25/100),50),0)","v":29300},null,null,null,null,null,null,null,null,0,{"$f":"TEXT(SUM(MID(0&P27,LARGE(ISNUMBER(-MID(P27,ROW($1:$88),1))*ROW($1:$88),ROW($1:$15)+15)+1,1)*10^ROW($1:$15)/10),REPT(0,MIN(MAX(COUNT(1/(MID(P27,ROW($1:$88),1)+1))-15,),15)))&TEXT(SUM(MID(0&P27,LARGE(ISNUMBER(-MID(P27,ROW($1:$88),1))*ROW($1:$88),ROW($1:$15))+1,1)*10^ROW($1:$15)/10),REPT(0,MIN(COUNT(1/(MID(P27,ROW($1:$88),1)+1)),15)))","v":"0"}]
[null,null,{"$f":"IFERROR(IF(A29<1,\"AVIS EXPRESS\"&\"  \"&VLOOKUP((LEFT(B34,(LEN(B34)))),'ТАРИФЫ ТК'!E4:G20,1,0),\"AV ВИМАНИЕ:   В Е С    П О С Ы Л К И    Б О Л Ь Ш Е   0,5 КГ   !!!\"),\"НЕТ ДОСТАВКИ\")","v":"НЕТ ДОСТАВКИ"},{"$f":"IFERROR(VLOOKUP((LEFT(B34,(LEN(B34)))),'ТАРИФЫ ТК'!E4:G20,3,0),\"НЕТ ДОСТАВКИ\")","v":"НЕТ ДОСТАВКИ"},{"$f":"IFERROR(F24+D28,\"НЕТ ДОСТАВКИ\")","v":"НЕТ ДОСТАВКИ"},{"$f":"D28&\" + НПл\"","v":"НЕТ ДОСТАВКИ + НПл"},{"$f":"IFERROR(CEILING((F24+D28)*(1+$D$25/100),50),\"НЕТ ДОСТАВКИ\")","v":"НЕТ ДОСТАВКИ"},null,null,null,null,null,null,null,null,0,{"$f":"TEXT(SUM(MID(0&P28,LARGE(ISNUMBER(-MID(P28,ROW($1:$88),1))*ROW($1:$88),ROW($1:$15)+15)+1,1)*10^ROW($1:$15)/10),REPT(0,MIN(MAX(COUNT(1/(MID(P28,ROW($1:$88),1)+1))-15,),15)))&TEXT(SUM(MID(0&P28,LARGE(ISNUMBER(-MID(P28,ROW($1:$88),1))*ROW($1:$88),ROW($1:$15))+1,1)*10^ROW($1:$15)/10),REPT(0,MIN(COUNT(1/(MID(P28,ROW($1:$88),1)+1)),15)))","v":"0"}]
[{"$f":"IFERROR(A25*1.5,\"Количество ??\")","v":0},null,null,"К ОПЛАТЕ:",{"$f":"IFERROR(F24+E25,0)","v":0},{"$f":"IF(E25=C29,\"Доставка БЕСПЛАТНО\",IF(E25=D26,E26,IF(E25=D27,E27,IF(E25=D28,E28,IF(E25=F27,G27,IF(E25=F28,G28,IF(E25=F26,G26,\"Укажите ТК\")))))))","v":29300},{"$f":"IFERROR(CEILING((F24+E25)*1.03,50),0)","v":0},null,null,{"$f":"IFERROR(J25*1.5,\"Количество ??\")","v":0},null,null,null,null,null,0,{"$f":"TEXT(SUM(MID(0&P29,LARGE(ISNUMBER(-MID(P29,ROW($1:$88),1))*ROW($1:$88),ROW($1:$15)+15)+1,1)*10^ROW($1:$15)/10),REPT(0,MIN(MAX(COUNT(1/(MID(P29,ROW($1:$88),1)+1))-15,),15)))&TEXT(SUM(MID(0&P29,LARGE(ISNUMBER(-MID(P29,ROW($1:$88),1))*ROW($1:$88),ROW($1:$15))+1,1)*10^ROW($1:$15)/10),REPT(0,MIN(COUNT(1/(MID(P29,ROW($1:$88),1)+1)),15)))","v":"0"}]
["rc11091kz",null,{"$f":"IFERROR((P14&\"        \"&LEFT(P15,8)&\" = \"&TEXT(R15,\"### ### ###\")&\" т.\"),\"НЕТ ДОСТАВКИ\")","v":"        0 =  т."},null,{"$f":"IFERROR(\"QIWI = \"&CEILING((E26*1.02),10),0)","v":"QIWI = 29990"},{"$f":"IFERROR(F29-F24,\"УКАЖИТЕ ТК\")","v":2000},null,null,null,null,null,null,null,null,null,0,{"$f":"TEXT(SUM(MID(0&P30,LARGE(ISNUMBER(-MID(P30,ROW($1:$88),1))*ROW($1:$88),ROW($1:$15)+15)+1,1)*10^ROW($1:$15)/10),REPT(0,MIN(MAX(COUNT(1/(MID(P30,ROW($1:$88),1)+1))-15,),15)))&TEXT(SUM(MID(0&P30,LARGE(ISNUMBER(-MID(P30,ROW($1:$88),1))*ROW($1:$88),ROW($1:$15))+1,1)*10^ROW($1:$15)/10),REPT(0,MIN(COUNT(1/(MID(P30,ROW($1:$88),1)+1)),15)))","v":"0"}]
[{"$f":"A1","v":"140820++29300"},"ПОЛУЧАТЕЛЬ:","rc11091kz",null,null,null,null,null,null,null,null,null,null,null,null,0,{"$f":"TEXT(SUM(MID(0&P31,LARGE(ISNUMBER(-MID(P31,ROW($1:$88),1))*ROW($1:$88),ROW($1:$15)+15)+1,1)*10^ROW($1:$15)/10),REPT(0,MIN(MAX(COUNT(1/(MID(P31,ROW($1:$88),1)+1))-15,),15)))&TEXT(SUM(MID(0&P31,LARGE(ISNUMBER(-MID(P31,ROW($1:$88),1))*ROW($1:$88),ROW($1:$15))+1,1)*10^ROW($1:$15)/10),REPT(0,MIN(COUNT(1/(MID(P31,ROW($1:$88),1)+1)),15)))","v":"0"}]
[{"$f":"UPPER((B3))","v":"АБУЛКАСИМОВ БАУЫРЖАН"},null,{"$f":"IFERROR(MID(НайтиСтрокуПоСлову(\"Комментарий: Имя :\",K1:K45),20,99),0)","v":0},null,null,null,null,null,null,null,null,null,null,null,null,0,{"$f":"TEXT(SUM(MID(0&P32,LARGE(ISNUMBER(-MID(P32,ROW($1:$88),1))*ROW($1:$88),ROW($1:$15)+15)+1,1)*10^ROW($1:$15)/10),REPT(0,MIN(MAX(COUNT(1/(MID(P32,ROW($1:$88),1)+1))-15,),15)))&TEXT(SUM(MID(0&P32,LARGE(ISNUMBER(-MID(P32,ROW($1:$88),1))*ROW($1:$88),ROW($1:$15))+1,1)*10^ROW($1:$15)/10),REPT(0,MIN(COUNT(1/(MID(P32,ROW($1:$88),1)+1)),15)))","v":"0"}]
["Область: ",{"$f":"UPPER((P18))","v":""},{"$f":"IFERROR(ПоискСНачала(C32,\"Телефон\"),0)","v":0},null,{"$f":"IFERROR(ПоискМежду(C32,\"Телефон :\",\"Примечание\"),0)","v":0},{"$f":"IFERROR(IF(LEFT(ПоискСКонца(C32,\"Примечание : \"),2)=\"г \",MID(ПоискСКонца(C32,\"Примечание : \"),3,99),IF(LEFT(ПоискСКонца(C32,\"Примечание : \"),3)=\"г. \",MID(ПоискСКонца(C32,\"Примечание : \"),4,99),IF(LEFT(ПоискСКонца(C32,\"Примечание : \"),3)=\"гор\",MID(ПоискСКонца(C32,\"Примечание : \"),6,99),0))),0)","v":0},null,null,null,null,null,null,null,null,null,0,{"$f":"TEXT(SUM(MID(0&P33,LARGE(ISNUMBER(-MID(P33,ROW($1:$88),1))*ROW($1:$88),ROW($1:$15)+15)+1,1)*10^ROW($1:$15)/10),REPT(0,MIN(MAX(COUNT(1/(MID(P33,ROW($1:$88),1)+1))-15,),15)))&TEXT(SUM(MID(0&P33,LARGE(ISNUMBER(-MID(P33,ROW($1:$88),1))*ROW($1:$88),ROW($1:$15))+1,1)*10^ROW($1:$15)/10),REPT(0,MIN(COUNT(1/(MID(P33,ROW($1:$88),1)+1)),15)))","v":"0"}]
["Город: ","Семей",null,null,null,null,null,null,null,null,null,null,null,null,null,0,{"$f":"TEXT(SUM(MID(0&P34,LARGE(ISNUMBER(-MID(P34,ROW($1:$88),1))*ROW($1:$88),ROW($1:$15)+15)+1,1)*10^ROW($1:$15)/10),REPT(0,MIN(MAX(COUNT(1/(MID(P34,ROW($1:$88),1)+1))-15,),15)))&TEXT(SUM(MID(0&P34,LARGE(ISNUMBER(-MID(P34,ROW($1:$88),1))*ROW($1:$88),ROW($1:$15))+1,1)*10^ROW($1:$15)/10),REPT(0,MIN(COUNT(1/(MID(P34,ROW($1:$88),1)+1)),15)))","v":"0"}]
["Улица: ",{"$f":"UPPER((P20))","v":""},null,null,null,null,null,null,null,null,null,null,null,null,null,0,{"$f":"TEXT(SUM(MID(0&P35,LARGE(ISNUMBER(-MID(P35,ROW($1:$88),1))*ROW($1:$88),ROW($1:$15)+15)+1,1)*10^ROW($1:$15)/10),REPT(0,MIN(MAX(COUNT(1/(MID(P35,ROW($1:$88),1)+1))-15,),15)))&TEXT(SUM(MID(0&P35,LARGE(ISNUMBER(-MID(P35,ROW($1:$88),1))*ROW($1:$88),ROW($1:$15))+1,1)*10^ROW($1:$15)/10),REPT(0,MIN(COUNT(1/(MID(P35,ROW($1:$88),1)+1)),15)))","v":"0"}]
["Здание: ",{"$f":"P21","v":""},null,null,null,null,null,null,null,null,null,null,null,null,null,0,{"$f":"TEXT(SUM(MID(0&P36,LARGE(ISNUMBER(-MID(P36,ROW($1:$88),1))*ROW($1:$88),ROW($1:$15)+15)+1,1)*10^ROW($1:$15)/10),REPT(0,MIN(MAX(COUNT(1/(MID(P36,ROW($1:$88),1)+1))-15,),15)))&TEXT(SUM(MID(0&P36,LARGE(ISNUMBER(-MID(P36,ROW($1:$88),1))*ROW($1:$88),ROW($1:$15))+1,1)*10^ROW($1:$15)/10),REPT(0,MIN(COUNT(1/(MID(P36,ROW($1:$88),1)+1)),15)))","v":"0"}]
["Квартира: ",{"$f":"P22","v":""},null,null,null,null,null,null,null,null,null,null,null,null,null,0,{"$f":"TEXT(SUM(MID(0&P37,LARGE(ISNUMBER(-MID(P37,ROW($1:$88),1))*ROW($1:$88),ROW($1:$15)+15)+1,1)*10^ROW($1:$15)/10),REPT(0,MIN(MAX(COUNT(1/(MID(P37,ROW($1:$88),1)+1))-15,),15)))&TEXT(SUM(MID(0&P37,LARGE(ISNUMBER(-MID(P37,ROW($1:$88),1))*ROW($1:$88),ROW($1:$15))+1,1)*10^ROW($1:$15)/10),REPT(0,MIN(COUNT(1/(MID(P37,ROW($1:$88),1)+1)),15)))","v":"0"}]
["Телефон: ",{"$f":"B4","v":"8-702-673-12-82   0----   ----"},null,null,null,null,null,null,null,null,null,null,null,null,null,0,{"$f":"TEXT(SUM(MID(0&P38,LARGE(ISNUMBER(-MID(P38,ROW($1:$88),1))*ROW($1:$88),ROW($1:$15)+15)+1,1)*10^ROW($1:$15)/10),REPT(0,MIN(MAX(COUNT(1/(MID(P38,ROW($1:$88),1)+1))-15,),15)))&TEXT(SUM(MID(0&P38,LARGE(ISNUMBER(-MID(P38,ROW($1:$88),1))*ROW($1:$88),ROW($1:$15))+1,1)*10^ROW($1:$15)/10),REPT(0,MIN(COUNT(1/(MID(P38,ROW($1:$88),1)+1)),15)))","v":"0"}]
["Индекс: ",{"$f":"P16","v":""},null,null,null,null,null,null,null,null,null,null,null,null,null,null,{"$f":"IF(LEFT(#REF!,4)=\"ваша\",VALUE(MID(#REF!,13,20))*100,0)","v":{"$error":"#REF!"}}]
["Компания:",null,null,null,null,null,null,null,null,null,null,null,null,null,null,null,{"$f":"IF(LEFT(#REF!,4)=\"ваша\",VALUE(MID(#REF!,13,20))*100,0)","v":{"$error":"#REF!"}}]
["ИИН:",{"$f":"F29","v":29300},null,null,null,null,null,null,null,null,null,null,null,null,null,null,{"$f":"IF(LEFT(#REF!,4)=\"ваша\",VALUE(MID(#REF!,13,20))*100,0)","v":{"$error":"#REF!"}}]
["------------------------","----------------------------------------------------","----------------------------------------------------","------------------------","------------------------","---------------------------","------------------------------","------------------------","------------------------",null,null,null,null,null,null,null,{"$f":"SUM(Q19:Q41)","v":{"$error":"#REF!"}}]

{"sheet":"+KASPI+ 9635++0","index":8,"n_rows":42,"n_cols":21,"rows_kept":42,"cut":false,"hidden":false,"merged":[[27,6,27,8],[31,0,31,1],[37,1,37,2],[0,4,0,7],[1,4,1,8],[2,1,2,2],[3,1,3,2],[25,6,25,8],[26,6,26,8]]}
[{"$f":"IF(LEFT(C29,2)=\"сп\",P1&\" ► СП\",IF(E25=D26,P1,IF(H6<>0,P1&\"++\"&\"0\",IF(E25=D27,P1&\"++\"&\"0\",IF(E25=D28,P1&\"++\"&\"0\",IF(E25=D27,P1&\"++\"&\"0\",IF(E25=D28,P1&\"++\"&\"0\",IF(LEFT(C25,2)=\"AV\",P1&\"++\"&F29,P1))))))))","v":"+KASPI+ 9635++0"},{"$f":"L4","v":"2020-08-12T19:08:35"},{"$f":"IF(E2>0,\"ОТПРАВЛЕНО\",IF(LEFT(C29,3)=\"ЗАК\",\"ЗАКАЗАНО в СПБ\",IF(G24>=0,\"ОПЛОЧЕНО\",\"ОЖИДАНИЕ ОПЛАТЫ\")))","v":"ОТПРАВЛЕНО"},{"$f":"'СПИСОК ЗАКАЗОВ'!B1","v":21},"2020-08-13",null,null,null,{"$f":"A1","v":"+KASPI+ 9635++0"},null,"Заказ № 9635",null,null,null,null,{"$f":"IF(G24>0,\"+\"&H6&\"+\"&Q1,Q1)","v":"+KASPI+ 9635"},{"$f":"ПоискСКонца(K1,\"№\")","v":" 9635"}]
["Логин",{"$f":"L3","v":"sem.rtn08@megastroy.kz"},"Номер накл-ой",null,3611548,null,null,null,null,null,"Примечание"]
["ФИО",{"$f":"IF(C32=0,UPPER((P9)),UPPER(C33))","v":"АРЦИБАШЕВА АЛЛА ЛЕОНИДОВНА"},null,null,null,null,null,null,null,null,"Логин","sem.rtn08@megastroy.kz"]
["Телефон",{"$f":"R12","v":"8-778-929-83-33   ----   ----"},null,null,{"$f":"IF(F4>0.5,\"оплачено\",IF(F4<0,\"ОПЛАТИТЬ= \"&G4,\"ОПЛАТИТЬ= \"&Q25))","v":"ОПЛАТИТЬ= 1400"},0,1100,null,null,null,"Дата заказа","2020-08-12T19:08:35"]
["e-mail:",{"$f":"L11","v":"sem.rtn08@megastroy.kz"}]
["Вес","ПРИМЕЧАНИЯ","Наименование","Кол-во","Цена","Всего",{"$f":"IF(MAX(G7:G25)>0,MAX(G7:G25),\"\")","v":"2020-08-21"},{"$f":"IF(I7>0,\"НАЛ\",IF(I8>0,\"ПЕРЕВОД\",IF(I9>0,\"Beeline\",IF(I10>0,\"KASPI\",IF(I11>0,\"QIWI\",IF(I12>0,\"СЧЁТ Альфа-Банк\",0))))))","v":"KASPI"},{"$f":"SUM(I7:I28)","v":16000}]
[{"$f":"IF(L24>0,Q24*1/100,\"\")","v":""},null,null,null,null,{"$f":"IF(D7<>\"\",E7*D7,\"\")","v":""},{"$f":"IF(I7 >0,TODAY(),\"\")","v":""},"НАЛ",null,{"$f":"IFERROR(IFERROR(VLOOKUP(C7,#REF!,3,0)*D7,VLOOKUP(C7,#REF!,7,0)*D7),\"нет веса\")","v":"нет веса"},"Заказ №9635"]
[{"$f":"IF(L25>0,Q25*1/100,\"\")","v":""},"списано",{"$f":"IF(L27<>\"\",K27,\"\")","v":"Поисковый неодимовый магнит на 120кг. f120`42 (сила притяжения 120кг.)"},{"$f":"IF(L27>0,L27,\"\")","v":1},{"$f":"IF(M27=\"уточняйте\",0,IF(L27>0,M27,\"\"))","v":14600},14600,"","ПЕРЕВОД",null,{"$f":"IFERROR(IFERROR(VLOOKUP(C8,#REF!,3,0)*D8,VLOOKUP(C8,#REF!,7,0)*D8),\"нет веса\")","v":"нет веса"}]
[null,null,"","","","","","Beeline",null,{"$f":"IFERROR(IFERROR(VLOOKUP(C9,#REF!,3,0)*D9,VLOOKUP(C9,#REF!,7,0)*D9),\"нет веса\")","v":"нет веса"},"Здравствуйте, Арцибашева Алла Леонидовна",null,null,null,null,{"$f":"MID(K9,15,70)","v":"Арцибашева Алла Леонидовна"},{"$f":"TEXT(SUM(MID(0&L9,LARGE(ISNUMBER(-MID(L9,ROW($1:$96),1))*ROW($1:$96),ROW($1:$23)+15)+1,1)*10^ROW($1:$23)/10),REPT(0,MIN(MAX(COUNT(1/(MID(L9,ROW($1:$96),1)+1))-15,),15)))&TEXT(SUM(MID(0&L9,LARGE(ISNUMBER(-MID(L9,ROW($1:$96),1))*ROW($1:$96),ROW($1:$23))+1,1)*10^ROW($1:$23)/10),REPT(0,MIN(COUNT(1/(MID(L9,ROW($1:$96),1)+1)),15)))","v":""}]
[null,null,"","","","","2020-08-21","KASPI",{"$f":"F29","v":16000},{"$f":"IFERROR(IFERROR(VLOOKUP(C10,#REF!,3,0)*D10,VLOOKUP(C10,#REF!,7,0)*D10),\"нет веса\")","v":"нет веса"},"Мы получили Ваш заказ номер 9635"]
[null,null,"","","","","","QIWI",null,{"$f":"IFERROR(IFERROR(VLOOKUP(C11,#REF!,3,0)*D11,VLOOKUP(C11,#REF!,7,0)*D11),\"нет веса\")","v":"нет веса"},"Электронная почта","sem.rtn08@megastroy.kz"]
[{"$f":"IF(L29>0,Q29*1/100,\"\")","v":""},null,"","","","","","СЧЁТ Альфа-Банк",null,{"$f":"IFERROR(IFERROR(VLOOKUP(C12,#REF!,3,0)*D12,VLOOKUP(C12,#REF!,7,0)*D12),\"нет веса\")","v":"нет веса"},"Контактный телефон","87789298333",null,null,null,{"$f":"(L12&\"  \"&P13)","v":"87789298333  Предоплата банковской картой"},{"$f":"TEXT(SUM(MID(0&P12,LARGE(ISNUMBER(-MID(P12,ROW($1:$99),1))*ROW($1:$99),ROW($1:$15)+30)+1,1)*10^ROW($1:$15)/10),REPT(0,MIN(MAX(COUNT(1/(MID(P12,ROW($1:$99),1)+1))-30,),15)))&TEXT(SUM(MID(0&P12,LARGE(ISNUMBER(-MID(P12,ROW($1:$99),1))*ROW($1:$99),ROW($1:$15)+15)+1,1)*10^ROW($1:$15)/10),REPT(0,MIN(MAX(COUNT(1/(MID(P12,ROW($1:$99),1)+1))-15,),15)))&TEXT(SUM(MID(0&P12,LARGE(ISNUMBER(-MID(P12,ROW($1:$99),1))*ROW($1:$99),ROW($1:$15))+1,1)*10^ROW($1:$15)/10),REPT(0,MIN(COUNT(1/(MID(P12,ROW($1:$99),1)+1)),15)))","v":"87789298333"},{"$f":"(MID(Q12,1,1))&\"-\"&(MID(Q12,2,3))&\"-\"&(MID(Q12,5,3))&\"-\"&(MID(Q12,8,2))&\"-\"&(MID(Q12,10,2))&\"   \"&(MID(Q12,12,1))&\"-\"&(MID(Q12,13,3))&\"-\"&(MID(Q12,16,3))&\"-\"&(MID(Q12,19,2))&\"-\"&(MID(Q12,21,2))&\"   \"&(MID(Q12,23,1))&\"-\"&(MID(Q12,24,3))&\"-\"&(MID(Q12,27,3))&\"-\"&(MID(Q12,30,2))&\"-\"&(MID(Q12,32,2))","v":"8-778-929-83-33   ----   ----"}]
["",null,"","","","","",null,null,{"$f":"IFERROR(IFERROR(VLOOKUP(C13,#REF!,3,0)*D13,VLOOKUP(C13,#REF!,7,0)*D13),\"нет веса\")","v":"нет веса"},"Оплата:","Предоплата банковской картой",null,null,null,{"$f":"IF(L13=\"-\",IFERROR(НайтиСтрокуПоСлову(\"Комментарий\",K27:K60),0),L13)","v":"Предоплата банковской картой"}]
["",null,"","","","","",null,null,{"$f":"IFERROR(IFERROR(VLOOKUP(C14,#REF!,3,0)*D14,VLOOKUP(C14,#REF!,7,0)*D14),\"нет веса\")","v":"нет веса"},"Доставка:","EMS KAZPOST",null,null,null,{"$f":"MID(L14,23,70)","v":""}]
["",null,"","","","","",null,null,{"$f":"IFERROR(IFERROR(VLOOKUP(C15,#REF!,3,0)*D15,VLOOKUP(C15,#REF!,7,0)*D15),\"нет веса\")","v":"нет веса"},"Адрес доставки","Индекс:",null,null,null,{"$f":"IF(LEFT(P14,2)=\"EX\",MID(L15,11,70),L15)","v":"Индекс:"},{"$f":"TEXT(SUM(MID(0&P15,LARGE(ISNUMBER(-MID(P15,ROW($1:$88),1))*ROW($1:$88),ROW($1:$15)+15)+1,1)*10^ROW($1:$15)/10),REPT(0,MIN(MAX(COUNT(1/(MID(P15,ROW($1:$88),1)+1))-15,),15)))&TEXT(SUM(MID(0&P15,LARGE(ISNUMBER(-MID(P15,ROW($1:$88),1))*ROW($1:$88),ROW($1:$15))+1,1)*10^ROW($1:$15)/10),REPT(0,MIN(COUNT(1/(MID(P15,ROW($1:$88),1)+1)),15)))","v":""},{"$f":"SUMPRODUCT(--SUBSTITUTE(Q15:Q15,CHAR(160),))","v":{"$error":"#VALUE!"}},{"$f":"LEN(Q15)","v":0},{"$f":"FLOOR(S15/3,1)","v":0}]
["",null,"","","","","",null,null,{"$f":"IFERROR(IFERROR(VLOOKUP(C16,#REF!,3,0)*D16,VLOOKUP(C16,#REF!,7,0)*D16),\"нет веса\")","v":"нет веса"},null,"Страна:",null,null,null,{"$f":"MID(L16,9,70)","v":""}]
["",null,"","","","","",null,null,{"$f":"IFERROR(IFERROR(VLOOKUP(C17,#REF!,3,0)*D17,VLOOKUP(C17,#REF!,7,0)*D17),\"нет веса\")","v":"нет веса"},null,"Область:",null,null,null,{"$f":"MID(L17,9,70)","v":""},{"$f":"IF(LEFT(K17,4)=\"ваша\",VALUE(MID(K17,13,20))*100,0)","v":0}]
["",null,"","","","","",null,null,{"$f":"IFERROR(IFERROR(VLOOKUP(C18,#REF!,3,0)*D18,VLOOKUP(C18,#REF!,7,0)*D18),\"нет веса\")","v":"нет веса"},null,"Город:",null,null,null,{"$f":"MID(L18,10,70)","v":""}]
["",null,"","","","","",null,null,{"$f":"IFERROR(IFERROR(VLOOKUP(C19,#REF!,3,0)*D19,VLOOKUP(C19,#REF!,7,0)*D19),\"нет веса\")","v":"нет веса"},null,"Улица:",null,null,null,{"$f":"MID(L19,8,70)","v":""},{"$f":"IF(LEFT(K19,4)=\"ваша\",VALUE(MID(K19,13,20))*100,0)","v":0}]
["",null,"","","","","",null,null,{"$f":"IFERROR(IFERROR(VLOOKUP(C20,#REF!,3,0)*D20,VLOOKUP(C20,#REF!,7,0)*D20),\"нет веса\")","v":"нет веса"},null,"Здание:",null,null,null,{"$f":"MID(L20,8,70)","v":""},{"$f":"IF(LEFT(K31,4)=\"ваша\",VALUE(MID(K31,13,20))*100,0)","v":0}]
["",null,"","","","","",null,null,{"$f":"IFERROR(IFERROR(VLOOKUP(C21,#REF!,3,0)*D21,VLOOKUP(C21,#REF!,7,0)*D21),\"нет веса\")","v":"нет веса"},null,"Квартира:",null,null,null,{"$f":"MID(L21,9,70)","v":":"},{"$f":"IF(LEFT(K32,4)=\"ваша\",VALUE(MID(K32,13,20))*100,0)","v":0}]
["",null,"","","","","",null,null,{"$f":"IFERROR(IFERROR(VLOOKUP(C22,#REF!,3,0)*D22,VLOOKUP(C22,#REF!,7,0)*D22),\"нет веса\")","v":"нет веса"},"Комментарий: -",null,null,null,null,{"$f":"MID(L22,11,70)","v":""},{"$f":"IF(LEFT(#REF!,4)=\"ваша\",VALUE(MID(#REF!,13,20))*100,0)","v":{"$error":"#REF!"}}]
["",null,null,null,"Итого:",{"$f":"SUM(F7:F22)","v":14600},"",null,null,{"$f":"IF(K40>0,M40,\"\")","v":""},null,null,null,null,null,null,{"$f":"IF(LEFT(K33,4)=\"ваша\",VALUE(MID(K33,13,20))*100,0)","v":0}]
[{"$f":"IF(L41>0,N41,\"\")","v":""},null,null,"скидка:",{"$f":"IF(F23>150000,10,IF(F23>100000,8,IF(F23>60000,5,IF(F23>30000,3,0))))","v":0},{"$f":"F23-(F23*E24/100)","v":14600},{"$f":"IFERROR(SUM(I7:I22)-F29+1,0)","v":1},null,null,null,"ИНСТРУКЦИЯ ПО ОПЛАТЕ",null,null,null,null,{"$f":"N24","v":0},{"$f":"TEXT(SUM(MID(0&P24,LARGE(ISNUMBER(-MID(P24,ROW($1:$88),1))*ROW($1:$88),ROW($1:$15)+15)+1,1)*10^ROW($1:$15)/10),REPT(0,MIN(MAX(COUNT(1/(MID(P24,ROW($1:$88),1)+1))-15,),15)))&TEXT(SUM(MID(0&P24,LARGE(ISNUMBER(-MID(P24,ROW($1:$88),1))*ROW($1:$88),ROW($1:$15))+1,1)*10^ROW($1:$15)/10),REPT(0,MIN(COUNT(1/(MID(P24,ROW($1:$88),1)+1)),15)))","v":"0"}]
[{"$f":"SUM(A7:A23)/1000*1.3","v":0},null,{"$f":"IF(E25=F26,\"Доставка БЕСПЛАТНО\",IF(E25=D26,C26,IF(E25=D27,C27,IF(E25=D28,C28,IF(E25=F27,C27&\" + НПл\",IF(E25=F28,C28&\" + НПл\",\"Укажите ТК\"))))))","v":"AVIS Econom  Семей"},2,{"$f":"D27","v":1400},null,{"$f":"IF(I25 >0,TODAY(),\"\")","v":""},null,null,{"$f":"SUM(J7:J22)/1000","v":0},null,null,null,null,null,{"$f":"E25","v":1400},{"$f":"TEXT(SUM(MID(0&P25,LARGE(ISNUMBER(-MID(P25,ROW($1:$88),1))*ROW($1:$88),ROW($1:$15)+15)+1,1)*10^ROW($1:$15)/10),REPT(0,MIN(MAX(COUNT(1/(MID(P25,ROW($1:$88),1)+1))-15,),15)))&TEXT(SUM(MID(0&P25,LARGE(ISNUMBER(-MID(P25,ROW($1:$88),1))*ROW($1:$88),ROW($1:$15))+1,1)*10^ROW($1:$15)/10),REPT(0,MIN(COUNT(1/(MID(P25,ROW($1:$88),1)+1)),15)))","v":"1400"},{"$f":"E25","v":1400},{"$f":"TEXT(SUM(MID(0&R25,LARGE(ISNUMBER(-MID(R25,ROW($1:$88),1))*ROW($1:$88),ROW($1:$15)+15)+1,1)*10^ROW($1:$15)/10),REPT(0,MIN(MAX(COUNT(1/(MID(R25,ROW($1:$88),1)+1))-15,),15)))&TEXT(SUM(MID(0&R25,LARGE(ISNUMBER(-MID(R25,ROW($1:$88),1))*ROW($1:$88),ROW($1:$15))+1,1)*10^ROW($1:$15)/10),REPT(0,MIN(COUNT(1/(MID(R25,ROW($1:$88),1)+1)),15)))","v":"1400"},null,{"$f":"TEXT(SUM(MID(0&E25,LARGE(ISNUMBER(-MID(E25,ROW($1:$88),1))*ROW($1:$88),ROW($1:$15)+15)+1,1)*10^ROW($1:$15)/10),REPT(0,MIN(MAX(COUNT(1/(MID(E25,ROW($1:$88),1)+1))-15,),15)))&TEXT(SUM(MID(0&E25,LARGE(ISNUMBER(-MID(E25,ROW($1:$88),1))*ROW($1:$88),ROW($1:$15))+1,1)*10^ROW($1:$15)/10),REPT(0,MIN(COUNT(1/(MID(E25,ROW($1:$88),1)+1)),15)))","v":{"$error":"#NUM!"}}]
[null,null,{"$f":"IFERROR(\"AVIS С А М О В Ы В О З \"&\"  \"&VLOOKUP((LEFT(B34,(LEN(B34)))),'ТАРИФЫ ТК'!J17:L268,1,0),\"НЕТ ДОСТАВКИ\")","v":"AVIS С А М О В Ы В О З   Семей"},{"$f":"IFERROR(VLOOKUP((LEFT(B34,(LEN(B34)))),'ТАРИФЫ ТК'!J17:L268,3,0)+0.001,\"НЕТ ДОСТАВКИ\")","v":2100.0010000000002},{"$f":"IFERROR(F24+D26,\"НЕТ ДОСТАВКИ\")","v":16700.001},{"$f":"IFERROR(D26&\" + НПл\",\"НЕТ ДОСТАВКИ\")","v":"2100,001 + НПл"},{"$f":"IFERROR(CEILING((F24+D26)*(1+$D$25/100),50),0)","v":17050},null,null,null,"Наименование","Количество","Цена","Вес","Всего",{"$f":"N26","v":"Вес"},{"$f":"TEXT(SUM(MID(0&P26,LARGE(ISNUMBER(-MID(P26,ROW($1:$88),1))*ROW($1:$88),ROW($1:$15)+15)+1,1)*10^ROW($1:$15)/10),REPT(0,MIN(MAX(COUNT(1/(MID(P26,ROW($1:$88),1)+1))-15,),15)))&TEXT(SUM(MID(0&P26,LARGE(ISNUMBER(-MID(P26,ROW($1:$88),1))*ROW($1:$88),ROW($1:$15))+1,1)*10^ROW($1:$15)/10),REPT(0,MIN(COUNT(1/(MID(P26,ROW($1:$88),1)+1)),15)))","v":""}]
[null,null,{"$f":"IFERROR(\"AVIS Econom\"&\"  \"&VLOOKUP((LEFT(B34,(LEN(B34)))),'ТАРИФЫ ТК'!A4:A134,1,0),\"НЕТ ДОСТАВКИ\")","v":"AVIS Econom  Семей"},1400,{"$f":"IFERROR(F24+D27,\"НЕТ ДОСТАВКИ\")","v":16000},{"$f":"IFERROR(D27&\" + НПл\",\"НЕТ ДОСТАВКИ\")","v":"1400 + НПл"},{"$f":"IFERROR(CEILING((F24+D27)*(1+$D$25/100),50),0)","v":16350},null,null,null,"Поисковый неодимовый магнит на 120кг. f120`42 (сила притяжения 120кг.)",1,14600,"400 гр.",14600,"400 гр.",{"$f":"TEXT(SUM(MID(0&P27,LARGE(ISNUMBER(-MID(P27,ROW($1:$88),1))*ROW($1:$88),ROW($1:$15)+15)+1,1)*10^ROW($1:$15)/10),REPT(0,MIN(MAX(COUNT(1/(MID(P27,ROW($1:$88),1)+1))-15,),15)))&TEXT(SUM(MID(0&P27,LARGE(ISNUMBER(-MID(P27,ROW($1:$88),1))*ROW($1:$88),ROW($1:$15))+1,1)*10^ROW($1:$15)/10),REPT(0,MIN(COUNT(1/(MID(P27,ROW($1:$88),1)+1)),15)))","v":"400"}]
[null,null,{"$f":"IFERROR(IF(A29<1,\"AVIS EXPRESS\"&\"  \"&VLOOKUP((LEFT(B34,(LEN(B34)))),'ТАРИФЫ ТК'!E4:G20,1,0),\"AV ВИМАНИЕ:   В Е С    П О С Ы Л К И    Б О Л Ь Ш Е   0,5 КГ   !!!\"),\"НЕТ ДОСТАВКИ\")","v":"НЕТ ДОСТАВКИ"},{"$f":"IFERROR(VLOOKUP((LEFT(B34,(LEN(B34)))),'ТАРИФЫ ТК'!E4:G20,3,0),\"НЕТ ДОСТАВКИ\")","v":"НЕТ ДОСТАВКИ"},{"$f":"IFERROR(F24+D28,\"НЕТ ДОСТАВКИ\")","v":"НЕТ ДОСТАВКИ"},{"$f":"D28&\" + НПл\"","v":"НЕТ ДОСТАВКИ + НПл"},{"$f":"IFERROR(CEILING((F24+D28)*(1+$D$25/100),50),\"НЕТ ДОСТАВКИ\")","v":"НЕТ ДОСТАВКИ"},null,null,null,"Общий вес товаров: 400 гр.",null,null,null,null,0,{"$f":"TEXT(SUM(MID(0&P28,LARGE(ISNUMBER(-MID(P28,ROW($1:$88),1))*ROW($1:$88),ROW($1:$15)+15)+1,1)*10^ROW($1:$15)/10),REPT(0,MIN(MAX(COUNT(1/(MID(P28,ROW($1:$88),1)+1))-15,),15)))&TEXT(SUM(MID(0&P28,LARGE(ISNUMBER(-MID(P28,ROW($1:$88),1))*ROW($1:$88),ROW($1:$15))+1,1)*10^ROW($1:$15)/10),REPT(0,MIN(COUNT(1/(MID(P28,ROW($1:$88),1)+1)),15)))","v":"0"}]
[{"$f":"IFERROR(A25*1.5,\"Количество ??\")","v":0},null,null,"К ОПЛАТЕ:",{"$f":"IFERROR(F24+E25,0)","v":16000},{"$f":"IF(E25=C29,\"Доставка БЕСПЛАТНО\",IF(E25=D26,E26,IF(E25=D27,E27,IF(E25=D28,E28,IF(E25=F27,G27,IF(E25=F28,G28,IF(E25=F26,G26,\"Укажите ТК\")))))))","v":16000},{"$f":"IFERROR(CEILING((F24+E25)*1.03,50),0)","v":16500},null,null,{"$f":"IFERROR(J25*1.5,\"Количество ??\")","v":0},"Доставка: 1650 тг.",null,null,null,null,0,{"$f":"TEXT(SUM(MID(0&P29,LARGE(ISNUMBER(-MID(P29,ROW($1:$88),1))*ROW($1:$88),ROW($1:$15)+15)+1,1)*10^ROW($1:$15)/10),REPT(0,MIN(MAX(COUNT(1/(MID(P29,ROW($1:$88),1)+1))-15,),15)))&TEXT(SUM(MID(0&P29,LARGE(ISNUMBER(-MID(P29,ROW($1:$88),1))*ROW($1:$88),ROW($1:$15))+1,1)*10^ROW($1:$15)/10),REPT(0,MIN(COUNT(1/(MID(P29,ROW($1:$88),1)+1)),15)))","v":"0"}]
["rc11091kz",null,{"$f":"IFERROR((P14&\"        \"&LEFT(P15,8)&\" = \"&TEXT(R15,\"### ### ###\")&\" т.\"),\"НЕТ ДОСТАВКИ\")","v":"НЕТ ДОСТАВКИ"},null,{"$f":"IFERROR(\"QIWI = \"&CEILING((E26*1.02),10),0)","v":"QIWI = 17040"},{"$f":"IFERROR(F29-F24,\"УКАЖИТЕ ТК\")","v":1400},null,null,null,null,"Итого: 16250 тг.",null,null,null,null,0,{"$f":"TEXT(SUM(MID(0&P30,LARGE(ISNUMBER(-MID(P30,ROW($1:$88),1))*ROW($1:$88),ROW($1:$15)+15)+1,1)*10^ROW($1:$15)/10),REPT(0,MIN(MAX(COUNT(1/(MID(P30,ROW($1:$88),1)+1))-15,),15)))&TEXT(SUM(MID(0&P30,LARGE(ISNUMBER(-MID(P30,ROW($1:$88),1))*ROW($1:$88),ROW($1:$15))+1,1)*10^ROW($1:$15)/10),REPT(0,MIN(COUNT(1/(MID(P30,ROW($1:$88),1)+1)),15)))","v":"0"}]
[{"$f":"A1","v":"+KASPI+ 9635++0"},"ПОЛУЧАТЕЛЬ:","rc11091kz",null,null,null,null,null,null,null,null,null,null,null,null,0,{"$f":"TEXT(SUM(MID(0&P31,LARGE(ISNUMBER(-MID(P31,ROW($1:$88),1))*ROW($1:$88),ROW($1:$15)+15)+1,1)*10^ROW($1:$15)/10),REPT(0,MIN(MAX(COUNT(1/(MID(P31,ROW($1:$88),1)+1))-15,),15)))&TEXT(SUM(MID(0&P31,LARGE(ISNUMBER(-MID(P31,ROW($1:$88),1))*ROW($1:$88),ROW($1:$15))+1,1)*10^ROW($1:$15)/10),REPT(0,MIN(COUNT(1/(MID(P31,ROW($1:$88),1)+1)),15)))","v":"0"}]
[{"$f":"UPPER((B3))","v":"АРЦИБАШЕВА АЛЛА ЛЕОНИДОВНА"},null,{"$f":"IFERROR(MID(НайтиСтрокуПоСлову(\"Комментарий: Имя :\",K1:K45),20,99),0)","v":0},null,null,null,null,null,null,null,null,null,null,null,null,0,{"$f":"TEXT(SUM(MID(0&P32,LARGE(ISNUMBER(-MID(P32,ROW($1:$88),1))*ROW($1:$88),ROW($1:$15)+15)+1,1)*10^ROW($1:$15)/10),REPT(0,MIN(MAX(COUNT(1/(MID(P32,ROW($1:$88),1)+1))-15,),15)))&TEXT(SUM(MID(0&P32,LARGE(ISNUMBER(-MID(P32,ROW($1:$88),1))*ROW($1:$88),ROW($1:$15))+1,1)*10^ROW($1:$15)/10),REPT(0,MIN(COUNT(1/(MID(P32,ROW($1:$88),1)+1)),15)))","v":"0"}]
["Область: ",{"$f":"UPPER((P18))","v":""},{"$f":"IFERROR(ПоискСНачала(C32,\"Телефон\"),0)","v":0},null,{"$f":"IFERROR(ПоискМежду(C32,\"Телефон :\",\"Примечание\"),0)","v":0},{"$f":"IFERROR(IF(LEFT(ПоискСКонца(C32,\"Примечание : \"),2)=\"г \",MID(ПоискСКонца(C32,\"Примечание : \"),3,99),IF(LEFT(ПоискСКонца(C32,\"Примечание : \"),3)=\"г. \",MID(ПоискСКонца(C32,\"Примечание : \"),4,99),IF(LEFT(ПоискСКонца(C32,\"Примечание : \"),3)=\"гор\",MID(ПоискСКонца(C32,\"Примечание : \"),6,99),0))),0)","v":0},null,null,null,null,"EMS KAZPOST - Предоплата банковской картой",null,null,null,null,0,{"$f":"TEXT(SUM(MID(0&P33,LARGE(ISNUMBER(-MID(P33,ROW($1:$88),1))*ROW($1:$88),ROW($1:$15)+15)+1,1)*10^ROW($1:$15)/10),REPT(0,MIN(MAX(COUNT(1/(MID(P33,ROW($1:$88),1)+1))-15,),15)))&TEXT(SUM(MID(0&P33,LARGE(ISNUMBER(-MID(P33,ROW($1:$88),1))*ROW($1:$88),ROW($1:$15))+1,1)*10^ROW($1:$15)/10),REPT(0,MIN(COUNT(1/(MID(P33,ROW($1:$88),1)+1)),15)))","v":"0"}]
["Город: ","Семей",null,null,null,null,null,null,null,null,"Назад",null,null,null,null,0,{"$f":"TEXT(SUM(MID(0&P34,LARGE(ISNUMBER(-MID(P34,ROW($1:$88),1))*ROW($1:$88),ROW($1:$15)+15)+1,1)*10^ROW($1:$15)/10),REPT(0,MIN(MAX(COUNT(1/(MID(P34,ROW($1:$88),1)+1))-15,),15)))&TEXT(SUM(MID(0&P34,LARGE(ISNUMBER(-MID(P34,ROW($1:$88),1))*ROW($1:$88),ROW($1:$15))+1,1)*10^ROW($1:$15)/10),REPT(0,MIN(COUNT(1/(MID(P34,ROW($1:$88),1)+1)),15)))","v":"0"}]
["Улица: ","Пархоменко",null,null,null,null,null,null,null,null,null,null,null,null,null,0,{"$f":"TEXT(SUM(MID(0&P35,LARGE(ISNUMBER(-MID(P35,ROW($1:$88),1))*ROW($1:$88),ROW($1:$15)+15)+1,1)*10^ROW($1:$15)/10),REPT(0,MIN(MAX(COUNT(1/(MID(P35,ROW($1:$88),1)+1))-15,),15)))&TEXT(SUM(MID(0&P35,LARGE(ISNUMBER(-MID(P35,ROW($1:$88),1))*ROW($1:$88),ROW($1:$15))+1,1)*10^ROW($1:$15)/10),REPT(0,MIN(COUNT(1/(MID(P35,ROW($1:$88),1)+1)),15)))","v":"0"}]
["Здание: ",132,null,null,null,null,null,null,null,null,null,null,null,null,null,0,{"$f":"TEXT(SUM(MID(0&P36,LARGE(ISNUMBER(-MID(P36,ROW($1:$88),1))*ROW($1:$88),ROW($1:$15)+15)+1,1)*10^ROW($1:$15)/10),REPT(0,MIN(MAX(COUNT(1/(MID(P36,ROW($1:$88),1)+1))-15,),15)))&TEXT(SUM(MID(0&P36,LARGE(ISNUMBER(-MID(P36,ROW($1:$88),1))*ROW($1:$88),ROW($1:$15))+1,1)*10^ROW($1:$15)/10),REPT(0,MIN(COUNT(1/(MID(P36,ROW($1:$88),1)+1)),15)))","v":"0"}]
["Квартира: ",{"$f":"P22","v":""},null,null,null,null,null,null,null,null,null,null,null,null,null,0,{"$f":"TEXT(SUM(MID(0&P37,LARGE(ISNUMBER(-MID(P37,ROW($1:$88),1))*ROW($1:$88),ROW($1:$15)+15)+1,1)*10^ROW($1:$15)/10),REPT(0,MIN(MAX(COUNT(1/(MID(P37,ROW($1:$88),1)+1))-15,),15)))&TEXT(SUM(MID(0&P37,LARGE(ISNUMBER(-MID(P37,ROW($1:$88),1))*ROW($1:$88),ROW($1:$15))+1,1)*10^ROW($1:$15)/10),REPT(0,MIN(COUNT(1/(MID(P37,ROW($1:$88),1)+1)),15)))","v":"0"}]
["Телефон: ",{"$f":"B4","v":"8-778-929-83-33   ----   ----"},null,null,null,null,null,null,null,null,null,null,null,null,null,0,{"$f":"TEXT(SUM(MID(0&P38,LARGE(ISNUMBER(-MID(P38,ROW($1:$88),1))*ROW($1:$88),ROW($1:$15)+15)+1,1)*10^ROW($1:$15)/10),REPT(0,MIN(MAX(COUNT(1/(MID(P38,ROW($1:$88),1)+1))-15,),15)))&TEXT(SUM(MID(0&P38,LARGE(ISNUMBER(-MID(P38,ROW($1:$88),1))*ROW($1:$88),ROW($1:$15))+1,1)*10^ROW($1:$15)/10),REPT(0,MIN(COUNT(1/(MID(P38,ROW($1:$88),1)+1)),15)))","v":"0"}]
["Индекс: ",{"$f":"P16","v":""},null,null,null,null,null,null,null,null,null,null,null,null,null,null,{"$f":"IF(LEFT(#REF!,4)=\"ваша\",VALUE(MID(#REF!,13,20))*100,0)","v":{"$error":"#REF!"}}]
["Компания:",null,null,null,null,null,null,null,null,null,null,null,null,null,null,null,{"$f":"IF(LEFT(#REF!,4)=\"ваша\",VALUE(MID(#REF!,13,20))*100,0)","v":{"$error":"#REF!"}}]
["ИИН:",{"$f":"F29","v":16000},null,null,null,null,null,null,null,null,null,null,null,null,null,null,{"$f":"IF(LEFT(#REF!,4)=\"ваша\",VALUE(MID(#REF!,13,20))*100,0)","v":{"$error":"#REF!"}}]
["------------------------","----------------------------------------------------","----------------------------------------------------","------------------------","------------------------","---------------------------","------------------------------","------------------------","------------------------",null,null,null,null,null,null,null,{"$f":"SUM(Q19:Q41)","v":{"$error":"#REF!"}}]

{"sheet":"+KASPI+120820++0","index":9,"n_rows":42,"n_cols":21,"rows_kept":42,"cut":false,"hidden":false,"merged":[[27,6,27,8],[31,0,31,1],[37,1,37,2],[0,4,0,7],[1,4,1,8],[2,1,2,2],[3,1,3,2],[25,6,25,8],[26,6,26,8]]}
[{"$f":"IF(LEFT(C29,2)=\"сп\",P1&\" ► СП\",IF(E25=D26,P1,IF(H6<>0,P1&\"++\"&\"0\",IF(E25=D27,P1&\"++\"&\"0\",IF(E25=D28,P1&\"++\"&\"0\",IF(E25=D27,P1&\"++\"&\"0\",IF(E25=D28,P1&\"++\"&\"0\",IF(LEFT(C25,2)=\"AV\",P1&\"++\"&F29,P1))))))))","v":"+KASPI+120820++0"},"2020-08-12",{"$f":"IF(E2>0,\"ОТПРАВЛЕНО\",IF(LEFT(C29,3)=\"ЗАК\",\"ЗАКАЗАНО в СПБ\",IF(G24>=0,\"ОПЛОЧЕНО\",\"ОЖИДАНИЕ ОПЛАТЫ\")))","v":"ОТПРАВЛЕНО"},{"$f":"'СПИСОК ЗАКАЗОВ'!B1","v":21},"2020-08-13",null,null,null,{"$f":"A1","v":"+KASPI+120820++0"},null,120820,null,null,null,null,{"$f":"IF(G24>0,\"+\"&H6&\"+\"&Q1,Q1)","v":"+KASPI+120820"},{"$f":"ПоискСКонца(K1,\"№\")","v":"120820"}]
["Логин",{"$f":"L3","v":"Логин"},"Номер накл-ой",null,3611549,null,null,null,null,null,"Примечание"]
["ФИО",{"$f":"IF(C32=0,UPPER((P9)),UPPER(C33))","v":"ЁЛКИН АЛЕКСАНДР"},null,null,null,null,null,null,null,null,"Логин","Логин"]
["Телефон",{"$f":"R12","v":"8-701-072-23-33   0----   ----"},null,null,{"$f":"IF(F4>0.5,\"оплачено\",IF(F4<0,\"ОПЛАТИТЬ= \"&G4,\"ОПЛАТИТЬ= \"&Q25))","v":"ОПЛАТИТЬ= 1400"},0,1100,null,null,null,"Дата заказа","дата заказа"]
["e-mail:",{"$f":"L11","v":"мыло"}]
["Вес","ПРИМЕЧАНИЯ","Наименование","Кол-во","Цена","Всего",{"$f":"IF(MAX(G7:G25)>0,MAX(G7:G25),\"\")","v":"2020-08-21"},{"$f":"IF(I7>0,\"НАЛ\",IF(I8>0,\"ПЕРЕВОД\",IF(I9>0,\"Beeline\",IF(I10>0,\"KASPI\",IF(I11>0,\"QIWI\",IF(I12>0,\"СЧЁТ Альфа-Банк\",0))))))","v":"KASPI"},{"$f":"SUM(I7:I28)","v":16000}]
[{"$f":"IF(L24>0,Q24*1/100,\"\")","v":""},"списано","Неодимовый магнит D60x30mm(Аксиал)`42 (сила притяжения 160 кг)",1,14600,{"$f":"IF(D7<>\"\",E7*D7,\"\")","v":14600},{"$f":"IF(I7 >0,TODAY(),\"\")","v":""},"НАЛ",null,{"$f":"IFERROR(IFERROR(VLOOKUP(C7,#REF!,3,0)*D7,VLOOKUP(C7,#REF!,7,0)*D7),\"нет веса\")","v":"нет веса"},"Заказ №2080"]
[{"$f":"IF(L25>0,Q25*1/100,\"\")","v":""},null,null,null,null,"","","ПЕРЕВОД",null,{"$f":"IFERROR(IFERROR(VLOOKUP(C8,#REF!,3,0)*D8,VLOOKUP(C8,#REF!,7,0)*D8),\"нет веса\")","v":"нет веса"}]
[{"$f":"IF(L26>0,Q26*1/100,\"\")","v":""},null,null,null,null,"","","Beeline",null,{"$f":"IFERROR(IFERROR(VLOOKUP(C9,#REF!,3,0)*D9,VLOOKUP(C9,#REF!,7,0)*D9),\"нет веса\")","v":"нет веса"},"Здравствуйте, Ёлкин Александр",null,null,null,null,{"$f":"MID(K9,15,70)","v":"Ёлкин Александр"},{"$f":"TEXT(SUM(MID(0&L9,LARGE(ISNUMBER(-MID(L9,ROW($1:$96),1))*ROW($1:$96),ROW($1:$23)+15)+1,1)*10^ROW($1:$23)/10),REPT(0,MIN(MAX(COUNT(1/(MID(L9,ROW($1:$96),1)+1))-15,),15)))&TEXT(SUM(MID(0&L9,LARGE(ISNUMBER(-MID(L9,ROW($1:$96),1))*ROW($1:$96),ROW($1:$23))+1,1)*10^ROW($1:$23)/10),REPT(0,MIN(COUNT(1/(MID(L9,ROW($1:$96),1)+1)),15)))","v":""}]
["",null,null,null,null,"","2020-08-21","KASPI",{"$f":"F29","v":16000},{"$f":"IFERROR(IFERROR(VLOOKUP(C10,#REF!,3,0)*D10,VLOOKUP(C10,#REF!,7,0)*D10),\"нет веса\")","v":"нет веса"},"Мы получили Ваш заказ номер, 2080"]
["",null,null,null,null,"","","QIWI",null,{"$f":"IFERROR(IFERROR(VLOOKUP(C11,#REF!,3,0)*D11,VLOOKUP(C11,#REF!,7,0)*D11),\"нет веса\")","v":"нет веса"},"Электронная почта","мыло"]
["",null,null,null,null,"","","СЧЁТ Альфа-Банк",null,{"$f":"IFERROR(IFERROR(VLOOKUP(C12,#REF!,3,0)*D12,VLOOKUP(C12,#REF!,7,0)*D12),\"нет веса\")","v":"нет веса"},"Контактный телефон","8701 07 22 333",null,null,null,{"$f":"(L12&\"  \"&P13)","v":"8701 07 22 333  0"},{"$f":"TEXT(SUM(MID(0&P12,LARGE(ISNUMBER(-MID(P12,ROW($1:$99),1))*ROW($1:$99),ROW($1:$15)+30)+1,1)*10^ROW($1:$15)/10),REPT(0,MIN(MAX(COUNT(1/(MID(P12,ROW($1:$99),1)+1))-30,),15)))&TEXT(SUM(MID(0&P12,LARGE(ISNUMBER(-MID(P12,ROW($1:$99),1))*ROW($1:$99),ROW($1:$15)+15)+1,1)*10^ROW($1:$15)/10),REPT(0,MIN(MAX(COUNT(1/(MID(P12,ROW($1:$99),1)+1))-15,),15)))&TEXT(SUM(MID(0&P12,LARGE(ISNUMBER(-MID(P12,ROW($1:$99),1))*ROW($1:$99),ROW($1:$15))+1,1)*10^ROW($1:$15)/10),REPT(0,MIN(COUNT(1/(MID(P12,ROW($1:$99),1)+1)),15)))","v":"870107223330"},{"$f":"(MID(Q12,1,1))&\"-\"&(MID(Q12,2,3))&\"-\"&(MID(Q12,5,3))&\"-\"&(MID(Q12,8,2))&\"-\"&(MID(Q12,10,2))&\"   \"&(MID(Q12,12,1))&\"-\"&(MID(Q12,13,3))&\"-\"&(MID(Q12,16,3))&\"-\"&(MID(Q12,19,2))&\"-\"&(MID(Q12,21,2))&\"   \"&(MID(Q12,23,1))&\"-\"&(MID(Q12,24,3))&\"-\"&(MID(Q12,27,3))&\"-\"&(MID(Q12,30,2))&\"-\"&(MID(Q12,32,2))","v":"8-701-072-23-33   0----   ----"}]
["",null,null,null,null,"","",null,null,{"$f":"IFERROR(IFERROR(VLOOKUP(C13,#REF!,3,0)*D13,VLOOKUP(C13,#REF!,7,0)*D13),\"нет веса\")","v":"нет веса"},null,null,null,null,null,{"$f":"IF(L13=\"-\",IFERROR(НайтиСтрокуПоСлову(\"Комментарий\",K27:K60),0),L13)","v":0}]
["",null,null,null,null,"","",null,null,{"$f":"IFERROR(IFERROR(VLOOKUP(C14,#REF!,3,0)*D14,VLOOKUP(C14,#REF!,7,0)*D14),\"нет веса\")","v":"нет веса"},"Доставка:",null,null,null,null,{"$f":"MID(L14,23,70)","v":""}]
["",null,{"$f":"IF(L34<>\"\",K34,\"\")","v":""},{"$f":"IF(L34>0,L34,\"\")","v":""},{"$f":"IF(M34=\"уточняйте\",0,IF(L34>0,M34,\"\"))","v":""},"","",null,null,{"$f":"IFERROR(IFERROR(VLOOKUP(C15,#REF!,3,0)*D15,VLOOKUP(C15,#REF!,7,0)*D15),\"нет веса\")","v":"нет веса"},"Оплата:",null,null,null,null,{"$f":"IF(LEFT(P14,2)=\"EX\",MID(L15,11,70),L15)","v":0},{"$f":"TEXT(SUM(MID(0&P15,LARGE(ISNUMBER(-MID(P15,ROW($1:$88),1))*ROW($1:$88),ROW($1:$15)+15)+1,1)*10^ROW($1:$15)/10),REPT(0,MIN(MAX(COUNT(1/(MID(P15,ROW($1:$88),1)+1))-15,),15)))&TEXT(SUM(MID(0&P15,LARGE(ISNUMBER(-MID(P15,ROW($1:$88),1))*ROW($1:$88),ROW($1:$15))+1,1)*10^ROW($1:$15)/10),REPT(0,MIN(COUNT(1/(MID(P15,ROW($1:$88),1)+1)),15)))","v":"0"},{"$f":"SUMPRODUCT(--SUBSTITUTE(Q15:Q15,CHAR(160),))","v":0},{"$f":"LEN(Q15)","v":1},{"$f":"FLOOR(S15/3,1)","v":0}]
["",null,"","","","","",null,null,{"$f":"IFERROR(IFERROR(VLOOKUP(C16,#REF!,3,0)*D16,VLOOKUP(C16,#REF!,7,0)*D16),\"нет веса\")","v":"нет веса"},"Адрес доставки","Индекс: ",null,null,null,{"$f":"MID(L16,9,70)","v":""}]
["",null,"","","","","",null,null,{"$f":"IFERROR(IFERROR(VLOOKUP(C17,#REF!,3,0)*D17,VLOOKUP(C17,#REF!,7,0)*D17),\"нет веса\")","v":"нет веса"},null,"Страна: ",null,null,null,{"$f":"MID(L17,9,70)","v":""},{"$f":"IF(LEFT(K17,4)=\"ваша\",VALUE(MID(K17,13,20))*100,0)","v":0}]
["",null,"","","","","",null,null,{"$f":"IFERROR(IFERROR(VLOOKUP(C18,#REF!,3,0)*D18,VLOOKUP(C18,#REF!,7,0)*D18),\"нет веса\")","v":"нет веса"},null,"Область: ",null,null,null,{"$f":"MID(L18,10,70)","v":""}]
["",null,"","","","","",null,null,{"$f":"IFERROR(IFERROR(VLOOKUP(C19,#REF!,3,0)*D19,VLOOKUP(C19,#REF!,7,0)*D19),\"нет веса\")","v":"нет веса"},null,"Город: ",null,null,null,{"$f":"MID(L19,8,70)","v":""},{"$f":"IF(LEFT(K19,4)=\"ваша\",VALUE(MID(K19,13,20))*100,0)","v":0}]
["",null,"","","","","",null,null,{"$f":"IFERROR(IFERROR(VLOOKUP(C20,#REF!,3,0)*D20,VLOOKUP(C20,#REF!,7,0)*D20),\"нет веса\")","v":"нет веса"},null,"Улица: ",null,null,null,{"$f":"MID(L20,8,70)","v":""},{"$f":"IF(LEFT(K31,4)=\"ваша\",VALUE(MID(K31,13,20))*100,0)","v":0}]
["",null,"","","","","",null,null,{"$f":"IFERROR(IFERROR(VLOOKUP(C21,#REF!,3,0)*D21,VLOOKUP(C21,#REF!,7,0)*D21),\"нет веса\")","v":"нет веса"},null,"Здание: ",null,null,null,{"$f":"MID(L21,9,70)","v":""},{"$f":"IF(LEFT(K32,4)=\"ваша\",VALUE(MID(K32,13,20))*100,0)","v":0}]
["",null,"","","","","",null,null,{"$f":"IFERROR(IFERROR(VLOOKUP(C22,#REF!,3,0)*D22,VLOOKUP(C22,#REF!,7,0)*D22),\"нет веса\")","v":"нет веса"},null,"Квартира: ",null,null,null,{"$f":"MID(L22,11,70)","v":""},{"$f":"IF(LEFT(#REF!,4)=\"ваша\",VALUE(MID(#REF!,13,20))*100,0)","v":{"$error":"#REF!"}}]
["",null,null,null,"Итого:",{"$f":"SUM(F7:F22)","v":14600},"",null,null,{"$f":"IF(K40>0,M40,\"\")","v":""},"Наименование","Количество","Цена","Вес","Всего",null,{"$f":"IF(LEFT(K33,4)=\"ваша\",VALUE(MID(K33,13,20))*100,0)","v":0}]
[{"$f":"IF(L41>0,N41,\"\")","v":""},null,null,"скидка:",null,{"$f":"F23-(F23*E24/100)","v":14600},{"$f":"IFERROR(SUM(I7:I22)-F29+1,0)","v":1},null,null,null,null,null,null,null,null,{"$f":"N24","v":0},{"$f":"TEXT(SUM(MID(0&P24,LARGE(ISNUMBER(-MID(P24,ROW($1:$88),1))*ROW($1:$88),ROW($1:$15)+15)+1,1)*10^ROW($1:$15)/10),REPT(0,MIN(MAX(COUNT(1/(MID(P24,ROW($1:$88),1)+1))-15,),15)))&TEXT(SUM(MID(0&P24,LARGE(ISNUMBER(-MID(P24,ROW($1:$88),1))*ROW($1:$88),ROW($1:$15))+1,1)*10^ROW($1:$15)/10),REPT(0,MIN(COUNT(1/(MID(P24,ROW($1:$88),1)+1)),15)))","v":"0"}]
[{"$f":"SUM(A7:A23)/1000*1.3","v":0},null,{"$f":"IF(E25=F26,\"Доставка БЕСПЛАТНО\",IF(E25=D26,C26,IF(E25=D27,C27,IF(E25=D28,C28,IF(E25=F27,C27&\" + НПл\",IF(E25=F28,C28&\" + НПл\",\"Укажите ТК\"))))))","v":"AVIS EXPRESS  Алматы"},2,{"$f":"D28","v":1400},null,{"$f":"IF(I25 >0,TODAY(),\"\")","v":""},null,null,{"$f":"SUM(J7:J22)/1000","v":0},null,null,null,null,null,{"$f":"E25","v":1400},{"$f":"TEXT(SUM(MID(0&P25,LARGE(ISNUMBER(-MID(P25,ROW($1:$88),1))*ROW($1:$88),ROW($1:$15)+15)+1,1)*10^ROW($1:$15)/10),REPT(0,MIN(MAX(COUNT(1/(MID(P25,ROW($1:$88),1)+1))-15,),15)))&TEXT(SUM(MID(0&P25,LARGE(ISNUMBER(-MID(P25,ROW($1:$88),1))*ROW($1:$88),ROW($1:$15))+1,1)*10^ROW($1:$15)/10),REPT(0,MIN(COUNT(1/(MID(P25,ROW($1:$88),1)+1)),15)))","v":"1400"},{"$f":"E25","v":1400},{"$f":"TEXT(SUM(MID(0&R25,LARGE(ISNUMBER(-MID(R25,ROW($1:$88),1))*ROW($1:$88),ROW($1:$15)+15)+1,1)*10^ROW($1:$15)/10),REPT(0,MIN(MAX(COUNT(1/(MID(R25,ROW($1:$88),1)+1))-15,),15)))&TEXT(SUM(MID(0&R25,LARGE(ISNUMBER(-MID(R25,ROW($1:$88),1))*ROW($1:$88),ROW($1:$15))+1,1)*10^ROW($1:$15)/10),REPT(0,MIN(COUNT(1/(MID(R25,ROW($1:$88),1)+1)),15)))","v":"1400"},null,{"$f":"TEXT(SUM(MID(0&E25,LARGE(ISNUMBER(-MID(E25,ROW($1:$88),1))*ROW($1:$88),ROW($1:$15)+15)+1,1)*10^ROW($1:$15)/10),REPT(0,MIN(MAX(COUNT(1/(MID(E25,ROW($1:$88),1)+1))-15,),15)))&TEXT(SUM(MID(0&E25,LARGE(ISNUMBER(-MID(E25,ROW($1:$88),1))*ROW($1:$88),ROW($1:$15))+1,1)*10^ROW($1:$15)/10),REPT(0,MIN(COUNT(1/(MID(E25,ROW($1:$88),1)+1)),15)))","v":{"$error":"#NUM!"}}]
[null,null,{"$f":"IFERROR(\"AVIS С А М О В Ы В О З \"&\"  \"&VLOOKUP((LEFT(B34,(LEN(B34)))),'ТАРИФЫ ТК'!J17:L268,1,0),\"НЕТ ДОСТАВКИ\")","v":"AVIS С А М О В Ы В О З   Алматы"},{"$f":"IFERROR(VLOOKUP((LEFT(B34,(LEN(B34)))),'ТАРИФЫ ТК'!J17:L268,3,0)+0.001,\"НЕТ ДОСТАВКИ\")","v":1550.001},{"$f":"IFERROR(F24+D26,\"НЕТ ДОСТАВКИ\")","v":16150.001},{"$f":"IFERROR(D26&\" + НПл\",\"НЕТ ДОСТАВКИ\")","v":"1550,001 + НПл"},{"$f":"IFERROR(CEILING((F24+D26)*(1+$D$25/100),50),0)","v":16500},null,null,null,null,null,null,null,null,{"$f":"N26","v":0},{"$f":"TEXT(SUM(MID(0&P26,LARGE(ISNUMBER(-MID(P26,ROW($1:$88),1))*ROW($1:$88),ROW($1:$15)+15)+1,1)*10^ROW($1:$15)/10),REPT(0,MIN(MAX(COUNT(1/(MID(P26,ROW($1:$88),1)+1))-15,),15)))&TEXT(SUM(MID(0&P26,LARGE(ISNUMBER(-MID(P26,ROW($1:$88),1))*ROW($1:$88),ROW($1:$15))+1,1)*10^ROW($1:$15)/10),REPT(0,MIN(COUNT(1/(MID(P26,ROW($1:$88),1)+1)),15)))","v":"0"}]
[null,null,{"$f":"IFERROR(\"AVIS Econom\"&\"  \"&VLOOKUP((LEFT(B34,(LEN(B34)))),'ТАРИФЫ ТК'!A4:A134,1,0),\"НЕТ ДОСТАВКИ\")","v":"AVIS Econom  Алматы"},1300,{"$f":"IFERROR(F24+D27,\"НЕТ ДОСТАВКИ\")","v":15900},{"$f":"IFERROR(D27&\" + НПл\",\"НЕТ ДОСТАВКИ\")","v":"1300 + НПл"},{"$f":"IFERROR(CEILING((F24+D27)*(1+$D$25/100),50),0)","v":16250},null,null,null,null,null,null,null,null,0,{"$f":"TEXT(SUM(MID(0&P27,LARGE(ISNUMBER(-MID(P27,ROW($1:$88),1))*ROW($1:$88),ROW($1:$15)+15)+1,1)*10^ROW($1:$15)/10),REPT(0,MIN(MAX(COUNT(1/(MID(P27,ROW($1:$88),1)+1))-15,),15)))&TEXT(SUM(MID(0&P27,LARGE(ISNUMBER(-MID(P27,ROW($1:$88),1))*ROW($1:$88),ROW($1:$15))+1,1)*10^ROW($1:$15)/10),REPT(0,MIN(COUNT(1/(MID(P27,ROW($1:$88),1)+1)),15)))","v":"0"}]
[null,null,{"$f":"IFERROR(IF(A29<1,\"AVIS EXPRESS\"&\"  \"&VLOOKUP((LEFT(B34,(LEN(B34)))),'ТАРИФЫ ТК'!E4:G20,1,0),\"AV ВИМАНИЕ:   В Е С    П О С Ы Л К И    Б О Л Ь Ш Е   0,5 КГ   !!!\"),\"НЕТ ДОСТАВКИ\")","v":"AVIS EXPRESS  Алматы"},1400,{"$f":"IFERROR(F24+D28,\"НЕТ ДОСТАВКИ\")","v":16000},{"$f":"D28&\" + НПл\"","v":"1400 + НПл"},{"$f":"IFERROR(CEILING((F24+D28)*(1+$D$25/100),50),\"НЕТ ДОСТАВКИ\")","v":16350},null,null,null,null,null,null,null,null,0,{"$f":"TEXT(SUM(MID(0&P28,LARGE(ISNUMBER(-MID(P28,ROW($1:$88),1))*ROW($1:$88),ROW($1:$15)+15)+1,1)*10^ROW($1:$15)/10),REPT(0,MIN(MAX(COUNT(1/(MID(P28,ROW($1:$88),1)+1))-15,),15)))&TEXT(SUM(MID(0&P28,LARGE(ISNUMBER(-MID(P28,ROW($1:$88),1))*ROW($1:$88),ROW($1:$15))+1,1)*10^ROW($1:$15)/10),REPT(0,MIN(COUNT(1/(MID(P28,ROW($1:$88),1)+1)),15)))","v":"0"}]
[{"$f":"IFERROR(A25*1.5,\"Количество ??\")","v":0},null,null,"К ОПЛАТЕ:",{"$f":"IFERROR(F24+E25,0)","v":16000},{"$f":"IF(E25=C29,\"Доставка БЕСПЛАТНО\",IF(E25=D26,E26,IF(E25=D27,E27,IF(E25=D28,E28,IF(E25=F27,G27,IF(E25=F28,G28,IF(E25=F26,G26,\"Укажите ТК\")))))))","v":16000},{"$f":"IFERROR(CEILING((F24+E25)*1.03,50),0)","v":16500},null,null,{"$f":"IFERROR(J25*1.5,\"Количество ??\")","v":0},null,null,null,null,null,0,{"$f":"TEXT(SUM(MID(0&P29,LARGE(ISNUMBER(-MID(P29,ROW($1:$88),1))*ROW($1:$88),ROW($1:$15)+15)+1,1)*10^ROW($1:$15)/10),REPT(0,MIN(MAX(COUNT(1/(MID(P29,ROW($1:$88),1)+1))-15,),15)))&TEXT(SUM(MID(0&P29,LARGE(ISNUMBER(-MID(P29,ROW($1:$88),1))*ROW($1:$88),ROW($1:$15))+1,1)*10^ROW($1:$15)/10),REPT(0,MIN(COUNT(1/(MID(P29,ROW($1:$88),1)+1)),15)))","v":"0"}]
["rc11091kz",null,{"$f":"IFERROR((P14&\"        \"&LEFT(P15,8)&\" = \"&TEXT(R15,\"### ### ###\")&\" т.\"),\"НЕТ ДОСТАВКИ\")","v":"        0 =  т."},null,{"$f":"IFERROR(\"QIWI = \"&CEILING((E26*1.02),10),0)","v":"QIWI = 16480"},{"$f":"IFERROR(F29-F24,\"УКАЖИТЕ ТК\")","v":1400},null,null,null,null,null,null,null,null,null,0,{"$f":"TEXT(SUM(MID(0&P30,LARGE(ISNUMBER(-MID(P30,ROW($1:$88),1))*ROW($1:$88),ROW($1:$15)+15)+1,1)*10^ROW($1:$15)/10),REPT(0,MIN(MAX(COUNT(1/(MID(P30,ROW($1:$88),1)+1))-15,),15)))&TEXT(SUM(MID(0&P30,LARGE(ISNUMBER(-MID(P30,ROW($1:$88),1))*ROW($1:$88),ROW($1:$15))+1,1)*10^ROW($1:$15)/10),REPT(0,MIN(COUNT(1/(MID(P30,ROW($1:$88),1)+1)),15)))","v":"0"}]
[{"$f":"A1","v":"+KASPI+120820++0"},"ПОЛУЧАТЕЛЬ:","rc11091kz",null,null,null,null,null,null,null,null,null,null,null,null,0,{"$f":"TEXT(SUM(MID(0&P31,LARGE(ISNUMBER(-MID(P31,ROW($1:$88),1))*ROW($1:$88),ROW($1:$15)+15)+1,1)*10^ROW($1:$15)/10),REPT(0,MIN(MAX(COUNT(1/(MID(P31,ROW($1:$88),1)+1))-15,),15)))&TEXT(SUM(MID(0&P31,LARGE(ISNUMBER(-MID(P31,ROW($1:$88),1))*ROW($1:$88),ROW($1:$15))+1,1)*10^ROW($1:$15)/10),REPT(0,MIN(COUNT(1/(MID(P31,ROW($1:$88),1)+1)),15)))","v":"0"}]
[{"$f":"UPPER((B3))","v":"ЁЛКИН АЛЕКСАНДР"},null,{"$f":"IFERROR(MID(НайтиСтрокуПоСлову(\"Комментарий: Имя :\",K1:K45),20,99),0)","v":0},null,null,null,null,null,null,null,null,null,null,null,null,0,{"$f":"TEXT(SUM(MID(0&P32,LARGE(ISNUMBER(-MID(P32,ROW($1:$88),1))*ROW($1:$88),ROW($1:$15)+15)+1,1)*10^ROW($1:$15)/10),REPT(0,MIN(MAX(COUNT(1/(MID(P32,ROW($1:$88),1)+1))-15,),15)))&TEXT(SUM(MID(0&P32,LARGE(ISNUMBER(-MID(P32,ROW($1:$88),1))*ROW($1:$88),ROW($1:$15))+1,1)*10^ROW($1:$15)/10),REPT(0,MIN(COUNT(1/(MID(P32,ROW($1:$88),1)+1)),15)))","v":"0"}]
["Область: ",{"$f":"UPPER((P18))","v":""},{"$f":"IFERROR(ПоискСНачала(C32,\"Телефон\"),0)","v":0},null,{"$f":"IFERROR(ПоискМежду(C32,\"Телефон :\",\"Примечание\"),0)","v":0},{"$f":"IFERROR(IF(LEFT(ПоискСКонца(C32,\"Примечание : \"),2)=\"г \",MID(ПоискСКонца(C32,\"Примечание : \"),3,99),IF(LEFT(ПоискСКонца(C32,\"Примечание : \"),3)=\"г. \",MID(ПоискСКонца(C32,\"Примечание : \"),4,99),IF(LEFT(ПоискСКонца(C32,\"Примечание : \"),3)=\"гор\",MID(ПоискСКонца(C32,\"Примечание : \"),6,99),0))),0)","v":0},null,null,null,null,null,null,null,null,null,0,{"$f":"TEXT(SUM(MID(0&P33,LARGE(ISNUMBER(-MID(P33,ROW($1:$88),1))*ROW($1:$88),ROW($1:$15)+15)+1,1)*10^ROW($1:$15)/10),REPT(0,MIN(MAX(COUNT(1/(MID(P33,ROW($1:$88),1)+1))-15,),15)))&TEXT(SUM(MID(0&P33,LARGE(ISNUMBER(-MID(P33,ROW($1:$88),1))*ROW($1:$88),ROW($1:$15))+1,1)*10^ROW($1:$15)/10),REPT(0,MIN(COUNT(1/(MID(P33,ROW($1:$88),1)+1)),15)))","v":"0"}]
["Город: ","Алматы",null,null,null,null,null,null,null,null,null,null,null,null,null,0,{"$f":"TEXT(SUM(MID(0&P34,LARGE(ISNUMBER(-MID(P34,ROW($1:$88),1))*ROW($1:$88),ROW($1:$15)+15)+1,1)*10^ROW($1:$15)/10),REPT(0,MIN(MAX(COUNT(1/(MID(P34,ROW($1:$88),1)+1))-15,),15)))&TEXT(SUM(MID(0&P34,LARGE(ISNUMBER(-MID(P34,ROW($1:$88),1))*ROW($1:$88),ROW($1:$15))+1,1)*10^ROW($1:$15)/10),REPT(0,MIN(COUNT(1/(MID(P34,ROW($1:$88),1)+1)),15)))","v":"0"}]
["Улица: ","Жарокова, дом 39/2, кв. 2",null,null,null,null,null,null,null,null,null,null,null,null,null,0,{"$f":"TEXT(SUM(MID(0&P35,LARGE(ISNUMBER(-MID(P35,ROW($1:$88),1))*ROW($1:$88),ROW($1:$15)+15)+1,1)*10^ROW($1:$15)/10),REPT(0,MIN(MAX(COUNT(1/(MID(P35,ROW($1:$88),1)+1))-15,),15)))&TEXT(SUM(MID(0&P35,LARGE(ISNUMBER(-MID(P35,ROW($1:$88),1))*ROW($1:$88),ROW($1:$15))+1,1)*10^ROW($1:$15)/10),REPT(0,MIN(COUNT(1/(MID(P35,ROW($1:$88),1)+1)),15)))","v":"0"}]
["Здание: ",{"$f":"P21","v":""},null,null,null,null,null,null,null,null,null,null,null,null,null,0,{"$f":"TEXT(SUM(MID(0&P36,LARGE(ISNUMBER(-MID(P36,ROW($1:$88),1))*ROW($1:$88),ROW($1:$15)+15)+1,1)*10^ROW($1:$15)/10),REPT(0,MIN(MAX(COUNT(1/(MID(P36,ROW($1:$88),1)+1))-15,),15)))&TEXT(SUM(MID(0&P36,LARGE(ISNUMBER(-MID(P36,ROW($1:$88),1))*ROW($1:$88),ROW($1:$15))+1,1)*10^ROW($1:$15)/10),REPT(0,MIN(COUNT(1/(MID(P36,ROW($1:$88),1)+1)),15)))","v":"0"}]
["Квартира: ",{"$f":"P22","v":""},null,null,null,null,null,null,null,null,null,null,null,null,null,0,{"$f":"TEXT(SUM(MID(0&P37,LARGE(ISNUMBER(-MID(P37,ROW($1:$88),1))*ROW($1:$88),ROW($1:$15)+15)+1,1)*10^ROW($1:$15)/10),REPT(0,MIN(MAX(COUNT(1/(MID(P37,ROW($1:$88),1)+1))-15,),15)))&TEXT(SUM(MID(0&P37,LARGE(ISNUMBER(-MID(P37,ROW($1:$88),1))*ROW($1:$88),ROW($1:$15))+1,1)*10^ROW($1:$15)/10),REPT(0,MIN(COUNT(1/(MID(P37,ROW($1:$88),1)+1)),15)))","v":"0"}]
["Телефон: ",{"$f":"B4","v":"8-701-072-23-33   0----   ----"},null,null,null,null,null,null,null,null,null,null,null,null,null,0,{"$f":"TEXT(SUM(MID(0&P38,LARGE(ISNUMBER(-MID(P38,ROW($1:$88),1))*ROW($1:$88),ROW($1:$15)+15)+1,1)*10^ROW($1:$15)/10),REPT(0,MIN(MAX(COUNT(1/(MID(P38,ROW($1:$88),1)+1))-15,),15)))&TEXT(SUM(MID(0&P38,LARGE(ISNUMBER(-MID(P38,ROW($1:$88),1))*ROW($1:$88),ROW($1:$15))+1,1)*10^ROW($1:$15)/10),REPT(0,MIN(COUNT(1/(MID(P38,ROW($1:$88),1)+1)),15)))","v":"0"}]
["Индекс: ",{"$f":"P16","v":""},null,null,null,null,null,null,null,null,null,null,null,null,null,null,{"$f":"IF(LEFT(#REF!,4)=\"ваша\",VALUE(MID(#REF!,13,20))*100,0)","v":{"$error":"#REF!"}}]
["Компания:",null,null,null,null,null,null,null,null,null,null,null,null,null,null,null,{"$f":"IF(LEFT(#REF!,4)=\"ваша\",VALUE(MID(#REF!,13,20))*100,0)","v":{"$error":"#REF!"}}]
["ИИН:",{"$f":"F29","v":16000},null,null,null,null,null,null,null,null,null,null,null,null,null,null,{"$f":"IF(LEFT(#REF!,4)=\"ваша\",VALUE(MID(#REF!,13,20))*100,0)","v":{"$error":"#REF!"}}]
["------------------------","----------------------------------------------------","----------------------------------------------------","------------------------","------------------------","---------------------------","------------------------------","------------------------","------------------------",null,null,null,null,null,null,null,{"$f":"SUM(Q19:Q41)","v":{"$error":"#REF!"}}]

{"sheet":" 9632++10650","index":10,"n_rows":42,"n_cols":21,"rows_kept":42,"cut":false,"hidden":false,"merged":[[27,6,27,8],[31,0,31,1],[37,1,37,2],[0,4,0,7],[1,4,1,8],[2,1,2,2],[3,1,3,2],[25,6,25,8],[26,6,26,8]]}
[{"$f":"IF(LEFT(C29,2)=\"сп\",P1&\" ► СП\",IF(E25=D26,P1,IF(H6<>0,P1&\"++\"&\"0\",IF(E25=D27,P1&\"++\"&\"0\",IF(E25=D28,P1&\"++\"&\"0\",IF(E25=D27,P1&\"++\"&\"0\",IF(E25=D28,P1&\"++\"&\"0\",IF(LEFT(C25,2)=\"AV\",P1&\"++\"&F29,P1))))))))","v":" 9632++10650"},{"$f":"L4","v":"2020-08-09T18:08:34"},{"$f":"IF(E2>0,\"ОТПРАВЛЕНО\",IF(LEFT(C29,3)=\"ЗАК\",\"ЗАКАЗАНО в СПБ\",IF(G24>=0,\"ОПЛОЧЕНО\",\"ОЖИДАНИЕ ОПЛАТЫ\")))","v":"ОТПРАВЛЕНО"},{"$f":"'СПИСОК ЗАКАЗОВ'!B1","v":21},"2020-08-11",null,null,null,{"$f":"A1","v":" 9632++10650"},null,"Заказ № 9632",null,null,null,null,{"$f":"IF(G24>0,\"+\"&H6&\"+\"&Q1,Q1)","v":" 9632"},{"$f":"ПоискСКонца(K1,\"№\")","v":" 9632"}]
["Логин",{"$f":"L3","v":0},"Номер накл-ой",null,3611546,null,null,null,null,null,"Примечание"]
["ФИО",{"$f":"IF(C32=0,UPPER((P9)),UPPER(C33))","v":"АНАТОЛИ ЕЛИМГИРЕЙ"},null,null,null,null,null,null,null,null,"Логин"]
["Телефон",{"$f":"R12","v":"7-707-695-04-76   0----   ----"},null,null,{"$f":"IF(F4>0.5,\"оплачено\",IF(F4<0,\"ОПЛАТИТЬ= \"&G4,\"ОПЛАТИТЬ= \"&Q25))","v":"ОПЛАТИТЬ= 1400"},0,1100,null,null,null,"Дата заказа","2020-08-09T18:08:34"]
["e-mail:",{"$f":"L11","v":"-"}]
["Вес","ПРИМЕЧАНИЯ","Наименование","Кол-во","Цена","Всего",{"$f":"IF(MAX(G7:G25)>0,MAX(G7:G25),\"\")","v":""},{"$f":"IF(I7>0,\"НАЛ\",IF(I8>0,\"ПЕРЕВОД\",IF(I9>0,\"Beeline\",IF(I10>0,\"KASPI\",IF(I11>0,\"QIWI\",IF(I12>0,\"СЧЁТ Альфа-Банк\",0))))))","v":0},{"$f":"SUM(I7:I28)","v":0}]
[{"$f":"IF(L24>0,Q24*1/100,\"\")","v":""},"списано",{"$f":"IF(L26<>\"\",K26,\"\")","v":"Неодимовый магнит D5x1mm(Аксиал)`42 (сила притяжения 0,2 кг)"},500,{"$f":"IF(M26=\"уточняйте\",0,IF(L26>0,M26,\"\"))","v":18},{"$f":"IF(D7<>\"\",E7*D7,\"\")","v":9000},{"$f":"IF(I7 >0,TODAY(),\"\")","v":""},"НАЛ",null,{"$f":"IFERROR(IFERROR(VLOOKUP(C7,#REF!,3,0)*D7,VLOOKUP(C7,#REF!,7,0)*D7),\"нет веса\")","v":"нет веса"},"Заказ №9632"]
[{"$f":"IF(L25>0,Q25*1/100,\"\")","v":14},null,{"$f":"IF(L27<>\"\",K27,\"\")","v":""},{"$f":"IF(L27>0,L27,\"\")","v":""},{"$f":"IF(M27=\"уточняйте\",0,IF(L27>0,M27,\"\"))","v":""},"","","ПЕРЕВОД",null,{"$f":"IFERROR(IFERROR(VLOOKUP(C8,#REF!,3,0)*D8,VLOOKUP(C8,#REF!,7,0)*D8),\"нет веса\")","v":"нет веса"}]
[{"$f":"IF(L26>0,Q26*1/100,\"\")","v":0},null,"","","","","","Beeline",null,{"$f":"IFERROR(IFERROR(VLOOKUP(C9,#REF!,3,0)*D9,VLOOKUP(C9,#REF!,7,0)*D9),\"нет веса\")","v":"нет веса"},"Здравствуйте, Анатоли Елимгирей",null,null,null,null,{"$f":"MID(K9,15,70)","v":"Анатоли Елимгирей"},{"$f":"TEXT(SUM(MID(0&L9,LARGE(ISNUMBER(-MID(L9,ROW($1:$96),1))*ROW($1:$96),ROW($1:$23)+15)+1,1)*10^ROW($1:$23)/10),REPT(0,MIN(MAX(COUNT(1/(MID(L9,ROW($1:$96),1)+1))-15,),15)))&TEXT(SUM(MID(0&L9,LARGE(ISNUMBER(-MID(L9,ROW($1:$96),1))*ROW($1:$96),ROW($1:$23))+1,1)*10^ROW($1:$23)/10),REPT(0,MIN(COUNT(1/(MID(L9,ROW($1:$96),1)+1)),15)))","v":""}]
["",null,"","","","","","KASPI",null,{"$f":"IFERROR(IFERROR(VLOOKUP(C10,#REF!,3,0)*D10,VLOOKUP(C10,#REF!,7,0)*D10),\"нет веса\")","v":"нет веса"},"Мы получили Ваш заказ номер, 9632"]
["",null,"","","","","","QIWI",null,{"$f":"IFERROR(IFERROR(VLOOKUP(C11,#REF!,3,0)*D11,VLOOKUP(C11,#REF!,7,0)*D11),\"нет веса\")","v":"нет веса"},"Электронная почта:","-"]
["",null,"","","","","","СЧЁТ Альфа-Банк",null,{"$f":"IFERROR(IFERROR(VLOOKUP(C12,#REF!,3,0)*D12,VLOOKUP(C12,#REF!,7,0)*D12),\"нет веса\")","v":"нет веса"},"Контактный телефон:","+7 (707) 695-04-76",null,null,null,{"$f":"(L12&\"  \"&P13)","v":"+7 (707) 695-04-76  0"},{"$f":"TEXT(SUM(MID(0&P12,LARGE(ISNUMBER(-MID(P12,ROW($1:$99),1))*ROW($1:$99),ROW($1:$15)+30)+1,1)*10^ROW($1:$15)/10),REPT(0,MIN(MAX(COUNT(1/(MID(P12,ROW($1:$99),1)+1))-30,),15)))&TEXT(SUM(MID(0&P12,LARGE(ISNUMBER(-MID(P12,ROW($1:$99),1))*ROW($1:$99),ROW($1:$15)+15)+1,1)*10^ROW($1:$15)/10),REPT(0,MIN(MAX(COUNT(1/(MID(P12,ROW($1:$99),1)+1))-15,),15)))&TEXT(SUM(MID(0&P12,LARGE(ISNUMBER(-MID(P12,ROW($1:$99),1))*ROW($1:$99),ROW($1:$15))+1,1)*10^ROW($1:$15)/10),REPT(0,MIN(COUNT(1/(MID(P12,ROW($1:$99),1)+1)),15)))","v":"770769504760"},{"$f":"(MID(Q12,1,1))&\"-\"&(MID(Q12,2,3))&\"-\"&(MID(Q12,5,3))&\"-\"&(MID(Q12,8,2))&\"-\"&(MID(Q12,10,2))&\"   \"&(MID(Q12,12,1))&\"-\"&(MID(Q12,13,3))&\"-\"&(MID(Q12,16,3))&\"-\"&(MID(Q12,19,2))&\"-\"&(MID(Q12,21,2))&\"   \"&(MID(Q12,23,1))&\"-\"&(MID(Q12,24,3))&\"-\"&(MID(Q12,27,3))&\"-\"&(MID(Q12,30,2))&\"-\"&(MID(Q12,32,2))","v":"7-707-695-04-76   0----   ----"}]
["",null,"","","","","",null,null,{"$f":"IFERROR(IFERROR(VLOOKUP(C13,#REF!,3,0)*D13,VLOOKUP(C13,#REF!,7,0)*D13),\"нет веса\")","v":"нет веса"},"Доставка:","-",null,null,null,{"$f":"IF(L13=\"-\",IFERROR(НайтиСтрокуПоСлову(\"Комментарий\",K27:K60),0),L13)","v":0}]
["",null,"","","","","",null,null,{"$f":"IFERROR(IFERROR(VLOOKUP(C14,#REF!,3,0)*D14,VLOOKUP(C14,#REF!,7,0)*D14),\"нет веса\")","v":"нет веса"},"Оплата:","-",null,null,null,{"$f":"MID(L14,23,70)","v":""}]
["",null,"","","","","",null,null,{"$f":"IFERROR(IFERROR(VLOOKUP(C15,#REF!,3,0)*D15,VLOOKUP(C15,#REF!,7,0)*D15),\"нет веса\")","v":"нет веса"},null,null,null,null,null,{"$f":"IF(LEFT(P14,2)=\"EX\",MID(L15,11,70),L15)","v":0},{"$f":"TEXT(SUM(MID(0&P15,LARGE(ISNUMBER(-MID(P15,ROW($1:$88),1))*ROW($1:$88),ROW($1:$15)+15)+1,1)*10^ROW($1:$15)/10),REPT(0,MIN(MAX(COUNT(1/(MID(P15,ROW($1:$88),1)+1))-15,),15)))&TEXT(SUM(MID(0&P15,LARGE(ISNUMBER(-MID(P15,ROW($1:$88),1))*ROW($1:$88),ROW($1:$15))+1,1)*10^ROW($1:$15)/10),REPT(0,MIN(COUNT(1/(MID(P15,ROW($1:$88),1)+1)),15)))","v":"0"},{"$f":"SUMPRODUCT(--SUBSTITUTE(Q15:Q15,CHAR(160),))","v":0},{"$f":"LEN(Q15)","v":1},{"$f":"FLOOR(S15/3,1)","v":0}]
["",null,"","","","","",null,null,{"$f":"IFERROR(IFERROR(VLOOKUP(C16,#REF!,3,0)*D16,VLOOKUP(C16,#REF!,7,0)*D16),\"нет веса\")","v":"нет веса"},"Адрес доставки:","Индекс:",null,null,null,{"$f":"MID(L16,9,70)","v":""}]
["",null,"","","","","",null,null,{"$f":"IFERROR(IFERROR(VLOOKUP(C17,#REF!,3,0)*D17,VLOOKUP(C17,#REF!,7,0)*D17),\"нет веса\")","v":"нет веса"},null,"Страна:",null,null,null,{"$f":"MID(L17,9,70)","v":""},{"$f":"IF(LEFT(K17,4)=\"ваша\",VALUE(MID(K17,13,20))*100,0)","v":0}]
["",null,"","","","","",null,null,{"$f":"IFERROR(IFERROR(VLOOKUP(C18,#REF!,3,0)*D18,VLOOKUP(C18,#REF!,7,0)*D18),\"нет веса\")","v":"нет веса"},null,"Область:",null,null,null,{"$f":"MID(L18,10,70)","v":""}]
["",null,"","","","","",null,null,{"$f":"IFERROR(IFERROR(VLOOKUP(C19,#REF!,3,0)*D19,VLOOKUP(C19,#REF!,7,0)*D19),\"нет веса\")","v":"нет веса"},null,"Город: Астана (Ильинка)",null,null,null,{"$f":"MID(L19,8,70)","v":"Астана (Ильинка)"},{"$f":"IF(LEFT(K19,4)=\"ваша\",VALUE(MID(K19,13,20))*100,0)","v":0}]
["",null,"","","","","",null,null,{"$f":"IFERROR(IFERROR(VLOOKUP(C20,#REF!,3,0)*D20,VLOOKUP(C20,#REF!,7,0)*D20),\"нет веса\")","v":"нет веса"},null,"Улица: Әбілхан Қастеев, 7",null,null,null,{"$f":"MID(L20,8,70)","v":"Әбілхан Қастеев, 7"},{"$f":"IF(LEFT(K31,4)=\"ваша\",VALUE(MID(K31,13,20))*100,0)","v":0}]
["",null,"","","","","",null,null,{"$f":"IFERROR(IFERROR(VLOOKUP(C21,#REF!,3,0)*D21,VLOOKUP(C21,#REF!,7,0)*D21),\"нет веса\")","v":"нет веса"},null,"Здание: 7",null,null,null,{"$f":"MID(L21,9,70)","v":"7"},{"$f":"IF(LEFT(K32,4)=\"ваша\",VALUE(MID(K32,13,20))*100,0)","v":0}]
["",null,"","","","","",null,null,{"$f":"IFERROR(IFERROR(VLOOKUP(C22,#REF!,3,0)*D22,VLOOKUP(C22,#REF!,7,0)*D22),\"нет веса\")","v":"нет веса"},null,"Квартира: Нету",null,null,null,{"$f":"MID(L22,11,70)","v":"Нету"},{"$f":"IF(LEFT(#REF!,4)=\"ваша\",VALUE(MID(#REF!,13,20))*100,0)","v":{"$error":"#REF!"}}]
["",null,null,null,"Итого:",{"$f":"SUM(F7:F22)","v":9000},"",null,null,{"$f":"IF(K40>0,M40,\"\")","v":""},"Комментарий : Перед тем как подойти позвоните +7 (707) 695-04-76 мы выйдем встретим курьера",null,null,null,null,null,{"$f":"IF(LEFT(K33,4)=\"ваша\",VALUE(MID(K33,13,20))*100,0)","v":0}]
[{"$f":"IF(L41>0,N41,\"\")","v":""},null,null,"скидка:",{"$f":"IF(F23>150000,10,IF(F23>100000,8,IF(F23>60000,5,IF(F23>30000,3,0))))","v":0},{"$f":"F23-(F23*E24/100)","v":9000},{"$f":"IFERROR(SUM(I7:I22)-F29+1,0)","v":-10649},null,null,null,null,null,null,null,null,{"$f":"N24","v":0},{"$f":"TEXT(SUM(MID(0&P24,LARGE(ISNUMBER(-MID(P24,ROW($1:$88),1))*ROW($1:$88),ROW($1:$15)+15)+1,1)*10^ROW($1:$15)/10),REPT(0,MIN(MAX(COUNT(1/(MID(P24,ROW($1:$88),1)+1))-15,),15)))&TEXT(SUM(MID(0&P24,LARGE(ISNUMBER(-MID(P24,ROW($1:$88),1))*ROW($1:$88),ROW($1:$15))+1,1)*10^ROW($1:$15)/10),REPT(0,MIN(COUNT(1/(MID(P24,ROW($1:$88),1)+1)),15)))","v":"0"}]
[{"$f":"SUM(A7:A23)/1000*1.3","v":1.8200000000000001E-2},null,{"$f":"IF(E25=F26,\"Доставка БЕСПЛАТНО\",IF(E25=D26,C26,IF(E25=D27,C27,IF(E25=D28,C28,IF(E25=F27,C27&\" + НПл\",IF(E25=F28,C28&\" + НПл\",\"Укажите ТК\"))))))","v":"AVIS EXPRESS  Астана + НПл"},2,{"$f":"F28","v":"1400 + НПл"},null,{"$f":"IF(I25 >0,TODAY(),\"\")","v":""},null,null,{"$f":"SUM(J7:J22)/1000","v":0},"Наименование","Количество","Цена","Вес","Всего",{"$f":"E25","v":"1400 + НПл"},{"$f":"TEXT(SUM(MID(0&P25,LARGE(ISNUMBER(-MID(P25,ROW($1:$88),1))*ROW($1:$88),ROW($1:$15)+15)+1,1)*10^ROW($1:$15)/10),REPT(0,MIN(MAX(COUNT(1/(MID(P25,ROW($1:$88),1)+1))-15,),15)))&TEXT(SUM(MID(0&P25,LARGE(ISNUMBER(-MID(P25,ROW($1:$88),1))*ROW($1:$88),ROW($1:$15))+1,1)*10^ROW($1:$15)/10),REPT(0,MIN(COUNT(1/(MID(P25,ROW($1:$88),1)+1)),15)))","v":"1400"},{"$f":"E25","v":"1400 + НПл"},{"$f":"TEXT(SUM(MID(0&R25,LARGE(ISNUMBER(-MID(R25,ROW($1:$88),1))*ROW($1:$88),ROW($1:$15)+15)+1,1)*10^ROW($1:$15)/10),REPT(0,MIN(MAX(COUNT(1/(MID(R25,ROW($1:$88),1)+1))-15,),15)))&TEXT(SUM(MID(0&R25,LARGE(ISNUMBER(-MID(R25,ROW($1:$88),1))*ROW($1:$88),ROW($1:$15))+1,1)*10^ROW($1:$15)/10),REPT(0,MIN(COUNT(1/(MID(R25,ROW($1:$88),1)+1)),15)))","v":"1400"},null,{"$f":"TEXT(SUM(MID(0&E25,LARGE(ISNUMBER(-MID(E25,ROW($1:$88),1))*ROW($1:$88),ROW($1:$15)+15)+1,1)*10^ROW($1:$15)/10),REPT(0,MIN(MAX(COUNT(1/(MID(E25,ROW($1:$88),1)+1))-15,),15)))&TEXT(SUM(MID(0&E25,LARGE(ISNUMBER(-MID(E25,ROW($1:$88),1))*ROW($1:$88),ROW($1:$15))+1,1)*10^ROW($1:$15)/10),REPT(0,MIN(COUNT(1/(MID(E25,ROW($1:$88),1)+1)),15)))","v":{"$error":"#NUM!"}}]
[null,null,{"$f":"IFERROR(\"AVIS С А М О В Ы В О З \"&\"  \"&VLOOKUP((LEFT(B34,(LEN(B34)))),'ТАРИФЫ ТК'!J17:L268,1,0),\"НЕТ ДОСТАВКИ\")","v":"AVIS С А М О В Ы В О З   Астана"},{"$f":"IFERROR(VLOOKUP((LEFT(B34,(LEN(B34)))),'ТАРИФЫ ТК'!J17:L268,3,0)+0.001,\"НЕТ ДОСТАВКИ\")","v":1550.001},{"$f":"IFERROR(F24+D26,\"НЕТ ДОСТАВКИ\")","v":10550.001},{"$f":"IFERROR(D26&\" + НПл\",\"НЕТ ДОСТАВКИ\")","v":"1550,001 + НПл"},{"$f":"IFERROR(CEILING((F24+D26)*(1+$D$25/100),50),0)","v":10800},null,null,null,"Неодимовый магнит D5x1mm(Аксиал)`42 (сила притяжения 0,2 кг)",1,18,0,18,{"$f":"N26","v":0},{"$f":"TEXT(SUM(MID(0&P26,LARGE(ISNUMBER(-MID(P26,ROW($1:$88),1))*ROW($1:$88),ROW($1:$15)+15)+1,1)*10^ROW($1:$15)/10),REPT(0,MIN(MAX(COUNT(1/(MID(P26,ROW($1:$88),1)+1))-15,),15)))&TEXT(SUM(MID(0&P26,LARGE(ISNUMBER(-MID(P26,ROW($1:$88),1))*ROW($1:$88),ROW($1:$15))+1,1)*10^ROW($1:$15)/10),REPT(0,MIN(COUNT(1/(MID(P26,ROW($1:$88),1)+1)),15)))","v":"0"}]
[null,null,{"$f":"IFERROR(\"AVIS Econom\"&\"  \"&VLOOKUP((LEFT(B34,(LEN(B34)))),'ТАРИФЫ ТК'!A4:A134,1,0),\"НЕТ ДОСТАВКИ\")","v":"AVIS Econom  Астана"},{"$f":"IFERROR(VLOOKUP((LEFT(B34,(LEN(B34)))),'ТАРИФЫ ТК'!A4:C134,3,0),\"НЕТ ДОСТАВКИ\")","v":1300},{"$f":"IFERROR(F24+D27,\"НЕТ ДОСТАВКИ\")","v":10300},{"$f":"IFERROR(D27&\" + НПл\",\"НЕТ ДОСТАВКИ\")","v":"1300 + НПл"},{"$f":"IFERROR(CEILING((F24+D27)*(1+$D$25/100),50),0)","v":10550},null,null,null,"Общий вес:0",null,null,null,null,0,{"$f":"TEXT(SUM(MID(0&P27,LARGE(ISNUMBER(-MID(P27,ROW($1:$88),1))*ROW($1:$88),ROW($1:$15)+15)+1,1)*10^ROW($1:$15)/10),REPT(0,MIN(MAX(COUNT(1/(MID(P27,ROW($1:$88),1)+1))-15,),15)))&TEXT(SUM(MID(0&P27,LARGE(ISNUMBER(-MID(P27,ROW($1:$88),1))*ROW($1:$88),ROW($1:$15))+1,1)*10^ROW($1:$15)/10),REPT(0,MIN(COUNT(1/(MID(P27,ROW($1:$88),1)+1)),15)))","v":"0"}]
[null,null,{"$f":"IFERROR(IF(A29<1,\"AVIS EXPRESS\"&\"  \"&VLOOKUP((LEFT(B34,(LEN(B34)))),'ТАРИФЫ ТК'!E4:G20,1,0),\"AV ВИМАНИЕ:   В Е С    П О С Ы Л К И    Б О Л Ь Ш Е   0,5 КГ   !!!\"),\"НЕТ ДОСТАВКИ\")","v":"AVIS EXPRESS  Астана"},{"$f":"IFERROR(VLOOKUP((LEFT(B34,(LEN(B34)))),'ТАРИФЫ ТК'!E4:G20,3,0),\"НЕТ ДОСТАВКИ\")","v":1400},{"$f":"IFERROR(F24+D28,\"НЕТ ДОСТАВКИ\")","v":10400},{"$f":"D28&\" + НПл\"","v":"1400 + НПл"},{"$f":"IFERROR(CEILING((F24+D28)*(1+$D$25/100),50),\"НЕТ ДОСТАВКИ\")","v":10650},null,null,null,"Итого:50",null,null,null,null,0,{"$f":"TEXT(SUM(MID(0&P28,LARGE(ISNUMBER(-MID(P28,ROW($1:$88),1))*ROW($1:$88),ROW($1:$15)+15)+1,1)*10^ROW($1:$15)/10),REPT(0,MIN(MAX(COUNT(1/(MID(P28,ROW($1:$88),1)+1))-15,),15)))&TEXT(SUM(MID(0&P28,LARGE(ISNUMBER(-MID(P28,ROW($1:$88),1))*ROW($1:$88),ROW($1:$15))+1,1)*10^ROW($1:$15)/10),REPT(0,MIN(COUNT(1/(MID(P28,ROW($1:$88),1)+1)),15)))","v":"0"}]
[{"$f":"IFERROR(A25*1.5,\"Количество ??\")","v":2.7300000000000001E-2},null,null,"К ОПЛАТЕ:",{"$f":"IFERROR(F24+E25,0)","v":0},{"$f":"IF(E25=C29,\"Доставка БЕСПЛАТНО\",IF(E25=D26,E26,IF(E25=D27,E27,IF(E25=D28,E28,IF(E25=F27,G27,IF(E25=F28,G28,IF(E25=F26,G26,\"Укажите ТК\")))))))","v":10650},{"$f":"IFERROR(CEILING((F24+E25)*1.03,50),0)","v":0},null,null,{"$f":"IFERROR(J25*1.5,\"Количество ??\")","v":0},null,null,null,null,null,0,{"$f":"TEXT(SUM(MID(0&P29,LARGE(ISNUMBER(-MID(P29,ROW($1:$88),1))*ROW($1:$88),ROW($1:$15)+15)+1,1)*10^ROW($1:$15)/10),REPT(0,MIN(MAX(COUNT(1/(MID(P29,ROW($1:$88),1)+1))-15,),15)))&TEXT(SUM(MID(0&P29,LARGE(ISNUMBER(-MID(P29,ROW($1:$88),1))*ROW($1:$88),ROW($1:$15))+1,1)*10^ROW($1:$15)/10),REPT(0,MIN(COUNT(1/(MID(P29,ROW($1:$88),1)+1)),15)))","v":"0"}]
["rc11091kz",null,{"$f":"IFERROR((P14&\"        \"&LEFT(P15,8)&\" = \"&TEXT(R15,\"### ### ###\")&\" т.\"),\"НЕТ ДОСТАВКИ\")","v":"        0 =  т."},null,{"$f":"IFERROR(\"QIWI = \"&CEILING((E26*1.02),10),0)","v":"QIWI = 10770"},{"$f":"IFERROR(F29-F24,\"УКАЖИТЕ ТК\")","v":1650},null,null,null,null,null,null,null,null,null,0,{"$f":"TEXT(SUM(MID(0&P30,LARGE(ISNUMBER(-MID(P30,ROW($1:$88),1))*ROW($1:$88),ROW($1:$15)+15)+1,1)*10^ROW($1:$15)/10),REPT(0,MIN(MAX(COUNT(1/(MID(P30,ROW($1:$88),1)+1))-15,),15)))&TEXT(SUM(MID(0&P30,LARGE(ISNUMBER(-MID(P30,ROW($1:$88),1))*ROW($1:$88),ROW($1:$15))+1,1)*10^ROW($1:$15)/10),REPT(0,MIN(COUNT(1/(MID(P30,ROW($1:$88),1)+1)),15)))","v":"0"}]
[{"$f":"A1","v":" 9632++10650"},"ПОЛУЧАТЕЛЬ:","rc11091kz",null,null,null,null,null,null,null,null,null,null,null,null,0,{"$f":"TEXT(SUM(MID(0&P31,LARGE(ISNUMBER(-MID(P31,ROW($1:$88),1))*ROW($1:$88),ROW($1:$15)+15)+1,1)*10^ROW($1:$15)/10),REPT(0,MIN(MAX(COUNT(1/(MID(P31,ROW($1:$88),1)+1))-15,),15)))&TEXT(SUM(MID(0&P31,LARGE(ISNUMBER(-MID(P31,ROW($1:$88),1))*ROW($1:$88),ROW($1:$15))+1,1)*10^ROW($1:$15)/10),REPT(0,MIN(COUNT(1/(MID(P31,ROW($1:$88),1)+1)),15)))","v":"0"}]
[{"$f":"UPPER((B3))","v":"АНАТОЛИ ЕЛИМГИРЕЙ"},null,{"$f":"IFERROR(MID(НайтиСтрокуПоСлову(\"Комментарий: Имя :\",K1:K45),20,99),0)","v":0},null,null,null,null,null,null,null,"Назад",null,null,null,null,0,{"$f":"TEXT(SUM(MID(0&P32,LARGE(ISNUMBER(-MID(P32,ROW($1:$88),1))*ROW($1:$88),ROW($1:$15)+15)+1,1)*10^ROW($1:$15)/10),REPT(0,MIN(MAX(COUNT(1/(MID(P32,ROW($1:$88),1)+1))-15,),15)))&TEXT(SUM(MID(0&P32,LARGE(ISNUMBER(-MID(P32,ROW($1:$88),1))*ROW($1:$88),ROW($1:$15))+1,1)*10^ROW($1:$15)/10),REPT(0,MIN(COUNT(1/(MID(P32,ROW($1:$88),1)+1)),15)))","v":"0"}]
["Область: ","АСТАНА (ИЛЬИНКА)",{"$f":"IFERROR(ПоискСНачала(C32,\"Телефон\"),0)","v":0},null,{"$f":"IFERROR(ПоискМежду(C32,\"Телефон :\",\"Примечание\"),0)","v":0},{"$f":"IFERROR(IF(LEFT(ПоискСКонца(C32,\"Примечание : \"),2)=\"г \",MID(ПоискСКонца(C32,\"Примечание : \"),3,99),IF(LEFT(ПоискСКонца(C32,\"Примечание : \"),3)=\"г. \",MID(ПоискСКонца(C32,\"Примечание : \"),4,99),IF(LEFT(ПоискСКонца(C32,\"Примечание : \"),3)=\"гор\",MID(ПоискСКонца(C32,\"Примечание : \"),6,99),0))),0)","v":0},null,null,null,null,null,null,null,null,null,0,{"$f":"TEXT(SUM(MID(0&P33,LARGE(ISNUMBER(-MID(P33,ROW($1:$88),1))*ROW($1:$88),ROW($1:$15)+15)+1,1)*10^ROW($1:$15)/10),REPT(0,MIN(MAX(COUNT(1/(MID(P33,ROW($1:$88),1)+1))-15,),15)))&TEXT(SUM(MID(0&P33,LARGE(ISNUMBER(-MID(P33,ROW($1:$88),1))*ROW($1:$88),ROW($1:$15))+1,1)*10^ROW($1:$15)/10),REPT(0,MIN(COUNT(1/(MID(P33,ROW($1:$88),1)+1)),15)))","v":"0"}]
["Город: ","Астана",null,null,null,null,null,null,null,null,null,null,null,null,null,0,{"$f":"TEXT(SUM(MID(0&P34,LARGE(ISNUMBER(-MID(P34,ROW($1:$88),1))*ROW($1:$88),ROW($1:$15)+15)+1,1)*10^ROW($1:$15)/10),REPT(0,MIN(MAX(COUNT(1/(MID(P34,ROW($1:$88),1)+1))-15,),15)))&TEXT(SUM(MID(0&P34,LARGE(ISNUMBER(-MID(P34,ROW($1:$88),1))*ROW($1:$88),ROW($1:$15))+1,1)*10^ROW($1:$15)/10),REPT(0,MIN(COUNT(1/(MID(P34,ROW($1:$88),1)+1)),15)))","v":"0"}]
["Улица: ",{"$f":"UPPER((P20))","v":"ӘБІЛХАН ҚАСТЕЕВ, 7"},null,null,null,null,null,null,null,null,null,null,null,null,null,0,{"$f":"TEXT(SUM(MID(0&P35,LARGE(ISNUMBER(-MID(P35,ROW($1:$88),1))*ROW($1:$88),ROW($1:$15)+15)+1,1)*10^ROW($1:$15)/10),REPT(0,MIN(MAX(COUNT(1/(MID(P35,ROW($1:$88),1)+1))-15,),15)))&TEXT(SUM(MID(0&P35,LARGE(ISNUMBER(-MID(P35,ROW($1:$88),1))*ROW($1:$88),ROW($1:$15))+1,1)*10^ROW($1:$15)/10),REPT(0,MIN(COUNT(1/(MID(P35,ROW($1:$88),1)+1)),15)))","v":"0"}]
["Здание: ",{"$f":"P21","v":"7"},null,null,null,null,null,null,null,null,null,null,null,null,null,0,{"$f":"TEXT(SUM(MID(0&P36,LARGE(ISNUMBER(-MID(P36,ROW($1:$88),1))*ROW($1:$88),ROW($1:$15)+15)+1,1)*10^ROW($1:$15)/10),REPT(0,MIN(MAX(COUNT(1/(MID(P36,ROW($1:$88),1)+1))-15,),15)))&TEXT(SUM(MID(0&P36,LARGE(ISNUMBER(-MID(P36,ROW($1:$88),1))*ROW($1:$88),ROW($1:$15))+1,1)*10^ROW($1:$15)/10),REPT(0,MIN(COUNT(1/(MID(P36,ROW($1:$88),1)+1)),15)))","v":"0"}]
["Квартира: ",{"$f":"P22","v":"Нету"},null,null,null,null,null,null,null,null,null,null,null,null,null,0,{"$f":"TEXT(SUM(MID(0&P37,LARGE(ISNUMBER(-MID(P37,ROW($1:$88),1))*ROW($1:$88),ROW($1:$15)+15)+1,1)*10^ROW($1:$15)/10),REPT(0,MIN(MAX(COUNT(1/(MID(P37,ROW($1:$88),1)+1))-15,),15)))&TEXT(SUM(MID(0&P37,LARGE(ISNUMBER(-MID(P37,ROW($1:$88),1))*ROW($1:$88),ROW($1:$15))+1,1)*10^ROW($1:$15)/10),REPT(0,MIN(COUNT(1/(MID(P37,ROW($1:$88),1)+1)),15)))","v":"0"}]
["Телефон: ",{"$f":"B4","v":"7-707-695-04-76   0----   ----"},null,null,null,null,null,null,null,null,null,null,null,null,null,0,{"$f":"TEXT(SUM(MID(0&P38,LARGE(ISNUMBER(-MID(P38,ROW($1:$88),1))*ROW($1:$88),ROW($1:$15)+15)+1,1)*10^ROW($1:$15)/10),REPT(0,MIN(MAX(COUNT(1/(MID(P38,ROW($1:$88),1)+1))-15,),15)))&TEXT(SUM(MID(0&P38,LARGE(ISNUMBER(-MID(P38,ROW($1:$88),1))*ROW($1:$88),ROW($1:$15))+1,1)*10^ROW($1:$15)/10),REPT(0,MIN(COUNT(1/(MID(P38,ROW($1:$88),1)+1)),15)))","v":"0"}]
["Индекс: ",{"$f":"P16","v":""},null,null,null,null,null,null,null,null,null,null,null,null,null,null,{"$f":"IF(LEFT(#REF!,4)=\"ваша\",VALUE(MID(#REF!,13,20))*100,0)","v":{"$error":"#REF!"}}]
["Компания:",null,null,null,null,null,null,null,null,null,null,null,null,null,null,null,{"$f":"IF(LEFT(#REF!,4)=\"ваша\",VALUE(MID(#REF!,13,20))*100,0)","v":{"$error":"#REF!"}}]
["ИИН:",{"$f":"F29","v":10650},null,null,null,null,null,null,null,null,null,null,null,null,null,null,{"$f":"IF(LEFT(#REF!,4)=\"ваша\",VALUE(MID(#REF!,13,20))*100,0)","v":{"$error":"#REF!"}}]
["------------------------","----------------------------------------------------","----------------------------------------------------","------------------------","------------------------","---------------------------","------------------------------","------------------------","------------------------",null,null,null,null,null,null,null,{"$f":"SUM(Q19:Q41)","v":{"$error":"#REF!"}}]

{"sheet":"+KASPI+ 9633++0","index":11,"n_rows":42,"n_cols":21,"rows_kept":42,"cut":false,"hidden":false,"merged":[[27,6,27,8],[31,0,31,1],[37,1,37,2],[0,4,0,7],[1,4,1,8],[2,1,2,2],[3,1,3,2],[25,6,25,8],[26,6,26,8]]}
[{"$f":"IF(LEFT(C29,2)=\"сп\",P1&\" ► СП\",IF(E25=D26,P1,IF(H6<>0,P1&\"++\"&\"0\",IF(E25=D27,P1&\"++\"&\"0\",IF(E25=D28,P1&\"++\"&\"0\",IF(E25=D27,P1&\"++\"&\"0\",IF(E25=D28,P1&\"++\"&\"0\",IF(LEFT(C25,2)=\"AV\",P1&\"++\"&F29,P1))))))))","v":"+KASPI+ 9633++0"},{"$f":"L4","v":"2020-08-11T13:08:02"},{"$f":"IF(E2>0,\"ОТПРАВЛЕНО\",IF(LEFT(C29,3)=\"ЗАК\",\"ЗАКАЗАНО в СПБ\",IF(G24>=0,\"ОПЛОЧЕНО\",\"ОЖИДАНИЕ ОПЛАТЫ\")))","v":"ОТПРАВЛЕНО"},{"$f":"'СПИСОК ЗАКАЗОВ'!B1","v":21},"2020-08-11",null,null,null,{"$f":"A1","v":"+KASPI+ 9633++0"},null,"Заказ № 9633",null,null,null,null,{"$f":"IF(G24>0,\"+\"&H6&\"+\"&Q1,Q1)","v":"+KASPI+ 9633"},{"$f":"ПоискСКонца(K1,\"№\")","v":" 9633"}]
["Логин",{"$f":"L3","v":0},"Номер накл-ой",null,3611547,null,null,null,null,null,"Примечание"]
["ФИО",{"$f":"IF(C32=0,UPPER((P9)),UPPER(C33))","v":"СКРЕБЦОВ МАКСИМ"},null,null,null,null,null,null,null,null,"Логин"]
["Телефон",{"$f":"R12","v":"7-776-900-77-99   0----   ----"},null,null,{"$f":"IF(F4>0.5,\"оплачено\",IF(F4<0,\"ОПЛАТИТЬ= \"&G4,\"ОПЛАТИТЬ= \"&Q25))","v":"ОПЛАТИТЬ= 1400"},0,1100,null,null,null,"Дата заказа","2020-08-11T13:08:02"]
["e-mail:",{"$f":"L11","v":"-"}]
["Вес","ПРИМЕЧАНИЯ","Наименование","Кол-во","Цена","Всего",{"$f":"IF(MAX(G7:G25)>0,MAX(G7:G25),\"\")","v":"2020-08-21"},{"$f":"IF(I7>0,\"НАЛ\",IF(I8>0,\"ПЕРЕВОД\",IF(I9>0,\"Beeline\",IF(I10>0,\"KASPI\",IF(I11>0,\"QIWI\",IF(I12>0,\"СЧЁТ Альфа-Банк\",0))))))","v":"KASPI"},{"$f":"SUM(I7:I28)","v":6500}]
[{"$f":"IF(L24>0,Q24*1/100,\"\")","v":""},"списано",{"$f":"IF(L26<>\"\",K26,\"\")","v":"Неодимовый магнит D40x20mm(Аксиал)`42 (сила притяжения 60 кг)"},{"$f":"IF(L26>0,L26,\"\")","v":1},{"$f":"IF(M26=\"уточняйте\",0,IF(L26>0,M26,\"\"))","v":5100},{"$f":"IF(D7<>\"\",E7*D7,\"\")","v":5100},{"$f":"IF(I7 >0,TODAY(),\"\")","v":""},"НАЛ",null,{"$f":"IFERROR(IFERROR(VLOOKUP(C7,#REF!,3,0)*D7,VLOOKUP(C7,#REF!,7,0)*D7),\"нет веса\")","v":"нет веса"},"Заказ №9633"]
[{"$f":"IF(L25>0,Q25*1/100,\"\")","v":14},null,{"$f":"IF(L27<>\"\",K27,\"\")","v":""},{"$f":"IF(L27>0,L27,\"\")","v":""},{"$f":"IF(M27=\"уточняйте\",0,IF(L27>0,M27,\"\"))","v":""},"","","ПЕРЕВОД",null,{"$f":"IFERROR(IFERROR(VLOOKUP(C8,#REF!,3,0)*D8,VLOOKUP(C8,#REF!,7,0)*D8),\"нет веса\")","v":"нет веса"}]
[{"$f":"IF(L26>0,Q26*1/100,\"\")","v":1.88},null,"","","","","","Beeline",null,{"$f":"IFERROR(IFERROR(VLOOKUP(C9,#REF!,3,0)*D9,VLOOKUP(C9,#REF!,7,0)*D9),\"нет веса\")","v":"нет веса"},"Здравствуйте, Скребцов Максим",null,null,null,null,{"$f":"MID(K9,15,70)","v":"Скребцов Максим"},{"$f":"TEXT(SUM(MID(0&L9,LARGE(ISNUMBER(-MID(L9,ROW($1:$96),1))*ROW($1:$96),ROW($1:$23)+15)+1,1)*10^ROW($1:$23)/10),REPT(0,MIN(MAX(COUNT(1/(MID(L9,ROW($1:$96),1)+1))-15,),15)))&TEXT(SUM(MID(0&L9,LARGE(ISNUMBER(-MID(L9,ROW($1:$96),1))*ROW($1:$96),ROW($1:$23))+1,1)*10^ROW($1:$23)/10),REPT(0,MIN(COUNT(1/(MID(L9,ROW($1:$96),1)+1)),15)))","v":""}]
["",null,"","","","","2020-08-21","KASPI",{"$f":"F29","v":6500},{"$f":"IFERROR(IFERROR(VLOOKUP(C10,#REF!,3,0)*D10,VLOOKUP(C10,#REF!,7,0)*D10),\"нет веса\")","v":"нет веса"},"Мы получили Ваш заказ номер, 9633"]
["",null,"","","","","","QIWI",null,{"$f":"IFERROR(IFERROR(VLOOKUP(C11,#REF!,3,0)*D11,VLOOKUP(C11,#REF!,7,0)*D11),\"нет веса\")","v":"нет веса"},"Электронная почта:","-"]
["",null,"","","","","","СЧЁТ Альфа-Банк",null,{"$f":"IFERROR(IFERROR(VLOOKUP(C12,#REF!,3,0)*D12,VLOOKUP(C12,#REF!,7,0)*D12),\"нет веса\")","v":"нет веса"},"Контактный телефон:","+7 (776) 900-77-99",null,null,null,{"$f":"(L12&\"  \"&P13)","v":"+7 (776) 900-77-99  0"},{"$f":"TEXT(SUM(MID(0&P12,LARGE(ISNUMBER(-MID(P12,ROW($1:$99),1))*ROW($1:$99),ROW($1:$15)+30)+1,1)*10^ROW($1:$15)/10),REPT(0,MIN(MAX(COUNT(1/(MID(P12,ROW($1:$99),1)+1))-30,),15)))&TEXT(SUM(MID(0&P12,LARGE(ISNUMBER(-MID(P12,ROW($1:$99),1))*ROW($1:$99),ROW($1:$15)+15)+1,1)*10^ROW($1:$15)/10),REPT(0,MIN(MAX(COUNT(1/(MID(P12,ROW($1:$99),1)+1))-15,),15)))&TEXT(SUM(MID(0&P12,LARGE(ISNUMBER(-MID(P12,ROW($1:$99),1))*ROW($1:$99),ROW($1:$15))+1,1)*10^ROW($1:$15)/10),REPT(0,MIN(COUNT(1/(MID(P12,ROW($1:$99),1)+1)),15)))","v":"777690077990"},{"$f":"(MID(Q12,1,1))&\"-\"&(MID(Q12,2,3))&\"-\"&(MID(Q12,5,3))&\"-\"&(MID(Q12,8,2))&\"-\"&(MID(Q12,10,2))&\"   \"&(MID(Q12,12,1))&\"-\"&(MID(Q12,13,3))&\"-\"&(MID(Q12,16,3))&\"-\"&(MID(Q12,19,2))&\"-\"&(MID(Q12,21,2))&\"   \"&(MID(Q12,23,1))&\"-\"&(MID(Q12,24,3))&\"-\"&(MID(Q12,27,3))&\"-\"&(MID(Q12,30,2))&\"-\"&(MID(Q12,32,2))","v":"7-776-900-77-99   0----   ----"}]
["",null,"","","","","",null,null,{"$f":"IFERROR(IFERROR(VLOOKUP(C13,#REF!,3,0)*D13,VLOOKUP(C13,#REF!,7,0)*D13),\"нет веса\")","v":"нет веса"},"Доставка:","-",null,null,null,{"$f":"IF(L13=\"-\",IFERROR(НайтиСтрокуПоСлову(\"Комментарий\",K27:K60),0),L13)","v":0}]
["",null,"","","","","",null,null,{"$f":"IFERROR(IFERROR(VLOOKUP(C14,#REF!,3,0)*D14,VLOOKUP(C14,#REF!,7,0)*D14),\"нет веса\")","v":"нет веса"},"Оплата:","-",null,null,null,{"$f":"MID(L14,23,70)","v":""}]
["",null,"","","","","",null,null,{"$f":"IFERROR(IFERROR(VLOOKUP(C15,#REF!,3,0)*D15,VLOOKUP(C15,#REF!,7,0)*D15),\"нет веса\")","v":"нет веса"},null,null,null,null,null,{"$f":"IF(LEFT(P14,2)=\"EX\",MID(L15,11,70),L15)","v":0},{"$f":"TEXT(SUM(MID(0&P15,LARGE(ISNUMBER(-MID(P15,ROW($1:$88),1))*ROW($1:$88),ROW($1:$15)+15)+1,1)*10^ROW($1:$15)/10),REPT(0,MIN(MAX(COUNT(1/(MID(P15,ROW($1:$88),1)+1))-15,),15)))&TEXT(SUM(MID(0&P15,LARGE(ISNUMBER(-MID(P15,ROW($1:$88),1))*ROW($1:$88),ROW($1:$15))+1,1)*10^ROW($1:$15)/10),REPT(0,MIN(COUNT(1/(MID(P15,ROW($1:$88),1)+1)),15)))","v":"0"},{"$f":"SUMPRODUCT(--SUBSTITUTE(Q15:Q15,CHAR(160),))","v":0},{"$f":"LEN(Q15)","v":1},{"$f":"FLOOR(S15/3,1)","v":0}]
["",null,"","","","","",null,null,{"$f":"IFERROR(IFERROR(VLOOKUP(C16,#REF!,3,0)*D16,VLOOKUP(C16,#REF!,7,0)*D16),\"нет веса\")","v":"нет веса"},"Адрес доставки:","Индекс:",null,null,null,{"$f":"MID(L16,9,70)","v":""}]
["",null,"","","","","",null,null,{"$f":"IFERROR(IFERROR(VLOOKUP(C17,#REF!,3,0)*D17,VLOOKUP(C17,#REF!,7,0)*D17),\"нет веса\")","v":"нет веса"},null,"Страна:",null,null,null,{"$f":"MID(L17,9,70)","v":""},{"$f":"IF(LEFT(K17,4)=\"ваша\",VALUE(MID(K17,13,20))*100,0)","v":0}]
["",null,"","","","","",null,null,{"$f":"IFERROR(IFERROR(VLOOKUP(C18,#REF!,3,0)*D18,VLOOKUP(C18,#REF!,7,0)*D18),\"нет веса\")","v":"нет веса"},null,"Область:",null,null,null,{"$f":"MID(L18,10,70)","v":""}]
["",null,"","","","","",null,null,{"$f":"IFERROR(IFERROR(VLOOKUP(C19,#REF!,3,0)*D19,VLOOKUP(C19,#REF!,7,0)*D19),\"нет веса\")","v":"нет веса"},null,"Город: Усть-Каменогорск",null,null,null,{"$f":"MID(L19,8,70)","v":"Усть-Каменогорск"},{"$f":"IF(LEFT(K19,4)=\"ваша\",VALUE(MID(K19,13,20))*100,0)","v":0}]
["",null,"","","","","",null,null,{"$f":"IFERROR(IFERROR(VLOOKUP(C20,#REF!,3,0)*D20,VLOOKUP(C20,#REF!,7,0)*D20),\"нет веса\")","v":"нет веса"},null,"Улица: Амурская",null,null,null,{"$f":"MID(L20,8,70)","v":"Амурская"},{"$f":"IF(LEFT(K31,4)=\"ваша\",VALUE(MID(K31,13,20))*100,0)","v":0}]
["",null,"","","","","",null,null,{"$f":"IFERROR(IFERROR(VLOOKUP(C21,#REF!,3,0)*D21,VLOOKUP(C21,#REF!,7,0)*D21),\"нет веса\")","v":"нет веса"},null,"Здание: 18",null,null,null,{"$f":"MID(L21,9,70)","v":"18"},{"$f":"IF(LEFT(K32,4)=\"ваша\",VALUE(MID(K32,13,20))*100,0)","v":0}]
["",null,"","","","","",null,null,{"$f":"IFERROR(IFERROR(VLOOKUP(C22,#REF!,3,0)*D22,VLOOKUP(C22,#REF!,7,0)*D22),\"нет веса\")","v":"нет веса"},null,"Квартира: 62",null,null,null,{"$f":"MID(L22,11,70)","v":"62"},{"$f":"IF(LEFT(#REF!,4)=\"ваша\",VALUE(MID(#REF!,13,20))*100,0)","v":{"$error":"#REF!"}}]
["",null,null,null,"Итого:",{"$f":"SUM(F7:F22)","v":5100},"",null,null,{"$f":"IF(K40>0,M40,\"\")","v":""},"Комментарий :",null,null,null,null,null,{"$f":"IF(LEFT(K33,4)=\"ваша\",VALUE(MID(K33,13,20))*100,0)","v":0}]
[{"$f":"IF(L41>0,N41,\"\")","v":""},null,null,"скидка:",{"$f":"IF(F23>150000,10,IF(F23>100000,8,IF(F23>60000,5,IF(F23>30000,3,0))))","v":0},{"$f":"F23-(F23*E24/100)","v":5100},{"$f":"IFERROR(SUM(I7:I22)-F29+1,0)","v":1},null,null,null,null,null,null,null,null,{"$f":"N24","v":0},{"$f":"TEXT(SUM(MID(0&P24,LARGE(ISNUMBER(-MID(P24,ROW($1:$88),1))*ROW($1:$88),ROW($1:$15)+15)+1,1)*10^ROW($1:$15)/10),REPT(0,MIN(MAX(COUNT(1/(MID(P24,ROW($1:$88),1)+1))-15,),15)))&TEXT(SUM(MID(0&P24,LARGE(ISNUMBER(-MID(P24,ROW($1:$88),1))*ROW($1:$88),ROW($1:$15))+1,1)*10^ROW($1:$15)/10),REPT(0,MIN(COUNT(1/(MID(P24,ROW($1:$88),1)+1)),15)))","v":"0"}]
[{"$f":"SUM(A7:A23)/1000*1.3","v":2.0643999999999999E-2},null,{"$f":"IF(E25=F26,\"Доставка БЕСПЛАТНО\",IF(E25=D26,C26,IF(E25=D27,C27,IF(E25=D28,C28,IF(E25=F27,C27&\" + НПл\",IF(E25=F28,C28&\" + НПл\",\"Укажите ТК\"))))))","v":"AVIS EXPRESS  Усть-Каменогорск"},2,{"$f":"D28","v":1400},null,{"$f":"IF(I25 >0,TODAY(),\"\")","v":""},null,null,{"$f":"SUM(J7:J22)/1000","v":0},"Наименование","Количество","Цена","Вес","Всего",{"$f":"E25","v":1400},{"$f":"TEXT(SUM(MID(0&P25,LARGE(ISNUMBER(-MID(P25,ROW($1:$88),1))*ROW($1:$88),ROW($1:$15)+15)+1,1)*10^ROW($1:$15)/10),REPT(0,MIN(MAX(COUNT(1/(MID(P25,ROW($1:$88),1)+1))-15,),15)))&TEXT(SUM(MID(0&P25,LARGE(ISNUMBER(-MID(P25,ROW($1:$88),1))*ROW($1:$88),ROW($1:$15))+1,1)*10^ROW($1:$15)/10),REPT(0,MIN(COUNT(1/(MID(P25,ROW($1:$88),1)+1)),15)))","v":"1400"},{"$f":"E25","v":1400},{"$f":"TEXT(SUM(MID(0&R25,LARGE(ISNUMBER(-MID(R25,ROW($1:$88),1))*ROW($1:$88),ROW($1:$15)+15)+1,1)*10^ROW($1:$15)/10),REPT(0,MIN(MAX(COUNT(1/(MID(R25,ROW($1:$88),1)+1))-15,),15)))&TEXT(SUM(MID(0&R25,LARGE(ISNUMBER(-MID(R25,ROW($1:$88),1))*ROW($1:$88),ROW($1:$15))+1,1)*10^ROW($1:$15)/10),REPT(0,MIN(COUNT(1/(MID(R25,ROW($1:$88),1)+1)),15)))","v":"1400"},null,{"$f":"TEXT(SUM(MID(0&E25,LARGE(ISNUMBER(-MID(E25,ROW($1:$88),1))*ROW($1:$88),ROW($1:$15)+15)+1,1)*10^ROW($1:$15)/10),REPT(0,MIN(MAX(COUNT(1/(MID(E25,ROW($1:$88),1)+1))-15,),15)))&TEXT(SUM(MID(0&E25,LARGE(ISNUMBER(-MID(E25,ROW($1:$88),1))*ROW($1:$88),ROW($1:$15))+1,1)*10^ROW($1:$15)/10),REPT(0,MIN(COUNT(1/(MID(E25,ROW($1:$88),1)+1)),15)))","v":{"$error":"#NUM!"}}]
[null,null,{"$f":"IFERROR(\"AVIS С А М О В Ы В О З \"&\"  \"&VLOOKUP((LEFT(B34,(LEN(B34)))),'ТАРИФЫ ТК'!J17:L268,1,0),\"НЕТ ДОСТАВКИ\")","v":"AVIS С А М О В Ы В О З   Усть-Каменогорск"},{"$f":"IFERROR(VLOOKUP((LEFT(B34,(LEN(B34)))),'ТАРИФЫ ТК'!J17:L268,3,0)+0.001,\"НЕТ ДОСТАВКИ\")","v":1550.001},{"$f":"IFERROR(F24+D26,\"НЕТ ДОСТАВКИ\")","v":6650.0010000000002},{"$f":"IFERROR(D26&\" + НПл\",\"НЕТ ДОСТАВКИ\")","v":"1550,001 + НПл"},{"$f":"IFERROR(CEILING((F24+D26)*(1+$D$25/100),50),0)","v":6800},null,null,null,"Неодимовый магнит D40x20mm(Аксиал)`42 (сила притяжения 60 кг)",1,5100,188,5100,{"$f":"N26","v":188},{"$f":"TEXT(SUM(MID(0&P26,LARGE(ISNUMBER(-MID(P26,ROW($1:$88),1))*ROW($1:$88),ROW($1:$15)+15)+1,1)*10^ROW($1:$15)/10),REPT(0,MIN(MAX(COUNT(1/(MID(P26,ROW($1:$88),1)+1))-15,),15)))&TEXT(SUM(MID(0&P26,LARGE(ISNUMBER(-MID(P26,ROW($1:$88),1))*ROW($1:$88),ROW($1:$15))+1,1)*10^ROW($1:$15)/10),REPT(0,MIN(COUNT(1/(MID(P26,ROW($1:$88),1)+1)),15)))","v":"188"}]
[null,null,{"$f":"IFERROR(\"AVIS Econom\"&\"  \"&VLOOKUP((LEFT(B34,(LEN(B34)))),'ТАРИФЫ ТК'!A4:A134,1,0),\"НЕТ ДОСТАВКИ\")","v":"AVIS Econom  Усть-Каменогорск"},{"$f":"IFERROR(VLOOKUP((LEFT(B34,(LEN(B34)))),'ТАРИФЫ ТК'!A4:C134,3,0),\"НЕТ ДОСТАВКИ\")","v":1300},{"$f":"IFERROR(F24+D27,\"НЕТ ДОСТАВКИ\")","v":6400},{"$f":"IFERROR(D27&\" + НПл\",\"НЕТ ДОСТАВКИ\")","v":"1300 + НПл"},{"$f":"IFERROR(CEILING((F24+D27)*(1+$D$25/100),50),0)","v":6550},null,null,null,"Общий вес:188",null,null,null,null,0,{"$f":"TEXT(SUM(MID(0&P27,LARGE(ISNUMBER(-MID(P27,ROW($1:$88),1))*ROW($1:$88),ROW($1:$15)+15)+1,1)*10^ROW($1:$15)/10),REPT(0,MIN(MAX(COUNT(1/(MID(P27,ROW($1:$88),1)+1))-15,),15)))&TEXT(SUM(MID(0&P27,LARGE(ISNUMBER(-MID(P27,ROW($1:$88),1))*ROW($1:$88),ROW($1:$15))+1,1)*10^ROW($1:$15)/10),REPT(0,MIN(COUNT(1/(MID(P27,ROW($1:$88),1)+1)),15)))","v":"0"}]
[null,null,{"$f":"IFERROR(IF(A29<1,\"AVIS EXPRESS\"&\"  \"&VLOOKUP((LEFT(B34,(LEN(B34)))),'ТАРИФЫ ТК'!E4:G20,1,0),\"AV ВИМАНИЕ:   В Е С    П О С Ы Л К И    Б О Л Ь Ш Е   0,5 КГ   !!!\"),\"НЕТ ДОСТАВКИ\")","v":"AVIS EXPRESS  Усть-Каменогорск"},{"$f":"IFERROR(VLOOKUP((LEFT(B34,(LEN(B34)))),'ТАРИФЫ ТК'!E4:G20,3,0),\"НЕТ ДОСТАВКИ\")","v":1400},{"$f":"IFERROR(F24+D28,\"НЕТ ДОСТАВКИ\")","v":6500},{"$f":"D28&\" + НПл\"","v":"1400 + НПл"},{"$f":"IFERROR(CEILING((F24+D28)*(1+$D$25/100),50),\"НЕТ ДОСТАВКИ\")","v":6650},null,null,null,"Итого:5100",null,null,null,null,0,{"$f":"TEXT(SUM(MID(0&P28,LARGE(ISNUMBER(-MID(P28,ROW($1:$88),1))*ROW($1:$88),ROW($1:$15)+15)+1,1)*10^ROW($1:$15)/10),REPT(0,MIN(MAX(COUNT(1/(MID(P28,ROW($1:$88),1)+1))-15,),15)))&TEXT(SUM(MID(0&P28,LARGE(ISNUMBER(-MID(P28,ROW($1:$88),1))*ROW($1:$88),ROW($1:$15))+1,1)*10^ROW($1:$15)/10),REPT(0,MIN(COUNT(1/(MID(P28,ROW($1:$88),1)+1)),15)))","v":"0"}]
[{"$f":"IFERROR(A25*1.5,\"Количество ??\")","v":3.0966E-2},null,null,"К ОПЛАТЕ:",{"$f":"IFERROR(F24+E25,0)","v":6500},{"$f":"IF(E25=C29,\"Доставка БЕСПЛАТНО\",IF(E25=D26,E26,IF(E25=D27,E27,IF(E25=D28,E28,IF(E25=F27,G27,IF(E25=F28,G28,IF(E25=F26,G26,\"Укажите ТК\")))))))","v":6500},{"$f":"IFERROR(CEILING((F24+E25)*1.03,50),0)","v":6700},null,null,{"$f":"IFERROR(J25*1.5,\"Количество ??\")","v":0},null,null,null,null,null,0,{"$f":"TEXT(SUM(MID(0&P29,LARGE(ISNUMBER(-MID(P29,ROW($1:$88),1))*ROW($1:$88),ROW($1:$15)+15)+1,1)*10^ROW($1:$15)/10),REPT(0,MIN(MAX(COUNT(1/(MID(P29,ROW($1:$88),1)+1))-15,),15)))&TEXT(SUM(MID(0&P29,LARGE(ISNUMBER(-MID(P29,ROW($1:$88),1))*ROW($1:$88),ROW($1:$15))+1,1)*10^ROW($1:$15)/10),REPT(0,MIN(COUNT(1/(MID(P29,ROW($1:$88),1)+1)),15)))","v":"0"}]
["rc11091kz",null,{"$f":"IFERROR((P14&\"        \"&LEFT(P15,8)&\" = \"&TEXT(R15,\"### ### ###\")&\" т.\"),\"НЕТ ДОСТАВКИ\")","v":"        0 =  т."},null,{"$f":"IFERROR(\"QIWI = \"&CEILING((E26*1.02),10),0)","v":"QIWI = 6790"},{"$f":"IFERROR(F29-F24,\"УКАЖИТЕ ТК\")","v":1400},null,null,null,null,null,null,null,null,null,0,{"$f":"TEXT(SUM(MID(0&P30,LARGE(ISNUMBER(-MID(P30,ROW($1:$88),1))*ROW($1:$88),ROW($1:$15)+15)+1,1)*10^ROW($1:$15)/10),REPT(0,MIN(MAX(COUNT(1/(MID(P30,ROW($1:$88),1)+1))-15,),15)))&TEXT(SUM(MID(0&P30,LARGE(ISNUMBER(-MID(P30,ROW($1:$88),1))*ROW($1:$88),ROW($1:$15))+1,1)*10^ROW($1:$15)/10),REPT(0,MIN(COUNT(1/(MID(P30,ROW($1:$88),1)+1)),15)))","v":"0"}]
[{"$f":"A1","v":"+KASPI+ 9633++0"},"ПОЛУЧАТЕЛЬ:","rc11091kz",null,null,null,null,null,null,null,null,null,null,null,null,0,{"$f":"TEXT(SUM(MID(0&P31,LARGE(ISNUMBER(-MID(P31,ROW($1:$88),1))*ROW($1:$88),ROW($1:$15)+15)+1,1)*10^ROW($1:$15)/10),REPT(0,MIN(MAX(COUNT(1/(MID(P31,ROW($1:$88),1)+1))-15,),15)))&TEXT(SUM(MID(0&P31,LARGE(ISNUMBER(-MID(P31,ROW($1:$88),1))*ROW($1:$88),ROW($1:$15))+1,1)*10^ROW($1:$15)/10),REPT(0,MIN(COUNT(1/(MID(P31,ROW($1:$88),1)+1)),15)))","v":"0"}]
[{"$f":"UPPER((B3))","v":"СКРЕБЦОВ МАКСИМ"},null,{"$f":"IFERROR(MID(НайтиСтрокуПоСлову(\"Комментарий: Имя :\",K1:K45),20,99),0)","v":0},null,null,null,null,null,null,null,"Назад",null,null,null,null,0,{"$f":"TEXT(SUM(MID(0&P32,LARGE(ISNUMBER(-MID(P32,ROW($1:$88),1))*ROW($1:$88),ROW($1:$15)+15)+1,1)*10^ROW($1:$15)/10),REPT(0,MIN(MAX(COUNT(1/(MID(P32,ROW($1:$88),1)+1))-15,),15)))&TEXT(SUM(MID(0&P32,LARGE(ISNUMBER(-MID(P32,ROW($1:$88),1))*ROW($1:$88),ROW($1:$15))+1,1)*10^ROW($1:$15)/10),REPT(0,MIN(COUNT(1/(MID(P32,ROW($1:$88),1)+1)),15)))","v":"0"}]
["Область: ",{"$f":"UPPER((P18))","v":""},{"$f":"IFERROR(ПоискСНачала(C32,\"Телефон\"),0)","v":0},null,{"$f":"IFERROR(ПоискМежду(C32,\"Телефон :\",\"Примечание\"),0)","v":0},{"$f":"IFERROR(IF(LEFT(ПоискСКонца(C32,\"Примечание : \"),2)=\"г \",MID(ПоискСКонца(C32,\"Примечание : \"),3,99),IF(LEFT(ПоискСКонца(C32,\"Примечание : \"),3)=\"г. \",MID(ПоискСКонца(C32,\"Примечание : \"),4,99),IF(LEFT(ПоискСКонца(C32,\"Примечание : \"),3)=\"гор\",MID(ПоискСКонца(C32,\"Примечание : \"),6,99),0))),0)","v":0},null,null,null,null,null,null,null,null,null,0,{"$f":"TEXT(SUM(MID(0&P33,LARGE(ISNUMBER(-MID(P33,ROW($1:$88),1))*ROW($1:$88),ROW($1:$15)+15)+1,1)*10^ROW($1:$15)/10),REPT(0,MIN(MAX(COUNT(1/(MID(P33,ROW($1:$88),1)+1))-15,),15)))&TEXT(SUM(MID(0&P33,LARGE(ISNUMBER(-MID(P33,ROW($1:$88),1))*ROW($1:$88),ROW($1:$15))+1,1)*10^ROW($1:$15)/10),REPT(0,MIN(COUNT(1/(MID(P33,ROW($1:$88),1)+1)),15)))","v":"0"}]
["Город: ",{"$f":"UPPER((P19))","v":"УСТЬ-КАМЕНОГОРСК"},null,null,null,null,null,null,null,null,null,null,null,null,null,0,{"$f":"TEXT(SUM(MID(0&P34,LARGE(ISNUMBER(-MID(P34,ROW($1:$88),1))*ROW($1:$88),ROW($1:$15)+15)+1,1)*10^ROW($1:$15)/10),REPT(0,MIN(MAX(COUNT(1/(MID(P34,ROW($1:$88),1)+1))-15,),15)))&TEXT(SUM(MID(0&P34,LARGE(ISNUMBER(-MID(P34,ROW($1:$88),1))*ROW($1:$88),ROW($1:$15))+1,1)*10^ROW($1:$15)/10),REPT(0,MIN(COUNT(1/(MID(P34,ROW($1:$88),1)+1)),15)))","v":"0"}]
["Улица: ",{"$f":"UPPER((P20))","v":"АМУРСКАЯ"},null,null,null,null,null,null,null,null,null,null,null,null,null,0,{"$f":"TEXT(SUM(MID(0&P35,LARGE(ISNUMBER(-MID(P35,ROW($1:$88),1))*ROW($1:$88),ROW($1:$15)+15)+1,1)*10^ROW($1:$15)/10),REPT(0,MIN(MAX(COUNT(1/(MID(P35,ROW($1:$88),1)+1))-15,),15)))&TEXT(SUM(MID(0&P35,LARGE(ISNUMBER(-MID(P35,ROW($1:$88),1))*ROW($1:$88),ROW($1:$15))+1,1)*10^ROW($1:$15)/10),REPT(0,MIN(COUNT(1/(MID(P35,ROW($1:$88),1)+1)),15)))","v":"0"}]
["Здание: ",{"$f":"P21","v":"18"},null,null,null,null,null,null,null,null,null,null,null,null,null,0,{"$f":"TEXT(SUM(MID(0&P36,LARGE(ISNUMBER(-MID(P36,ROW($1:$88),1))*ROW($1:$88),ROW($1:$15)+15)+1,1)*10^ROW($1:$15)/10),REPT(0,MIN(MAX(COUNT(1/(MID(P36,ROW($1:$88),1)+1))-15,),15)))&TEXT(SUM(MID(0&P36,LARGE(ISNUMBER(-MID(P36,ROW($1:$88),1))*ROW($1:$88),ROW($1:$15))+1,1)*10^ROW($1:$15)/10),REPT(0,MIN(COUNT(1/(MID(P36,ROW($1:$88),1)+1)),15)))","v":"0"}]
["Квартира: ",{"$f":"P22","v":"62"},null,null,null,null,null,null,null,null,null,null,null,null,null,0,{"$f":"TEXT(SUM(MID(0&P37,LARGE(ISNUMBER(-MID(P37,ROW($1:$88),1))*ROW($1:$88),ROW($1:$15)+15)+1,1)*10^ROW($1:$15)/10),REPT(0,MIN(MAX(COUNT(1/(MID(P37,ROW($1:$88),1)+1))-15,),15)))&TEXT(SUM(MID(0&P37,LARGE(ISNUMBER(-MID(P37,ROW($1:$88),1))*ROW($1:$88),ROW($1:$15))+1,1)*10^ROW($1:$15)/10),REPT(0,MIN(COUNT(1/(MID(P37,ROW($1:$88),1)+1)),15)))","v":"0"}]
["Телефон: ",{"$f":"B4","v":"7-776-900-77-99   0----   ----"},null,null,null,null,null,null,null,null,null,null,null,null,null,0,{"$f":"TEXT(SUM(MID(0&P38,LARGE(ISNUMBER(-MID(P38,ROW($1:$88),1))*ROW($1:$88),ROW($1:$15)+15)+1,1)*10^ROW($1:$15)/10),REPT(0,MIN(MAX(COUNT(1/(MID(P38,ROW($1:$88),1)+1))-15,),15)))&TEXT(SUM(MID(0&P38,LARGE(ISNUMBER(-MID(P38,ROW($1:$88),1))*ROW($1:$88),ROW($1:$15))+1,1)*10^ROW($1:$15)/10),REPT(0,MIN(COUNT(1/(MID(P38,ROW($1:$88),1)+1)),15)))","v":"0"}]
["Индекс: ",{"$f":"P16","v":""},null,null,null,null,null,null,null,null,null,null,null,null,null,null,{"$f":"IF(LEFT(#REF!,4)=\"ваша\",VALUE(MID(#REF!,13,20))*100,0)","v":{"$error":"#REF!"}}]
["Компания:",null,null,null,null,null,null,null,null,null,null,null,null,null,null,null,{"$f":"IF(LEFT(#REF!,4)=\"ваша\",VALUE(MID(#REF!,13,20))*100,0)","v":{"$error":"#REF!"}}]
["ИИН:",{"$f":"F29","v":6500},null,null,null,null,null,null,null,null,null,null,null,null,null,null,{"$f":"IF(LEFT(#REF!,4)=\"ваша\",VALUE(MID(#REF!,13,20))*100,0)","v":{"$error":"#REF!"}}]
["------------------------","----------------------------------------------------","----------------------------------------------------","------------------------","------------------------","---------------------------","------------------------------","------------------------","------------------------",null,null,null,null,null,null,null,{"$f":"SUM(Q19:Q41)","v":{"$error":"#REF!"}}]

{"sheet":"+СЧЁТ Альфа-Банк+Сч0608++0","index":12,"n_rows":42,"n_cols":21,"rows_kept":42,"cut":false,"hidden":false,"merged":[[27,6,27,8],[31,0,31,1],[37,1,37,2],[0,4,0,7],[1,4,1,8],[2,1,2,2],[3,1,3,2],[25,6,25,8],[26,6,26,8]]}
[{"$f":"IF(LEFT(C29,2)=\"сп\",P1&\" ► СП\",IF(E25=D26,P1,IF(H6<>0,P1&\"++\"&\"0\",IF(E25=D27,P1&\"++\"&\"0\",IF(E25=D28,P1&\"++\"&\"0\",IF(E25=D27,P1&\"++\"&\"0\",IF(E25=D28,P1&\"++\"&\"0\",IF(LEFT(C25,2)=\"AV\",P1&\"++\"&F29,P1))))))))","v":"+СЧЁТ Альфа-Банк+Сч0608++0"},"2020-08-06",{"$f":"IF(E2>0,\"ОТПРАВЛЕНО\",IF(LEFT(C29,3)=\"ЗАК\",\"ЗАКАЗАНО в СПБ\",IF(G24>=0,\"ОПЛОЧЕНО\",\"ОЖИДАНИЕ ОПЛАТЫ\")))","v":"ОТПРАВЛЕНО"},{"$f":"'СПИСОК ЗАКАЗОВ'!B1","v":21},"2020-08-10",null,null,null,{"$f":"A1","v":"+СЧЁТ Альфа-Банк+Сч0608++0"},null,"Сч0608",null,null,null,null,{"$f":"IF(G24>0,\"+\"&H6&\"+\"&Q1,Q1)","v":"+СЧЁТ Альфа-Банк+Сч0608"},{"$f":"ПоискСКонца(K1,\"№\")","v":"Сч0608"}]
["Логин",{"$f":"L3","v":"Логин"},"Номер накл-ой",null,3611544,null,null,null,null,null,"Примечание"]
["ФИО",{"$f":"IF(C32=0,UPPER((P9)),UPPER(C33))","v":"ТОО «РОДАМИН»"},null,null,null,null,null,null,null,null,"Логин","Логин"]
["Телефон",{"$f":"R12","v":"8-701-517-14-04   0----   ----"},null,null,{"$f":"IF(F4>0.5,\"оплачено\",IF(F4<0,\"ОПЛАТИТЬ= \"&G4,\"ОПЛАТИТЬ= \"&Q25))","v":"ОПЛАТИТЬ= 3300"},0,1100,null,null,null,"Дата заказа","дата заказа"]
["e-mail:",{"$f":"L11","v":"мыло"}]
["Вес","ПРИМЕЧАНИЯ","Наименование","Кол-во","Цена","Всего",{"$f":"IF(MAX(G7:G25)>0,MAX(G7:G25),\"\")","v":"2020-08-21"},{"$f":"IF(I7>0,\"НАЛ\",IF(I8>0,\"ПЕРЕВОД\",IF(I9>0,\"Beeline\",IF(I10>0,\"KASPI\",IF(I11>0,\"QIWI\",IF(I12>0,\"СЧЁТ Альфа-Банк\",0))))))","v":"СЧЁТ Альфа-Банк"},{"$f":"SUM(I7:I28)","v":220400}]
[{"$f":"IF(L24>0,Q24*1/100,\"\")","v":""},"списано","Неодимовый магнит D10x1mm(Аксиал)`42 (сила притяжения 1 кг)",8000,30,{"$f":"IF(D7<>\"\",E7*D7,\"\")","v":240000},{"$f":"IF(I7 >0,TODAY(),\"\")","v":""},"НАЛ",null,{"$f":"IFERROR(IFERROR(VLOOKUP(C7,#REF!,3,0)*D7,VLOOKUP(C7,#REF!,7,0)*D7),\"нет веса\")","v":"нет веса"},"Заказ №2080"]
[{"$f":"IF(L25>0,Q25*1/100,\"\")","v":""},null,{"$f":"IF(L27<>\"\",K27,\"\")","v":""},{"$f":"IF(L27>0,L27,\"\")","v":""},{"$f":"IF(M27=\"уточняйте\",0,IF(L27>0,M27,\"\"))","v":""},"","","ПЕРЕВОД",null,{"$f":"IFERROR(IFERROR(VLOOKUP(C8,#REF!,3,0)*D8,VLOOKUP(C8,#REF!,7,0)*D8),\"нет веса\")","v":"нет веса"}]
[{"$f":"IF(L26>0,Q26*1/100,\"\")","v":""},null,"","","","","","Beeline",null,{"$f":"IFERROR(IFERROR(VLOOKUP(C9,#REF!,3,0)*D9,VLOOKUP(C9,#REF!,7,0)*D9),\"нет веса\")","v":"нет веса"},"Здравствуйте, ТОО «РОДАМИН»",null,null,null,null,{"$f":"MID(K9,15,70)","v":"ТОО «РОДАМИН»"},{"$f":"TEXT(SUM(MID(0&L9,LARGE(ISNUMBER(-MID(L9,ROW($1:$96),1))*ROW($1:$96),ROW($1:$23)+15)+1,1)*10^ROW($1:$23)/10),REPT(0,MIN(MAX(COUNT(1/(MID(L9,ROW($1:$96),1)+1))-15,),15)))&TEXT(SUM(MID(0&L9,LARGE(ISNUMBER(-MID(L9,ROW($1:$96),1))*ROW($1:$96),ROW($1:$23))+1,1)*10^ROW($1:$23)/10),REPT(0,MIN(COUNT(1/(MID(L9,ROW($1:$96),1)+1)),15)))","v":""}]
["",null,"","","","","","KASPI",null,{"$f":"IFERROR(IFERROR(VLOOKUP(C10,#REF!,3,0)*D10,VLOOKUP(C10,#REF!,7,0)*D10),\"нет веса\")","v":"нет веса"},"Мы получили Ваш заказ номер, 2080"]
["",null,"","","","","","QIWI",null,{"$f":"IFERROR(IFERROR(VLOOKUP(C11,#REF!,3,0)*D11,VLOOKUP(C11,#REF!,7,0)*D11),\"нет веса\")","v":"нет веса"},"Электронная почта","мыло"]
["",null,"","","","","2020-08-21","СЧЁТ Альфа-Банк",{"$f":"F29","v":220400},{"$f":"IFERROR(IFERROR(VLOOKUP(C12,#REF!,3,0)*D12,VLOOKUP(C12,#REF!,7,0)*D12),\"нет веса\")","v":"нет веса"},"Контактный телефон","87015171404",null,null,null,{"$f":"(L12&\"  \"&P13)","v":"87015171404  0"},{"$f":"TEXT(SUM(MID(0&P12,LARGE(ISNUMBER(-MID(P12,ROW($1:$99),1))*ROW($1:$99),ROW($1:$15)+30)+1,1)*10^ROW($1:$15)/10),REPT(0,MIN(MAX(COUNT(1/(MID(P12,ROW($1:$99),1)+1))-30,),15)))&TEXT(SUM(MID(0&P12,LARGE(ISNUMBER(-MID(P12,ROW($1:$99),1))*ROW($1:$99),ROW($1:$15)+15)+1,1)*10^ROW($1:$15)/10),REPT(0,MIN(MAX(COUNT(1/(MID(P12,ROW($1:$99),1)+1))-15,),15)))&TEXT(SUM(MID(0&P12,LARGE(ISNUMBER(-MID(P12,ROW($1:$99),1))*ROW($1:$99),ROW($1:$15))+1,1)*10^ROW($1:$15)/10),REPT(0,MIN(COUNT(1/(MID(P12,ROW($1:$99),1)+1)),15)))","v":"870151714040"},{"$f":"(MID(Q12,1,1))&\"-\"&(MID(Q12,2,3))&\"-\"&(MID(Q12,5,3))&\"-\"&(MID(Q12,8,2))&\"-\"&(MID(Q12,10,2))&\"   \"&(MID(Q12,12,1))&\"-\"&(MID(Q12,13,3))&\"-\"&(MID(Q12,16,3))&\"-\"&(MID(Q12,19,2))&\"-\"&(MID(Q12,21,2))&\"   \"&(MID(Q12,23,1))&\"-\"&(MID(Q12,24,3))&\"-\"&(MID(Q12,27,3))&\"-\"&(MID(Q12,30,2))&\"-\"&(MID(Q12,32,2))","v":"8-701-517-14-04   0----   ----"}]
["",null,"","","","","",null,null,{"$f":"IFERROR(IFERROR(VLOOKUP(C13,#REF!,3,0)*D13,VLOOKUP(C13,#REF!,7,0)*D13),\"нет веса\")","v":"нет веса"},null,null,null,null,null,{"$f":"IF(L13=\"-\",IFERROR(НайтиСтрокуПоСлову(\"Комментарий\",K27:K60),0),L13)","v":0}]
["",null,"","","","","",null,null,{"$f":"IFERROR(IFERROR(VLOOKUP(C14,#REF!,3,0)*D14,VLOOKUP(C14,#REF!,7,0)*D14),\"нет веса\")","v":"нет веса"},"Доставка:",null,null,null,null,{"$f":"MID(L14,23,70)","v":""}]
["",null,"","","","","",null,null,{"$f":"IFERROR(IFERROR(VLOOKUP(C15,#REF!,3,0)*D15,VLOOKUP(C15,#REF!,7,0)*D15),\"нет веса\")","v":"нет веса"},"Оплата:",null,null,null,null,{"$f":"IF(LEFT(P14,2)=\"EX\",MID(L15,11,70),L15)","v":0},{"$f":"TEXT(SUM(MID(0&P15,LARGE(ISNUMBER(-MID(P15,ROW($1:$88),1))*ROW($1:$88),ROW($1:$15)+15)+1,1)*10^ROW($1:$15)/10),REPT(0,MIN(MAX(COUNT(1/(MID(P15,ROW($1:$88),1)+1))-15,),15)))&TEXT(SUM(MID(0&P15,LARGE(ISNUMBER(-MID(P15,ROW($1:$88),1))*ROW($1:$88),ROW($1:$15))+1,1)*10^ROW($1:$15)/10),REPT(0,MIN(COUNT(1/(MID(P15,ROW($1:$88),1)+1)),15)))","v":"0"},{"$f":"SUMPRODUCT(--SUBSTITUTE(Q15:Q15,CHAR(160),))","v":0},{"$f":"LEN(Q15)","v":1},{"$f":"FLOOR(S15/3,1)","v":0}]
["",null,"","","","","",null,null,{"$f":"IFERROR(IFERROR(VLOOKUP(C16,#REF!,3,0)*D16,VLOOKUP(C16,#REF!,7,0)*D16),\"нет веса\")","v":"нет веса"},"Адрес доставки","Индекс: ",null,null,null,{"$f":"MID(L16,9,70)","v":""}]
["",null,"","","","","",null,null,{"$f":"IFERROR(IFERROR(VLOOKUP(C17,#REF!,3,0)*D17,VLOOKUP(C17,#REF!,7,0)*D17),\"нет веса\")","v":"нет веса"},null,"Страна: ",null,null,null,{"$f":"MID(L17,9,70)","v":""},{"$f":"IF(LEFT(K17,4)=\"ваша\",VALUE(MID(K17,13,20))*100,0)","v":0}]
["",null,"","","","","",null,null,{"$f":"IFERROR(IFERROR(VLOOKUP(C18,#REF!,3,0)*D18,VLOOKUP(C18,#REF!,7,0)*D18),\"нет веса\")","v":"нет веса"},null,"Область: ",null,null,null,{"$f":"MID(L18,10,70)","v":""}]
["",null,"","","","","",null,null,{"$f":"IFERROR(IFERROR(VLOOKUP(C19,#REF!,3,0)*D19,VLOOKUP(C19,#REF!,7,0)*D19),\"нет веса\")","v":"нет веса"},null,"Город: ",null,null,null,{"$f":"MID(L19,8,70)","v":""},{"$f":"IF(LEFT(K19,4)=\"ваша\",VALUE(MID(K19,13,20))*100,0)","v":0}]
["",null,"","","","","",null,null,{"$f":"IFERROR(IFERROR(VLOOKUP(C20,#REF!,3,0)*D20,VLOOKUP(C20,#REF!,7,0)*D20),\"нет веса\")","v":"нет веса"},null,"Улица: ",null,null,null,{"$f":"MID(L20,8,70)","v":""},{"$f":"IF(LEFT(K31,4)=\"ваша\",VALUE(MID(K31,13,20))*100,0)","v":0}]
["",null,"","","","","",null,null,{"$f":"IFERROR(IFERROR(VLOOKUP(C21,#REF!,3,0)*D21,VLOOKUP(C21,#REF!,7,0)*D21),\"нет веса\")","v":"нет веса"},null,"Здание: ",null,null,null,{"$f":"MID(L21,9,70)","v":""},{"$f":"IF(LEFT(K32,4)=\"ваша\",VALUE(MID(K32,13,20))*100,0)","v":0}]
["",null,"","","","","",null,null,{"$f":"IFERROR(IFERROR(VLOOKUP(C22,#REF!,3,0)*D22,VLOOKUP(C22,#REF!,7,0)*D22),\"нет веса\")","v":"нет веса"},null,"Квартира: ",null,null,null,{"$f":"MID(L22,11,70)","v":""},{"$f":"IF(LEFT(#REF!,4)=\"ваша\",VALUE(MID(#REF!,13,20))*100,0)","v":{"$error":"#REF!"}}]
["",null,null,null,"Итого:",{"$f":"SUM(F7:F22)","v":240000},"",null,null,{"$f":"IF(K40>0,M40,\"\")","v":""},"Наименование","Количество","Цена","Вес","Всего",null,{"$f":"IF(LEFT(K33,4)=\"ваша\",VALUE(MID(K33,13,20))*100,0)","v":0}]
[{"$f":"IF(L41>0,N41,\"\")","v":""},null,null,"скидка:",{"$f":"IF(F23>150000,10,IF(F23>100000,8,IF(F23>60000,5,IF(F23>30000,3,0))))","v":10},{"$f":"F23-(F23*E24/100)","v":216000},{"$f":"IFERROR(SUM(I7:I22)-F29+1,0)","v":1},null,null,null,null,null,null,null,null,{"$f":"N24","v":0},{"$f":"TEXT(SUM(MID(0&P24,LARGE(ISNUMBER(-MID(P24,ROW($1:$88),1))*ROW($1:$88),ROW($1:$15)+15)+1,1)*10^ROW($1:$15)/10),REPT(0,MIN(MAX(COUNT(1/(MID(P24,ROW($1:$88),1)+1))-15,),15)))&TEXT(SUM(MID(0&P24,LARGE(ISNUMBER(-MID(P24,ROW($1:$88),1))*ROW($1:$88),ROW($1:$15))+1,1)*10^ROW($1:$15)/10),REPT(0,MIN(COUNT(1/(MID(P24,ROW($1:$88),1)+1)),15)))","v":"0"}]
[{"$f":"SUM(A7:A23)/1000*1.3","v":0},null,{"$f":"IF(E25=F26,\"Доставка БЕСПЛАТНО\",IF(E25=D26,C26,IF(E25=D27,C27,IF(E25=D28,C28,IF(E25=F27,C27&\" + НПл\",IF(E25=F28,C28&\" + НПл\",\"Укажите ТК\"))))))","v":"AVIS EXPRESS  Алматы"},2,{"$f":"D28","v":3300},null,{"$f":"IF(I25 >0,TODAY(),\"\")","v":""},null,null,{"$f":"SUM(J7:J22)/1000","v":0},null,null,null,null,null,{"$f":"E25","v":3300},{"$f":"TEXT(SUM(MID(0&P25,LARGE(ISNUMBER(-MID(P25,ROW($1:$88),1))*ROW($1:$88),ROW($1:$15)+15)+1,1)*10^ROW($1:$15)/10),REPT(0,MIN(MAX(COUNT(1/(MID(P25,ROW($1:$88),1)+1))-15,),15)))&TEXT(SUM(MID(0&P25,LARGE(ISNUMBER(-MID(P25,ROW($1:$88),1))*ROW($1:$88),ROW($1:$15))+1,1)*10^ROW($1:$15)/10),REPT(0,MIN(COUNT(1/(MID(P25,ROW($1:$88),1)+1)),15)))","v":"3300"},{"$f":"E25","v":3300},{"$f":"TEXT(SUM(MID(0&R25,LARGE(ISNUMBER(-MID(R25,ROW($1:$88),1))*ROW($1:$88),ROW($1:$15)+15)+1,1)*10^ROW($1:$15)/10),REPT(0,MIN(MAX(COUNT(1/(MID(R25,ROW($1:$88),1)+1))-15,),15)))&TEXT(SUM(MID(0&R25,LARGE(ISNUMBER(-MID(R25,ROW($1:$88),1))*ROW($1:$88),ROW($1:$15))+1,1)*10^ROW($1:$15)/10),REPT(0,MIN(COUNT(1/(MID(R25,ROW($1:$88),1)+1)),15)))","v":"3300"},null,{"$f":"TEXT(SUM(MID(0&E25,LARGE(ISNUMBER(-MID(E25,ROW($1:$88),1))*ROW($1:$88),ROW($1:$15)+15)+1,1)*10^ROW($1:$15)/10),REPT(0,MIN(MAX(COUNT(1/(MID(E25,ROW($1:$88),1)+1))-15,),15)))&TEXT(SUM(MID(0&E25,LARGE(ISNUMBER(-MID(E25,ROW($1:$88),1))*ROW($1:$88),ROW($1:$15))+1,1)*10^ROW($1:$15)/10),REPT(0,MIN(COUNT(1/(MID(E25,ROW($1:$88),1)+1)),15)))","v":{"$error":"#NUM!"}}]
[null,null,{"$f":"IFERROR(\"AVIS С А М О В Ы В О З \"&\"  \"&VLOOKUP((LEFT(B34,(LEN(B34)))),'ТАРИФЫ ТК'!J17:L268,1,0),\"НЕТ ДОСТАВКИ\")","v":"AVIS С А М О В Ы В О З   Алматы"},{"$f":"IFERROR(VLOOKUP((LEFT(B34,(LEN(B34)))),'ТАРИФЫ ТК'!J17:L268,3,0)+0.001,\"НЕТ ДОСТАВКИ\")","v":1550.001},{"$f":"IFERROR(F24+D26,\"НЕТ ДОСТАВКИ\")","v":217550.00099999999},{"$f":"IFERROR(D26&\" + НПл\",\"НЕТ ДОСТАВКИ\")","v":"1550,001 + НПл"},{"$f":"IFERROR(CEILING((F24+D26)*(1+$D$25/100),50),0)","v":221950},null,null,null,null,null,null,null,null,{"$f":"N26","v":0},{"$f":"TEXT(SUM(MID(0&P26,LARGE(ISNUMBER(-MID(P26,ROW($1:$88),1))*ROW($1:$88),ROW($1:$15)+15)+1,1)*10^ROW($1:$15)/10),REPT(0,MIN(MAX(COUNT(1/(MID(P26,ROW($1:$88),1)+1))-15,),15)))&TEXT(SUM(MID(0&P26,LARGE(ISNUMBER(-MID(P26,ROW($1:$88),1))*ROW($1:$88),ROW($1:$15))+1,1)*10^ROW($1:$15)/10),REPT(0,MIN(COUNT(1/(MID(P26,ROW($1:$88),1)+1)),15)))","v":"0"}]
[null,null,{"$f":"IFERROR(\"AVIS Econom\"&\"  \"&VLOOKUP((LEFT(B34,(LEN(B34)))),'ТАРИФЫ ТК'!A4:A134,1,0),\"НЕТ ДОСТАВКИ\")","v":"AVIS Econom  Алматы"},{"$f":"IFERROR(VLOOKUP((LEFT(B34,(LEN(B34)))),'ТАРИФЫ ТК'!A4:C134,3,0),\"НЕТ ДОСТАВКИ\")","v":1300},{"$f":"IFERROR(F24+D27,\"НЕТ ДОСТАВКИ\")","v":217300},{"$f":"IFERROR(D27&\" + НПл\",\"НЕТ ДОСТАВКИ\")","v":"1300 + НПл"},{"$f":"IFERROR(CEILING((F24+D27)*(1+$D$25/100),50),0)","v":221650},null,null,null,null,null,null,null,null,0,{"$f":"TEXT(SUM(MID(0&P27,LARGE(ISNUMBER(-MID(P27,ROW($1:$88),1))*ROW($1:$88),ROW($1:$15)+15)+1,1)*10^ROW($1:$15)/10),REPT(0,MIN(MAX(COUNT(1/(MID(P27,ROW($1:$88),1)+1))-15,),15)))&TEXT(SUM(MID(0&P27,LARGE(ISNUMBER(-MID(P27,ROW($1:$88),1))*ROW($1:$88),ROW($1:$15))+1,1)*10^ROW($1:$15)/10),REPT(0,MIN(COUNT(1/(MID(P27,ROW($1:$88),1)+1)),15)))","v":"0"}]
[null,null,{"$f":"IFERROR(IF(A29<1,\"AVIS EXPRESS\"&\"  \"&VLOOKUP((LEFT(B34,(LEN(B34)))),'ТАРИФЫ ТК'!E4:G20,1,0),\"AV ВИМАНИЕ:   В Е С    П О С Ы Л К И    Б О Л Ь Ш Е   0,5 КГ   !!!\"),\"НЕТ ДОСТАВКИ\")","v":"AVIS EXPRESS  Алматы"},3300,{"$f":"IFERROR(F24+D28,\"НЕТ ДОСТАВКИ\")","v":219300},{"$f":"D28&\" + НПл\"","v":"3300 + НПл"},{"$f":"IFERROR(CEILING((F24+D28)*(1+$D$25/100),50),\"НЕТ ДОСТАВКИ\")","v":223700},null,null,null,null,null,null,null,null,0,{"$f":"TEXT(SUM(MID(0&P28,LARGE(ISNUMBER(-MID(P28,ROW($1:$88),1))*ROW($1:$88),ROW($1:$15)+15)+1,1)*10^ROW($1:$15)/10),REPT(0,MIN(MAX(COUNT(1/(MID(P28,ROW($1:$88),1)+1))-15,),15)))&TEXT(SUM(MID(0&P28,LARGE(ISNUMBER(-MID(P28,ROW($1:$88),1))*ROW($1:$88),ROW($1:$15))+1,1)*10^ROW($1:$15)/10),REPT(0,MIN(COUNT(1/(MID(P28,ROW($1:$88),1)+1)),15)))","v":"0"}]
[{"$f":"IFERROR(A25*1.5,\"Количество ??\")","v":0},null,null,"К ОПЛАТЕ:",{"$f":"IFERROR(F24+E25,0)","v":219300},220400,{"$f":"IFERROR(CEILING((F24+E25)*1.03,50),0)","v":225900},null,null,{"$f":"IFERROR(J25*1.5,\"Количество ??\")","v":0},null,null,null,null,null,0,{"$f":"TEXT(SUM(MID(0&P29,LARGE(ISNUMBER(-MID(P29,ROW($1:$88),1))*ROW($1:$88),ROW($1:$15)+15)+1,1)*10^ROW($1:$15)/10),REPT(0,MIN(MAX(COUNT(1/(MID(P29,ROW($1:$88),1)+1))-15,),15)))&TEXT(SUM(MID(0&P29,LARGE(ISNUMBER(-MID(P29,ROW($1:$88),1))*ROW($1:$88),ROW($1:$15))+1,1)*10^ROW($1:$15)/10),REPT(0,MIN(COUNT(1/(MID(P29,ROW($1:$88),1)+1)),15)))","v":"0"}]
["rc11091kz",null,{"$f":"IFERROR((P14&\"        \"&LEFT(P15,8)&\" = \"&TEXT(R15,\"### ### ###\")&\" т.\"),\"НЕТ ДОСТАВКИ\")","v":"        0 =  т."},null,{"$f":"IFERROR(\"QIWI = \"&CEILING((E26*1.02),10),0)","v":"QIWI = 221910"},{"$f":"IFERROR(F29-F24,\"УКАЖИТЕ ТК\")","v":4400},null,null,null,null,null,null,null,null,null,0,{"$f":"TEXT(SUM(MID(0&P30,LARGE(ISNUMBER(-MID(P30,ROW($1:$88),1))*ROW($1:$88),ROW($1:$15)+15)+1,1)*10^ROW($1:$15)/10),REPT(0,MIN(MAX(COUNT(1/(MID(P30,ROW($1:$88),1)+1))-15,),15)))&TEXT(SUM(MID(0&P30,LARGE(ISNUMBER(-MID(P30,ROW($1:$88),1))*ROW($1:$88),ROW($1:$15))+1,1)*10^ROW($1:$15)/10),REPT(0,MIN(COUNT(1/(MID(P30,ROW($1:$88),1)+1)),15)))","v":"0"}]
[{"$f":"A1","v":"+СЧЁТ Альфа-Банк+Сч0608++0"},"ПОЛУЧАТЕЛЬ:","rc11091kz",null,null,null,null,null,null,null,null,null,null,null,null,0,{"$f":"TEXT(SUM(MID(0&P31,LARGE(ISNUMBER(-MID(P31,ROW($1:$88),1))*ROW($1:$88),ROW($1:$15)+15)+1,1)*10^ROW($1:$15)/10),REPT(0,MIN(MAX(COUNT(1/(MID(P31,ROW($1:$88),1)+1))-15,),15)))&TEXT(SUM(MID(0&P31,LARGE(ISNUMBER(-MID(P31,ROW($1:$88),1))*ROW($1:$88),ROW($1:$15))+1,1)*10^ROW($1:$15)/10),REPT(0,MIN(COUNT(1/(MID(P31,ROW($1:$88),1)+1)),15)))","v":"0"}]
[{"$f":"UPPER((B3))","v":"ТОО «РОДАМИН»"},null,{"$f":"IFERROR(MID(НайтиСтрокуПоСлову(\"Комментарий: Имя :\",K1:K45),20,99),0)","v":0},null,null,null,null,null,null,null,null,null,null,null,null,0,{"$f":"TEXT(SUM(MID(0&P32,LARGE(ISNUMBER(-MID(P32,ROW($1:$88),1))*ROW($1:$88),ROW($1:$15)+15)+1,1)*10^ROW($1:$15)/10),REPT(0,MIN(MAX(COUNT(1/(MID(P32,ROW($1:$88),1)+1))-15,),15)))&TEXT(SUM(MID(0&P32,LARGE(ISNUMBER(-MID(P32,ROW($1:$88),1))*ROW($1:$88),ROW($1:$15))+1,1)*10^ROW($1:$15)/10),REPT(0,MIN(COUNT(1/(MID(P32,ROW($1:$88),1)+1)),15)))","v":"0"}]
["Область: ",{"$f":"UPPER((P18))","v":""},{"$f":"IFERROR(ПоискСНачала(C32,\"Телефон\"),0)","v":0},null,{"$f":"IFERROR(ПоискМежду(C32,\"Телефон :\",\"Примечание\"),0)","v":0},{"$f":"IFERROR(IF(LEFT(ПоискСКонца(C32,\"Примечание : \"),2)=\"г \",MID(ПоискСКонца(C32,\"Примечание : \"),3,99),IF(LEFT(ПоискСКонца(C32,\"Примечание : \"),3)=\"г. \",MID(ПоискСКонца(C32,\"Примечание : \"),4,99),IF(LEFT(ПоискСКонца(C32,\"Примечание : \"),3)=\"гор\",MID(ПоискСКонца(C32,\"Примечание : \"),6,99),0))),0)","v":0},null,null,null,null,null,null,null,null,null,0,{"$f":"TEXT(SUM(MID(0&P33,LARGE(ISNUMBER(-MID(P33,ROW($1:$88),1))*ROW($1:$88),ROW($1:$15)+15)+1,1)*10^ROW($1:$15)/10),REPT(0,MIN(MAX(COUNT(1/(MID(P33,ROW($1:$88),1)+1))-15,),15)))&TEXT(SUM(MID(0&P33,LARGE(ISNUMBER(-MID(P33,ROW($1:$88),1))*ROW($1:$88),ROW($1:$15))+1,1)*10^ROW($1:$15)/10),REPT(0,MIN(COUNT(1/(MID(P33,ROW($1:$88),1)+1)),15)))","v":"0"}]
["Город: ","Алматы",null,null,null,null,null,null,null,null,null,null,null,null,null,0,{"$f":"TEXT(SUM(MID(0&P34,LARGE(ISNUMBER(-MID(P34,ROW($1:$88),1))*ROW($1:$88),ROW($1:$15)+15)+1,1)*10^ROW($1:$15)/10),REPT(0,MIN(MAX(COUNT(1/(MID(P34,ROW($1:$88),1)+1))-15,),15)))&TEXT(SUM(MID(0&P34,LARGE(ISNUMBER(-MID(P34,ROW($1:$88),1))*ROW($1:$88),ROW($1:$15))+1,1)*10^ROW($1:$15)/10),REPT(0,MIN(COUNT(1/(MID(P34,ROW($1:$88),1)+1)),15)))","v":"0"}]
["Улица: ","Помяловского",null,null,null,null,null,null,null,null,null,null,null,null,null,0,{"$f":"TEXT(SUM(MID(0&P35,LARGE(ISNUMBER(-MID(P35,ROW($1:$88),1))*ROW($1:$88),ROW($1:$15)+15)+1,1)*10^ROW($1:$15)/10),REPT(0,MIN(MAX(COUNT(1/(MID(P35,ROW($1:$88),1)+1))-15,),15)))&TEXT(SUM(MID(0&P35,LARGE(ISNUMBER(-MID(P35,ROW($1:$88),1))*ROW($1:$88),ROW($1:$15))+1,1)*10^ROW($1:$15)/10),REPT(0,MIN(COUNT(1/(MID(P35,ROW($1:$88),1)+1)),15)))","v":"0"}]
["Здание: ","29 А/1",null,null,null,null,null,null,null,null,null,null,null,null,null,0,{"$f":"TEXT(SUM(MID(0&P36,LARGE(ISNUMBER(-MID(P36,ROW($1:$88),1))*ROW($1:$88),ROW($1:$15)+15)+1,1)*10^ROW($1:$15)/10),REPT(0,MIN(MAX(COUNT(1/(MID(P36,ROW($1:$88),1)+1))-15,),15)))&TEXT(SUM(MID(0&P36,LARGE(ISNUMBER(-MID(P36,ROW($1:$88),1))*ROW($1:$88),ROW($1:$15))+1,1)*10^ROW($1:$15)/10),REPT(0,MIN(COUNT(1/(MID(P36,ROW($1:$88),1)+1)),15)))","v":"0"}]
["Квартира: ",{"$f":"P22","v":""},null,null,null,null,null,null,null,null,null,null,null,null,null,0,{"$f":"TEXT(SUM(MID(0&P37,LARGE(ISNUMBER(-MID(P37,ROW($1:$88),1))*ROW($1:$88),ROW($1:$15)+15)+1,1)*10^ROW($1:$15)/10),REPT(0,MIN(MAX(COUNT(1/(MID(P37,ROW($1:$88),1)+1))-15,),15)))&TEXT(SUM(MID(0&P37,LARGE(ISNUMBER(-MID(P37,ROW($1:$88),1))*ROW($1:$88),ROW($1:$15))+1,1)*10^ROW($1:$15)/10),REPT(0,MIN(COUNT(1/(MID(P37,ROW($1:$88),1)+1)),15)))","v":"0"}]
["Телефон: ",{"$f":"B4","v":"8-701-517-14-04   0----   ----"},null,null,null,null,null,null,null,null,null,null,null,null,null,0,{"$f":"TEXT(SUM(MID(0&P38,LARGE(ISNUMBER(-MID(P38,ROW($1:$88),1))*ROW($1:$88),ROW($1:$15)+15)+1,1)*10^ROW($1:$15)/10),REPT(0,MIN(MAX(COUNT(1/(MID(P38,ROW($1:$88),1)+1))-15,),15)))&TEXT(SUM(MID(0&P38,LARGE(ISNUMBER(-MID(P38,ROW($1:$88),1))*ROW($1:$88),ROW($1:$15))+1,1)*10^ROW($1:$15)/10),REPT(0,MIN(COUNT(1/(MID(P38,ROW($1:$88),1)+1)),15)))","v":"0"}]
["Индекс: ",{"$f":"P16","v":""},null,null,null,null,null,null,null,null,null,null,null,null,null,null,{"$f":"IF(LEFT(#REF!,4)=\"ваша\",VALUE(MID(#REF!,13,20))*100,0)","v":{"$error":"#REF!"}}]
["Компания:",null,null,null,null,null,null,null,null,null,null,null,null,null,null,null,{"$f":"IF(LEFT(#REF!,4)=\"ваша\",VALUE(MID(#REF!,13,20))*100,0)","v":{"$error":"#REF!"}}]
["ИИН:",{"$f":"F29","v":220400},null,null,null,null,null,null,null,null,null,null,null,null,null,null,{"$f":"IF(LEFT(#REF!,4)=\"ваша\",VALUE(MID(#REF!,13,20))*100,0)","v":{"$error":"#REF!"}}]
["------------------------","----------------------------------------------------","----------------------------------------------------","------------------------","------------------------","---------------------------","------------------------------","------------------------","------------------------",null,null,null,null,null,null,null,{"$f":"SUM(Q19:Q41)","v":{"$error":"#REF!"}}]

{"sheet":"+СЧЁТ Альфа-Банк+Сч0908++0","index":13,"n_rows":42,"n_cols":21,"rows_kept":42,"cut":false,"hidden":false,"merged":[[27,6,27,8],[31,0,31,1],[37,1,37,2],[0,4,0,7],[1,4,1,8],[2,1,2,2],[3,1,3,2],[25,6,25,8],[26,6,26,8]]}
[{"$f":"IF(LEFT(C29,2)=\"сп\",P1&\" ► СП\",IF(E25=D26,P1,IF(H6<>0,P1&\"++\"&\"0\",IF(E25=D27,P1&\"++\"&\"0\",IF(E25=D28,P1&\"++\"&\"0\",IF(E25=D27,P1&\"++\"&\"0\",IF(E25=D28,P1&\"++\"&\"0\",IF(LEFT(C25,2)=\"AV\",P1&\"++\"&F29,P1))))))))","v":"+СЧЁТ Альфа-Банк+Сч0908++0"},"2020-08-09",{"$f":"IF(E2>0,\"ОТПРАВЛЕНО\",IF(LEFT(C29,3)=\"ЗАК\",\"ЗАКАЗАНО в СПБ\",IF(G24>=0,\"ОПЛОЧЕНО\",\"ОЖИДАНИЕ ОПЛАТЫ\")))","v":"ОТПРАВЛЕНО"},{"$f":"'СПИСОК ЗАКАЗОВ'!B1","v":21},"2020-08-10",null,null,null,{"$f":"A1","v":"+СЧЁТ Альфа-Банк+Сч0908++0"},null,"Сч0908",null,null,null,null,{"$f":"IF(G24>0,\"+\"&H6&\"+\"&Q1,Q1)","v":"+СЧЁТ Альфа-Банк+Сч0908"},{"$f":"ПоискСКонца(K1,\"№\")","v":"Сч0908"}]
["Логин",{"$f":"L3","v":"Логин"},"Номер накл-ой",null,3611545,null,null,null,null,null,"Примечание"]
["ФИО",{"$f":"IF(C32=0,UPPER((P9)),UPPER(C33))","v":"ТОО ZZZ"},null,null,null,null,null,null,null,null,"Логин","Логин"]
["Телефон",{"$f":"R12","v":"8-705-767-77-77   0----   ----"},null,null,{"$f":"IF(F4>0.5,\"оплачено\",IF(F4<0,\"ОПЛАТИТЬ= \"&G4,\"ОПЛАТИТЬ= \"&Q25))","v":"ОПЛАТИТЬ= 7700"},0,1100,null,null,null,"Дата заказа","дата заказа"]
["e-mail:",{"$f":"L11","v":"мыло"}]
["Вес","ПРИМЕЧАНИЯ","Наименование","Кол-во","Цена","Всего",{"$f":"IF(MAX(G7:G25)>0,MAX(G7:G25),\"\")","v":"2020-08-21"},{"$f":"IF(I7>0,\"НАЛ\",IF(I8>0,\"ПЕРЕВОД\",IF(I9>0,\"Beeline\",IF(I10>0,\"KASPI\",IF(I11>0,\"QIWI\",IF(I12>0,\"СЧЁТ Альфа-Банк\",0))))))","v":"СЧЁТ Альфа-Банк"},{"$f":"SUM(I7:I28)","v":286720}]
[{"$f":"IF(L24>0,Q24*1/100,\"\")","v":""},"списано","Неодимовый магнит D45x30mm(Аксиал)`42 (сила притяжения 90 кг)",32,8700,{"$f":"IF(D7<>\"\",E7*D7,\"\")","v":278400},{"$f":"IF(I7 >0,TODAY(),\"\")","v":""},"НАЛ",null,{"$f":"IFERROR(IFERROR(VLOOKUP(C7,#REF!,3,0)*D7,VLOOKUP(C7,#REF!,7,0)*D7),\"нет веса\")","v":"нет веса"},"Заказ №2080"]
[{"$f":"IF(L25>0,Q25*1/100,\"\")","v":""},null,{"$f":"IF(L27<>\"\",K27,\"\")","v":""},{"$f":"IF(L27>0,L27,\"\")","v":""},{"$f":"IF(M27=\"уточняйте\",0,IF(L27>0,M27,\"\"))","v":""},"","","ПЕРЕВОД",null,{"$f":"IFERROR(IFERROR(VLOOKUP(C8,#REF!,3,0)*D8,VLOOKUP(C8,#REF!,7,0)*D8),\"нет веса\")","v":"нет веса"}]
[{"$f":"IF(L26>0,Q26*1/100,\"\")","v":""},null,"Неодимовый магнит D50x30mm(Аксиал)`42 (сила притяжения 120 кг)",3,9900,29700,"","Beeline",null,{"$f":"IFERROR(IFERROR(VLOOKUP(C9,#REF!,3,0)*D9,VLOOKUP(C9,#REF!,7,0)*D9),\"нет веса\")","v":"нет веса"},"Здравствуйте, ТОО ZZZ",null,null,null,null,{"$f":"MID(K9,15,70)","v":"ТОО ZZZ"},{"$f":"TEXT(SUM(MID(0&L9,LARGE(ISNUMBER(-MID(L9,ROW($1:$96),1))*ROW($1:$96),ROW($1:$23)+15)+1,1)*10^ROW($1:$23)/10),REPT(0,MIN(MAX(COUNT(1/(MID(L9,ROW($1:$96),1)+1))-15,),15)))&TEXT(SUM(MID(0&L9,LARGE(ISNUMBER(-MID(L9,ROW($1:$96),1))*ROW($1:$96),ROW($1:$23))+1,1)*10^ROW($1:$23)/10),REPT(0,MIN(COUNT(1/(MID(L9,ROW($1:$96),1)+1)),15)))","v":""}]
["",null,"","","","","","KASPI",null,{"$f":"IFERROR(IFERROR(VLOOKUP(C10,#REF!,3,0)*D10,VLOOKUP(C10,#REF!,7,0)*D10),\"нет веса\")","v":"нет веса"},"Мы получили Ваш заказ номер, 2080"]
["",null,"","","","","","QIWI",null,{"$f":"IFERROR(IFERROR(VLOOKUP(C11,#REF!,3,0)*D11,VLOOKUP(C11,#REF!,7,0)*D11),\"нет веса\")","v":"нет веса"},"Электронная почта","мыло"]
["",null,"","","","","2020-08-21","СЧЁТ Альфа-Банк",{"$f":"F29","v":286720},{"$f":"IFERROR(IFERROR(VLOOKUP(C12,#REF!,3,0)*D12,VLOOKUP(C12,#REF!,7,0)*D12),\"нет веса\")","v":"нет веса"},"Контактный телефон","87057677777",null,null,null,{"$f":"(L12&\"  \"&P13)","v":"87057677777  0"},{"$f":"TEXT(SUM(MID(0&P12,LARGE(ISNUMBER(-MID(P12,ROW($1:$99),1))*ROW($1:$99),ROW($1:$15)+30)+1,1)*10^ROW($1:$15)/10),REPT(0,MIN(MAX(COUNT(1/(MID(P12,ROW($1:$99),1)+1))-30,),15)))&TEXT(SUM(MID(0&P12,LARGE(ISNUMBER(-MID(P12,ROW($1:$99),1))*ROW($1:$99),ROW($1:$15)+15)+1,1)*10^ROW($1:$15)/10),REPT(0,MIN(MAX(COUNT(1/(MID(P12,ROW($1:$99),1)+1))-15,),15)))&TEXT(SUM(MID(0&P12,LARGE(ISNUMBER(-MID(P12,ROW($1:$99),1))*ROW($1:$99),ROW($1:$15))+1,1)*10^ROW($1:$15)/10),REPT(0,MIN(COUNT(1/(MID(P12,ROW($1:$99),1)+1)),15)))","v":"870576777770"},{"$f":"(MID(Q12,1,1))&\"-\"&(MID(Q12,2,3))&\"-\"&(MID(Q12,5,3))&\"-\"&(MID(Q12,8,2))&\"-\"&(MID(Q12,10,2))&\"   \"&(MID(Q12,12,1))&\"-\"&(MID(Q12,13,3))&\"-\"&(MID(Q12,16,3))&\"-\"&(MID(Q12,19,2))&\"-\"&(MID(Q12,21,2))&\"   \"&(MID(Q12,23,1))&\"-\"&(MID(Q12,24,3))&\"-\"&(MID(Q12,27,3))&\"-\"&(MID(Q12,30,2))&\"-\"&(MID(Q12,32,2))","v":"8-705-767-77-77   0----   ----"}]
["",null,"","","","","",null,null,{"$f":"IFERROR(IFERROR(VLOOKUP(C13,#REF!,3,0)*D13,VLOOKUP(C13,#REF!,7,0)*D13),\"нет веса\")","v":"нет веса"},null,null,null,null,null,{"$f":"IF(L13=\"-\",IFERROR(НайтиСтрокуПоСлову(\"Комментарий\",K27:K60),0),L13)","v":0}]
["",null,"","","","","",null,null,{"$f":"IFERROR(IFERROR(VLOOKUP(C14,#REF!,3,0)*D14,VLOOKUP(C14,#REF!,7,0)*D14),\"нет веса\")","v":"нет веса"},"Доставка:",null,null,null,null,{"$f":"MID(L14,23,70)","v":""}]
["",null,"","","","","",null,null,{"$f":"IFERROR(IFERROR(VLOOKUP(C15,#REF!,3,0)*D15,VLOOKUP(C15,#REF!,7,0)*D15),\"нет веса\")","v":"нет веса"},"Оплата:",null,null,null,null,{"$f":"IF(LEFT(P14,2)=\"EX\",MID(L15,11,70),L15)","v":0},{"$f":"TEXT(SUM(MID(0&P15,LARGE(ISNUMBER(-MID(P15,ROW($1:$88),1))*ROW($1:$88),ROW($1:$15)+15)+1,1)*10^ROW($1:$15)/10),REPT(0,MIN(MAX(COUNT(1/(MID(P15,ROW($1:$88),1)+1))-15,),15)))&TEXT(SUM(MID(0&P15,LARGE(ISNUMBER(-MID(P15,ROW($1:$88),1))*ROW($1:$88),ROW($1:$15))+1,1)*10^ROW($1:$15)/10),REPT(0,MIN(COUNT(1/(MID(P15,ROW($1:$88),1)+1)),15)))","v":"0"},{"$f":"SUMPRODUCT(--SUBSTITUTE(Q15:Q15,CHAR(160),))","v":0},{"$f":"LEN(Q15)","v":1},{"$f":"FLOOR(S15/3,1)","v":0}]
["",null,"","","","","",null,null,{"$f":"IFERROR(IFERROR(VLOOKUP(C16,#REF!,3,0)*D16,VLOOKUP(C16,#REF!,7,0)*D16),\"нет веса\")","v":"нет веса"},"Адрес доставки","Индекс: ",null,null,null,{"$f":"MID(L16,9,70)","v":""}]
["",null,"","","","","",null,null,{"$f":"IFERROR(IFERROR(VLOOKUP(C17,#REF!,3,0)*D17,VLOOKUP(C17,#REF!,7,0)*D17),\"нет веса\")","v":"нет веса"},null,"Страна: ",null,null,null,{"$f":"MID(L17,9,70)","v":""},{"$f":"IF(LEFT(K17,4)=\"ваша\",VALUE(MID(K17,13,20))*100,0)","v":0}]
["",null,"","","","","",null,null,{"$f":"IFERROR(IFERROR(VLOOKUP(C18,#REF!,3,0)*D18,VLOOKUP(C18,#REF!,7,0)*D18),\"нет веса\")","v":"нет веса"},null,"Область: ",null,null,null,{"$f":"MID(L18,10,70)","v":""}]
["",null,"","","","","",null,null,{"$f":"IFERROR(IFERROR(VLOOKUP(C19,#REF!,3,0)*D19,VLOOKUP(C19,#REF!,7,0)*D19),\"нет веса\")","v":"нет веса"},null,"Город: ",null,null,null,{"$f":"MID(L19,8,70)","v":""},{"$f":"IF(LEFT(K19,4)=\"ваша\",VALUE(MID(K19,13,20))*100,0)","v":0}]
["",null,"","","","","",null,null,{"$f":"IFERROR(IFERROR(VLOOKUP(C20,#REF!,3,0)*D20,VLOOKUP(C20,#REF!,7,0)*D20),\"нет веса\")","v":"нет веса"},null,"Улица: ",null,null,null,{"$f":"MID(L20,8,70)","v":""},{"$f":"IF(LEFT(K31,4)=\"ваша\",VALUE(MID(K31,13,20))*100,0)","v":0}]
["",null,"","","","","",null,null,{"$f":"IFERROR(IFERROR(VLOOKUP(C21,#REF!,3,0)*D21,VLOOKUP(C21,#REF!,7,0)*D21),\"нет веса\")","v":"нет веса"},null,"Здание: ",null,null,null,{"$f":"MID(L21,9,70)","v":""},{"$f":"IF(LEFT(K32,4)=\"ваша\",VALUE(MID(K32,13,20))*100,0)","v":0}]
["",null,"","","","","",null,null,{"$f":"IFERROR(IFERROR(VLOOKUP(C22,#REF!,3,0)*D22,VLOOKUP(C22,#REF!,7,0)*D22),\"нет веса\")","v":"нет веса"},null,"Квартира: ",null,null,null,{"$f":"MID(L22,11,70)","v":""},{"$f":"IF(LEFT(#REF!,4)=\"ваша\",VALUE(MID(#REF!,13,20))*100,0)","v":{"$error":"#REF!"}}]
["",null,null,null,"Итого:",{"$f":"SUM(F7:F22)","v":308100},"",null,null,{"$f":"IF(K40>0,M40,\"\")","v":""},"Наименование","Количество","Цена","Вес","Всего",null,{"$f":"IF(LEFT(K33,4)=\"ваша\",VALUE(MID(K33,13,20))*100,0)","v":0}]
[{"$f":"IF(L41>0,N41,\"\")","v":""},null,null,"скидка:",10,{"$f":"F23-(F23*E24/100)","v":277290},{"$f":"IFERROR(SUM(I7:I22)-F29+1,0)","v":1},null,null,null,null,null,null,null,null,{"$f":"N24","v":0},{"$f":"TEXT(SUM(MID(0&P24,LARGE(ISNUMBER(-MID(P24,ROW($1:$88),1))*ROW($1:$88),ROW($1:$15)+15)+1,1)*10^ROW($1:$15)/10),REPT(0,MIN(MAX(COUNT(1/(MID(P24,ROW($1:$88),1)+1))-15,),15)))&TEXT(SUM(MID(0&P24,LARGE(ISNUMBER(-MID(P24,ROW($1:$88),1))*ROW($1:$88),ROW($1:$15))+1,1)*10^ROW($1:$15)/10),REPT(0,MIN(COUNT(1/(MID(P24,ROW($1:$88),1)+1)),15)))","v":"0"}]
[{"$f":"SUM(A7:A23)/1000*1.3","v":0},null,{"$f":"IF(E25=F26,\"Доставка БЕСПЛАТНО\",IF(E25=D26,C26,IF(E25=D27,C27,IF(E25=D28,C28,IF(E25=F27,C27&\" + НПл\",IF(E25=F28,C28&\" + НПл\",\"Укажите ТК\"))))))","v":"AVIS EXPRESS  Шымкент"},2,{"$f":"D28","v":7700},null,{"$f":"IF(I25 >0,TODAY(),\"\")","v":""},null,null,{"$f":"SUM(J7:J22)/1000","v":0},null,null,null,null,null,{"$f":"E25","v":7700},{"$f":"TEXT(SUM(MID(0&P25,LARGE(ISNUMBER(-MID(P25,ROW($1:$88),1))*ROW($1:$88),ROW($1:$15)+15)+1,1)*10^ROW($1:$15)/10),REPT(0,MIN(MAX(COUNT(1/(MID(P25,ROW($1:$88),1)+1))-15,),15)))&TEXT(SUM(MID(0&P25,LARGE(ISNUMBER(-MID(P25,ROW($1:$88),1))*ROW($1:$88),ROW($1:$15))+1,1)*10^ROW($1:$15)/10),REPT(0,MIN(COUNT(1/(MID(P25,ROW($1:$88),1)+1)),15)))","v":"7700"},{"$f":"E25","v":7700},{"$f":"TEXT(SUM(MID(0&R25,LARGE(ISNUMBER(-MID(R25,ROW($1:$88),1))*ROW($1:$88),ROW($1:$15)+15)+1,1)*10^ROW($1:$15)/10),REPT(0,MIN(MAX(COUNT(1/(MID(R25,ROW($1:$88),1)+1))-15,),15)))&TEXT(SUM(MID(0&R25,LARGE(ISNUMBER(-MID(R25,ROW($1:$88),1))*ROW($1:$88),ROW($1:$15))+1,1)*10^ROW($1:$15)/10),REPT(0,MIN(COUNT(1/(MID(R25,ROW($1:$88),1)+1)),15)))","v":"7700"},null,{"$f":"TEXT(SUM(MID(0&E25,LARGE(ISNUMBER(-MID(E25,ROW($1:$88),1))*ROW($1:$88),ROW($1:$15)+15)+1,1)*10^ROW($1:$15)/10),REPT(0,MIN(MAX(COUNT(1/(MID(E25,ROW($1:$88),1)+1))-15,),15)))&TEXT(SUM(MID(0&E25,LARGE(ISNUMBER(-MID(E25,ROW($1:$88),1))*ROW($1:$88),ROW($1:$15))+1,1)*10^ROW($1:$15)/10),REPT(0,MIN(COUNT(1/(MID(E25,ROW($1:$88),1)+1)),15)))","v":{"$error":"#NUM!"}}]
[null,null,{"$f":"IFERROR(\"AVIS С А М О В Ы В О З \"&\"  \"&VLOOKUP((LEFT(B34,(LEN(B34)))),'ТАРИФЫ ТК'!J17:L268,1,0),\"НЕТ ДОСТАВКИ\")","v":"AVIS С А М О В Ы В О З   Шымкент"},{"$f":"IFERROR(VLOOKUP((LEFT(B34,(LEN(B34)))),'ТАРИФЫ ТК'!J17:L268,3,0)+0.001,\"НЕТ ДОСТАВКИ\")","v":1550.001},{"$f":"IFERROR(F24+D26,\"НЕТ ДОСТАВКИ\")","v":278840.00099999999},{"$f":"IFERROR(D26&\" + НПл\",\"НЕТ ДОСТАВКИ\")","v":"1550,001 + НПл"},{"$f":"IFERROR(CEILING((F24+D26)*(1+$D$25/100),50),0)","v":284450},null,null,null,null,null,null,null,null,{"$f":"N26","v":0},{"$f":"TEXT(SUM(MID(0&P26,LARGE(ISNUMBER(-MID(P26,ROW($1:$88),1))*ROW($1:$88),ROW($1:$15)+15)+1,1)*10^ROW($1:$15)/10),REPT(0,MIN(MAX(COUNT(1/(MID(P26,ROW($1:$88),1)+1))-15,),15)))&TEXT(SUM(MID(0&P26,LARGE(ISNUMBER(-MID(P26,ROW($1:$88),1))*ROW($1:$88),ROW($1:$15))+1,1)*10^ROW($1:$15)/10),REPT(0,MIN(COUNT(1/(MID(P26,ROW($1:$88),1)+1)),15)))","v":"0"}]
[null,null,{"$f":"IFERROR(\"AVIS Econom\"&\"  \"&VLOOKUP((LEFT(B34,(LEN(B34)))),'ТАРИФЫ ТК'!A4:A134,1,0),\"НЕТ ДОСТАВКИ\")","v":"AVIS Econom  Шымкент"},3500,{"$f":"IFERROR(F24+D27,\"НЕТ ДОСТАВКИ\")","v":280790},{"$f":"IFERROR(D27&\" + НПл\",\"НЕТ ДОСТАВКИ\")","v":"3500 + НПл"},{"$f":"IFERROR(CEILING((F24+D27)*(1+$D$25/100),50),0)","v":286450},null,null,null,null,null,null,null,null,0,{"$f":"TEXT(SUM(MID(0&P27,LARGE(ISNUMBER(-MID(P27,ROW($1:$88),1))*ROW($1:$88),ROW($1:$15)+15)+1,1)*10^ROW($1:$15)/10),REPT(0,MIN(MAX(COUNT(1/(MID(P27,ROW($1:$88),1)+1))-15,),15)))&TEXT(SUM(MID(0&P27,LARGE(ISNUMBER(-MID(P27,ROW($1:$88),1))*ROW($1:$88),ROW($1:$15))+1,1)*10^ROW($1:$15)/10),REPT(0,MIN(COUNT(1/(MID(P27,ROW($1:$88),1)+1)),15)))","v":"0"}]
[null,null,{"$f":"IFERROR(IF(A29<1,\"AVIS EXPRESS\"&\"  \"&VLOOKUP((LEFT(B34,(LEN(B34)))),'ТАРИФЫ ТК'!E4:G20,1,0),\"AV ВИМАНИЕ:   В Е С    П О С Ы Л К И    Б О Л Ь Ш Е   0,5 КГ   !!!\"),\"НЕТ ДОСТАВКИ\")","v":"AVIS EXPRESS  Шымкент"},7700,{"$f":"IFERROR(F24+D28,\"НЕТ ДОСТАВКИ\")","v":284990},{"$f":"D28&\" + НПл\"","v":"7700 + НПл"},{"$f":"IFERROR(CEILING((F24+D28)*(1+$D$25/100),50),\"НЕТ ДОСТАВКИ\")","v":290700},null,null,null,null,null,null,null,null,0,{"$f":"TEXT(SUM(MID(0&P28,LARGE(ISNUMBER(-MID(P28,ROW($1:$88),1))*ROW($1:$88),ROW($1:$15)+15)+1,1)*10^ROW($1:$15)/10),REPT(0,MIN(MAX(COUNT(1/(MID(P28,ROW($1:$88),1)+1))-15,),15)))&TEXT(SUM(MID(0&P28,LARGE(ISNUMBER(-MID(P28,ROW($1:$88),1))*ROW($1:$88),ROW($1:$15))+1,1)*10^ROW($1:$15)/10),REPT(0,MIN(COUNT(1/(MID(P28,ROW($1:$88),1)+1)),15)))","v":"0"}]
[{"$f":"IFERROR(A25*1.5,\"Количество ??\")","v":0},null,null,"К ОПЛАТЕ:",{"$f":"IFERROR(F24+E25,0)","v":284990},286720,{"$f":"IFERROR(CEILING((F24+E25)*1.03,50),0)","v":293550},null,null,{"$f":"IFERROR(J25*1.5,\"Количество ??\")","v":0},null,null,null,null,null,0,{"$f":"TEXT(SUM(MID(0&P29,LARGE(ISNUMBER(-MID(P29,ROW($1:$88),1))*ROW($1:$88),ROW($1:$15)+15)+1,1)*10^ROW($1:$15)/10),REPT(0,MIN(MAX(COUNT(1/(MID(P29,ROW($1:$88),1)+1))-15,),15)))&TEXT(SUM(MID(0&P29,LARGE(ISNUMBER(-MID(P29,ROW($1:$88),1))*ROW($1:$88),ROW($1:$15))+1,1)*10^ROW($1:$15)/10),REPT(0,MIN(COUNT(1/(MID(P29,ROW($1:$88),1)+1)),15)))","v":"0"}]
["rc11091kz",null,{"$f":"IFERROR((P14&\"        \"&LEFT(P15,8)&\" = \"&TEXT(R15,\"### ### ###\")&\" т.\"),\"НЕТ ДОСТАВКИ\")","v":"        0 =  т."},null,{"$f":"IFERROR(\"QIWI = \"&CEILING((E26*1.02),10),0)","v":"QIWI = 284420"},{"$f":"IFERROR(F29-F24,\"УКАЖИТЕ ТК\")","v":9430},null,null,null,null,null,null,null,null,null,0,{"$f":"TEXT(SUM(MID(0&P30,LARGE(ISNUMBER(-MID(P30,ROW($1:$88),1))*ROW($1:$88),ROW($1:$15)+15)+1,1)*10^ROW($1:$15)/10),REPT(0,MIN(MAX(COUNT(1/(MID(P30,ROW($1:$88),1)+1))-15,),15)))&TEXT(SUM(MID(0&P30,LARGE(ISNUMBER(-MID(P30,ROW($1:$88),1))*ROW($1:$88),ROW($1:$15))+1,1)*10^ROW($1:$15)/10),REPT(0,MIN(COUNT(1/(MID(P30,ROW($1:$88),1)+1)),15)))","v":"0"}]
[{"$f":"A1","v":"+СЧЁТ Альфа-Банк+Сч0908++0"},"ПОЛУЧАТЕЛЬ:","rc11091kz",null,null,null,null,null,null,null,null,null,null,null,null,0,{"$f":"TEXT(SUM(MID(0&P31,LARGE(ISNUMBER(-MID(P31,ROW($1:$88),1))*ROW($1:$88),ROW($1:$15)+15)+1,1)*10^ROW($1:$15)/10),REPT(0,MIN(MAX(COUNT(1/(MID(P31,ROW($1:$88),1)+1))-15,),15)))&TEXT(SUM(MID(0&P31,LARGE(ISNUMBER(-MID(P31,ROW($1:$88),1))*ROW($1:$88),ROW($1:$15))+1,1)*10^ROW($1:$15)/10),REPT(0,MIN(COUNT(1/(MID(P31,ROW($1:$88),1)+1)),15)))","v":"0"}]
[{"$f":"UPPER((B3))","v":"ТОО ZZZ"},null,{"$f":"IFERROR(MID(НайтиСтрокуПоСлову(\"Комментарий: Имя :\",K1:K45),20,99),0)","v":0},null,null,null,null,null,null,null,null,null,null,null,null,0,{"$f":"TEXT(SUM(MID(0&P32,LARGE(ISNUMBER(-MID(P32,ROW($1:$88),1))*ROW($1:$88),ROW($1:$15)+15)+1,1)*10^ROW($1:$15)/10),REPT(0,MIN(MAX(COUNT(1/(MID(P32,ROW($1:$88),1)+1))-15,),15)))&TEXT(SUM(MID(0&P32,LARGE(ISNUMBER(-MID(P32,ROW($1:$88),1))*ROW($1:$88),ROW($1:$15))+1,1)*10^ROW($1:$15)/10),REPT(0,MIN(COUNT(1/(MID(P32,ROW($1:$88),1)+1)),15)))","v":"0"}]
["Область: ",{"$f":"UPPER((P18))","v":""},{"$f":"IFERROR(ПоискСНачала(C32,\"Телефон\"),0)","v":0},null,{"$f":"IFERROR(ПоискМежду(C32,\"Телефон :\",\"Примечание\"),0)","v":0},{"$f":"IFERROR(IF(LEFT(ПоискСКонца(C32,\"Примечание : \"),2)=\"г \",MID(ПоискСКонца(C32,\"Примечание : \"),3,99),IF(LEFT(ПоискСКонца(C32,\"Примечание : \"),3)=\"г. \",MID(ПоискСКонца(C32,\"Примечание : \"),4,99),IF(LEFT(ПоискСКонца(C32,\"Примечание : \"),3)=\"гор\",MID(ПоискСКонца(C32,\"Примечание : \"),6,99),0))),0)","v":0},null,null,null,null,null,null,null,null,null,0,{"$f":"TEXT(SUM(MID(0&P33,LARGE(ISNUMBER(-MID(P33,ROW($1:$88),1))*ROW($1:$88),ROW($1:$15)+15)+1,1)*10^ROW($1:$15)/10),REPT(0,MIN(MAX(COUNT(1/(MID(P33,ROW($1:$88),1)+1))-15,),15)))&TEXT(SUM(MID(0&P33,LARGE(ISNUMBER(-MID(P33,ROW($1:$88),1))*ROW($1:$88),ROW($1:$15))+1,1)*10^ROW($1:$15)/10),REPT(0,MIN(COUNT(1/(MID(P33,ROW($1:$88),1)+1)),15)))","v":"0"}]
["Город: ","Шымкент",null,null,null,null,null,null,null,null,null,null,null,null,null,0,{"$f":"TEXT(SUM(MID(0&P34,LARGE(ISNUMBER(-MID(P34,ROW($1:$88),1))*ROW($1:$88),ROW($1:$15)+15)+1,1)*10^ROW($1:$15)/10),REPT(0,MIN(MAX(COUNT(1/(MID(P34,ROW($1:$88),1)+1))-15,),15)))&TEXT(SUM(MID(0&P34,LARGE(ISNUMBER(-MID(P34,ROW($1:$88),1))*ROW($1:$88),ROW($1:$15))+1,1)*10^ROW($1:$15)/10),REPT(0,MIN(COUNT(1/(MID(P34,ROW($1:$88),1)+1)),15)))","v":"0"}]
["Улица: ",{"$f":"UPPER((P20))","v":""},null,null,null,null,null,null,null,null,null,null,null,null,null,0,{"$f":"TEXT(SUM(MID(0&P35,LARGE(ISNUMBER(-MID(P35,ROW($1:$88),1))*ROW($1:$88),ROW($1:$15)+15)+1,1)*10^ROW($1:$15)/10),REPT(0,MIN(MAX(COUNT(1/(MID(P35,ROW($1:$88),1)+1))-15,),15)))&TEXT(SUM(MID(0&P35,LARGE(ISNUMBER(-MID(P35,ROW($1:$88),1))*ROW($1:$88),ROW($1:$15))+1,1)*10^ROW($1:$15)/10),REPT(0,MIN(COUNT(1/(MID(P35,ROW($1:$88),1)+1)),15)))","v":"0"}]
["Здание: ",{"$f":"P21","v":""},null,null,null,null,null,null,null,null,null,null,null,null,null,0,{"$f":"TEXT(SUM(MID(0&P36,LARGE(ISNUMBER(-MID(P36,ROW($1:$88),1))*ROW($1:$88),ROW($1:$15)+15)+1,1)*10^ROW($1:$15)/10),REPT(0,MIN(MAX(COUNT(1/(MID(P36,ROW($1:$88),1)+1))-15,),15)))&TEXT(SUM(MID(0&P36,LARGE(ISNUMBER(-MID(P36,ROW($1:$88),1))*ROW($1:$88),ROW($1:$15))+1,1)*10^ROW($1:$15)/10),REPT(0,MIN(COUNT(1/(MID(P36,ROW($1:$88),1)+1)),15)))","v":"0"}]
["Квартира: ",{"$f":"P22","v":""},null,null,null,null,null,null,null,null,null,null,null,null,null,0,{"$f":"TEXT(SUM(MID(0&P37,LARGE(ISNUMBER(-MID(P37,ROW($1:$88),1))*ROW($1:$88),ROW($1:$15)+15)+1,1)*10^ROW($1:$15)/10),REPT(0,MIN(MAX(COUNT(1/(MID(P37,ROW($1:$88),1)+1))-15,),15)))&TEXT(SUM(MID(0&P37,LARGE(ISNUMBER(-MID(P37,ROW($1:$88),1))*ROW($1:$88),ROW($1:$15))+1,1)*10^ROW($1:$15)/10),REPT(0,MIN(COUNT(1/(MID(P37,ROW($1:$88),1)+1)),15)))","v":"0"}]
["Телефон: ",{"$f":"B4","v":"8-705-767-77-77   0----   ----"},null,null,null,null,null,null,null,null,null,null,null,null,null,0,{"$f":"TEXT(SUM(MID(0&P38,LARGE(ISNUMBER(-MID(P38,ROW($1:$88),1))*ROW($1:$88),ROW($1:$15)+15)+1,1)*10^ROW($1:$15)/10),REPT(0,MIN(MAX(COUNT(1/(MID(P38,ROW($1:$88),1)+1))-15,),15)))&TEXT(SUM(MID(0&P38,LARGE(ISNUMBER(-MID(P38,ROW($1:$88),1))*ROW($1:$88),ROW($1:$15))+1,1)*10^ROW($1:$15)/10),REPT(0,MIN(COUNT(1/(MID(P38,ROW($1:$88),1)+1)),15)))","v":"0"}]
["Индекс: ",{"$f":"P16","v":""},null,null,null,null,null,null,null,null,null,null,null,null,null,null,{"$f":"IF(LEFT(#REF!,4)=\"ваша\",VALUE(MID(#REF!,13,20))*100,0)","v":{"$error":"#REF!"}}]
["Компания:",null,null,null,null,null,null,null,null,null,null,null,null,null,null,null,{"$f":"IF(LEFT(#REF!,4)=\"ваша\",VALUE(MID(#REF!,13,20))*100,0)","v":{"$error":"#REF!"}}]
["ИИН:",{"$f":"F29","v":286720},null,null,null,null,null,null,null,null,null,null,null,null,null,null,{"$f":"IF(LEFT(#REF!,4)=\"ваша\",VALUE(MID(#REF!,13,20))*100,0)","v":{"$error":"#REF!"}}]
["------------------------","----------------------------------------------------","----------------------------------------------------","------------------------","------------------------","---------------------------","------------------------------","------------------------","------------------------",null,null,null,null,null,null,null,{"$f":"SUM(Q19:Q41)","v":{"$error":"#REF!"}}]

{"sheet":"+СЧЁТ Альфа-Банк+Сч0608_1++0","index":14,"n_rows":42,"n_cols":21,"rows_kept":42,"cut":false,"hidden":false,"merged":[[27,6,27,8],[31,0,31,1],[37,1,37,2],[0,4,0,7],[1,4,1,8],[2,1,2,2],[3,1,3,2],[25,6,25,8],[26,6,26,8]]}
[{"$f":"IF(LEFT(C29,2)=\"сп\",P1&\" ► СП\",IF(E25=D26,P1,IF(H6<>0,P1&\"++\"&\"0\",IF(E25=D27,P1&\"++\"&\"0\",IF(E25=D28,P1&\"++\"&\"0\",IF(E25=D27,P1&\"++\"&\"0\",IF(E25=D28,P1&\"++\"&\"0\",IF(LEFT(C25,2)=\"AV\",P1&\"++\"&F29,P1))))))))","v":"+СЧЁТ Альфа-Банк+Сч0608_1++0"},"2020-08-06",{"$f":"IF(E2>0,\"ОТПРАВЛЕНО\",IF(LEFT(C29,3)=\"ЗАК\",\"ЗАКАЗАНО в СПБ\",IF(G24>=0,\"ОПЛОЧЕНО\",\"ОЖИДАНИЕ ОПЛАТЫ\")))","v":"ОТПРАВЛЕНО"},{"$f":"'СПИСОК ЗАКАЗОВ'!B1","v":21},"2020-08-07",null,null,null,{"$f":"A1","v":"+СЧЁТ Альфа-Банк+Сч0608_1++0"},null,"Сч0608_1",null,null,null,null,{"$f":"IF(G24>0,\"+\"&H6&\"+\"&Q1,Q1)","v":"+СЧЁТ Альфа-Банк+Сч0608_1"},{"$f":"ПоискСКонца(K1,\"№\")","v":"Сч0608_1"}]
["Логин",{"$f":"L3","v":"Логин"},"Номер накл-ой",null,3611543,null,null,null,null,null,"Примечание"]
["ФИО",{"$f":"IF(C32=0,UPPER((P9)),UPPER(C33))","v":"ИП ОЛИМП СТАХАНОВА МАРИЯ "},null,null,null,null,null,null,null,null,"Логин","Логин"]
["Телефон",{"$f":"R12","v":"7-705-223-60-10   0----   ----"},null,null,{"$f":"IF(F4>0.5,\"оплачено\",IF(F4<0,\"ОПЛАТИТЬ= \"&G4,\"ОПЛАТИТЬ= \"&Q25))","v":"ОПЛАТИТЬ= 1400"},0,1100,null,null,null,"Дата заказа","дата заказа"]
["e-mail:",{"$f":"L11","v":"-"}]
["Вес","ПРИМЕЧАНИЯ","Наименование","Кол-во","Цена","Всего",{"$f":"IF(MAX(G7:G25)>0,MAX(G7:G25),\"\")","v":"2020-08-21"},{"$f":"IF(I7>0,\"НАЛ\",IF(I8>0,\"ПЕРЕВОД\",IF(I9>0,\"Beeline\",IF(I10>0,\"KASPI\",IF(I11>0,\"QIWI\",IF(I12>0,\"СЧЁТ Альфа-Банк\",0))))))","v":"СЧЁТ Альфа-Банк"},{"$f":"SUM(I7:I28)","v":8592}]
[{"$f":"IF(L24>0,Q24*1/100,\"\")","v":""},"списано","Неодимовый магнит D10x2mm(Аксиал)`42 (сила притяжения 1,8 кг)",48,54,{"$f":"IF(D7<>\"\",E7*D7,\"\")","v":2592},{"$f":"IF(I7 >0,TODAY(),\"\")","v":""},"НАЛ",null,{"$f":"IFERROR(IFERROR(VLOOKUP(C7,#REF!,3,0)*D7,VLOOKUP(C7,#REF!,7,0)*D7),\"нет веса\")","v":"нет веса"},"Заказ №2080"]
[{"$f":"IF(L25>0,Q25*1/100,\"\")","v":""},"списано","Неодимовый магнит D10x5mm(Аксиал)`42 (сила притяжения 2,5 кг)",48,112,5376,"","ПЕРЕВОД",null,{"$f":"IFERROR(IFERROR(VLOOKUP(C8,#REF!,3,0)*D8,VLOOKUP(C8,#REF!,7,0)*D8),\"нет веса\")","v":"нет веса"}]
[{"$f":"IF(L26>0,Q26*1/100,\"\")","v":""},null,{"$f":"IF(L28<>\"\",K28,\"\")","v":""},{"$f":"IF(L28>0,L28,\"\")","v":""},{"$f":"IF(M28=\"уточняйте\",0,IF(L28>0,M28,\"\"))","v":""},"","","Beeline",null,{"$f":"IFERROR(IFERROR(VLOOKUP(C9,#REF!,3,0)*D9,VLOOKUP(C9,#REF!,7,0)*D9),\"нет веса\")","v":"нет веса"},"Здравствуйте, ИП Олимп Стаханова Мария ",null,null,null,null,{"$f":"MID(K9,15,70)","v":"ИП Олимп Стаханова Мария "},{"$f":"TEXT(SUM(MID(0&L9,LARGE(ISNUMBER(-MID(L9,ROW($1:$96),1))*ROW($1:$96),ROW($1:$23)+15)+1,1)*10^ROW($1:$23)/10),REPT(0,MIN(MAX(COUNT(1/(MID(L9,ROW($1:$96),1)+1))-15,),15)))&TEXT(SUM(MID(0&L9,LARGE(ISNUMBER(-MID(L9,ROW($1:$96),1))*ROW($1:$96),ROW($1:$23))+1,1)*10^ROW($1:$23)/10),REPT(0,MIN(COUNT(1/(MID(L9,ROW($1:$96),1)+1)),15)))","v":""}]
["",null,"","","","","","KASPI",null,{"$f":"IFERROR(IFERROR(VLOOKUP(C10,#REF!,3,0)*D10,VLOOKUP(C10,#REF!,7,0)*D10),\"нет веса\")","v":"нет веса"},"Мы получили Ваш заказ номер, 7638"]
["",null,"","","","","","QIWI",null,{"$f":"IFERROR(IFERROR(VLOOKUP(C11,#REF!,3,0)*D11,VLOOKUP(C11,#REF!,7,0)*D11),\"нет веса\")","v":"нет веса"},"Электронная почта","-"]
["",null,"","","","","2020-08-21","СЧЁТ Альфа-Банк",{"$f":"F29","v":8592},{"$f":"IFERROR(IFERROR(VLOOKUP(C12,#REF!,3,0)*D12,VLOOKUP(C12,#REF!,7,0)*D12),\"нет веса\")","v":"нет веса"},"Контактный телефон","7-705-2236010",null,null,null,{"$f":"(L12&\"  \"&P13)","v":"7-705-2236010  0"},{"$f":"TEXT(SUM(MID(0&P12,LARGE(ISNUMBER(-MID(P12,ROW($1:$99),1))*ROW($1:$99),ROW($1:$15)+30)+1,1)*10^ROW($1:$15)/10),REPT(0,MIN(MAX(COUNT(1/(MID(P12,ROW($1:$99),1)+1))-30,),15)))&TEXT(SUM(MID(0&P12,LARGE(ISNUMBER(-MID(P12,ROW($1:$99),1))*ROW($1:$99),ROW($1:$15)+15)+1,1)*10^ROW($1:$15)/10),REPT(0,MIN(MAX(COUNT(1/(MID(P12,ROW($1:$99),1)+1))-15,),15)))&TEXT(SUM(MID(0&P12,LARGE(ISNUMBER(-MID(P12,ROW($1:$99),1))*ROW($1:$99),ROW($1:$15))+1,1)*10^ROW($1:$15)/10),REPT(0,MIN(COUNT(1/(MID(P12,ROW($1:$99),1)+1)),15)))","v":"770522360100"},{"$f":"(MID(Q12,1,1))&\"-\"&(MID(Q12,2,3))&\"-\"&(MID(Q12,5,3))&\"-\"&(MID(Q12,8,2))&\"-\"&(MID(Q12,10,2))&\"   \"&(MID(Q12,12,1))&\"-\"&(MID(Q12,13,3))&\"-\"&(MID(Q12,16,3))&\"-\"&(MID(Q12,19,2))&\"-\"&(MID(Q12,21,2))&\"   \"&(MID(Q12,23,1))&\"-\"&(MID(Q12,24,3))&\"-\"&(MID(Q12,27,3))&\"-\"&(MID(Q12,30,2))&\"-\"&(MID(Q12,32,2))","v":"7-705-223-60-10   0----   ----"}]
["",null,"","","","","",null,null,{"$f":"IFERROR(IFERROR(VLOOKUP(C13,#REF!,3,0)*D13,VLOOKUP(C13,#REF!,7,0)*D13),\"нет веса\")","v":"нет веса"},null,null,null,null,null,{"$f":"IF(L13=\"-\",IFERROR(НайтиСтрокуПоСлову(\"Комментарий\",K27:K60),0),L13)","v":0}]
["",null,"","","","","",null,null,{"$f":"IFERROR(IFERROR(VLOOKUP(C14,#REF!,3,0)*D14,VLOOKUP(C14,#REF!,7,0)*D14),\"нет веса\")","v":"нет веса"},"Доставка:",null,null,null,null,{"$f":"MID(L14,23,70)","v":""}]
["",null,"","","","","",null,null,{"$f":"IFERROR(IFERROR(VLOOKUP(C15,#REF!,3,0)*D15,VLOOKUP(C15,#REF!,7,0)*D15),\"нет веса\")","v":"нет веса"},"Оплата:",null,null,null,null,{"$f":"IF(LEFT(P14,2)=\"EX\",MID(L15,11,70),L15)","v":0},{"$f":"TEXT(SUM(MID(0&P15,LARGE(ISNUMBER(-MID(P15,ROW($1:$88),1))*ROW($1:$88),ROW($1:$15)+15)+1,1)*10^ROW($1:$15)/10),REPT(0,MIN(MAX(COUNT(1/(MID(P15,ROW($1:$88),1)+1))-15,),15)))&TEXT(SUM(MID(0&P15,LARGE(ISNUMBER(-MID(P15,ROW($1:$88),1))*ROW($1:$88),ROW($1:$15))+1,1)*10^ROW($1:$15)/10),REPT(0,MIN(COUNT(1/(MID(P15,ROW($1:$88),1)+1)),15)))","v":"0"},{"$f":"SUMPRODUCT(--SUBSTITUTE(Q15:Q15,CHAR(160),))","v":0},{"$f":"LEN(Q15)","v":1},{"$f":"FLOOR(S15/3,1)","v":0}]
["",null,"","","","","",null,null,{"$f":"IFERROR(IFERROR(VLOOKUP(C16,#REF!,3,0)*D16,VLOOKUP(C16,#REF!,7,0)*D16),\"нет веса\")","v":"нет веса"},"Адрес доставки","Индекс: ",null,null,null,{"$f":"MID(L16,9,70)","v":""}]
["",null,"","","","","",null,null,{"$f":"IFERROR(IFERROR(VLOOKUP(C17,#REF!,3,0)*D17,VLOOKUP(C17,#REF!,7,0)*D17),\"нет веса\")","v":"нет веса"},null,"Страна: ",null,null,null,{"$f":"MID(L17,9,70)","v":""},{"$f":"IF(LEFT(K17,4)=\"ваша\",VALUE(MID(K17,13,20))*100,0)","v":0}]
["",null,"","","","","",null,null,{"$f":"IFERROR(IFERROR(VLOOKUP(C18,#REF!,3,0)*D18,VLOOKUP(C18,#REF!,7,0)*D18),\"нет веса\")","v":"нет веса"},null,"Область: ",null,null,null,{"$f":"MID(L18,10,70)","v":""}]
["",null,"","","","","",null,null,{"$f":"IFERROR(IFERROR(VLOOKUP(C19,#REF!,3,0)*D19,VLOOKUP(C19,#REF!,7,0)*D19),\"нет веса\")","v":"нет веса"},null,"Город: ",null,null,null,{"$f":"MID(L19,8,70)","v":""},{"$f":"IF(LEFT(K19,4)=\"ваша\",VALUE(MID(K19,13,20))*100,0)","v":0}]
["",null,"","","","","",null,null,{"$f":"IFERROR(IFERROR(VLOOKUP(C20,#REF!,3,0)*D20,VLOOKUP(C20,#REF!,7,0)*D20),\"нет веса\")","v":"нет веса"},null,"Улица: ",null,null,null,{"$f":"MID(L20,8,70)","v":""},{"$f":"IF(LEFT(K31,4)=\"ваша\",VALUE(MID(K31,13,20))*100,0)","v":0}]
["",null,"","","","","",null,null,{"$f":"IFERROR(IFERROR(VLOOKUP(C21,#REF!,3,0)*D21,VLOOKUP(C21,#REF!,7,0)*D21),\"нет веса\")","v":"нет веса"},null,"Здание: ",null,null,null,{"$f":"MID(L21,9,70)","v":""},{"$f":"IF(LEFT(K32,4)=\"ваша\",VALUE(MID(K32,13,20))*100,0)","v":0}]
["",null,"","","","","",null,null,{"$f":"IFERROR(IFERROR(VLOOKUP(C22,#REF!,3,0)*D22,VLOOKUP(C22,#REF!,7,0)*D22),\"нет веса\")","v":"нет веса"},null,"Квартира: ",null,null,null,{"$f":"MID(L22,11,70)","v":""},{"$f":"IF(LEFT(#REF!,4)=\"ваша\",VALUE(MID(#REF!,13,20))*100,0)","v":{"$error":"#REF!"}}]
["",null,null,null,"Итого:",{"$f":"SUM(F7:F22)","v":7968},"",null,null,{"$f":"IF(K40>0,M40,\"\")","v":""},"Наименование","Количество","Цена","Вес","Всего",null,{"$f":"IF(LEFT(K33,4)=\"ваша\",VALUE(MID(K33,13,20))*100,0)","v":0}]
[{"$f":"IF(L41>0,N41,\"\")","v":""},null,null,"скидка:",10,{"$f":"F23-(F23*E24/100)","v":7171.2},{"$f":"IFERROR(SUM(I7:I22)-F29+1,0)","v":1},null,null,null,null,null,null,null,null,{"$f":"N24","v":0},{"$f":"TEXT(SUM(MID(0&P24,LARGE(ISNUMBER(-MID(P24,ROW($1:$88),1))*ROW($1:$88),ROW($1:$15)+15)+1,1)*10^ROW($1:$15)/10),REPT(0,MIN(MAX(COUNT(1/(MID(P24,ROW($1:$88),1)+1))-15,),15)))&TEXT(SUM(MID(0&P24,LARGE(ISNUMBER(-MID(P24,ROW($1:$88),1))*ROW($1:$88),ROW($1:$15))+1,1)*10^ROW($1:$15)/10),REPT(0,MIN(COUNT(1/(MID(P24,ROW($1:$88),1)+1)),15)))","v":"0"}]
[{"$f":"SUM(A7:A23)/1000*1.3","v":0},null,{"$f":"IF(E25=F26,\"Доставка БЕСПЛАТНО\",IF(E25=D26,C26,IF(E25=D27,C27,IF(E25=D28,C28,IF(E25=F27,C27&\" + НПл\",IF(E25=F28,C28&\" + НПл\",\"Укажите ТК\"))))))","v":"AVIS EXPRESS  Алматы"},2,{"$f":"D28","v":1400},null,{"$f":"IF(I25 >0,TODAY(),\"\")","v":""},null,null,{"$f":"SUM(J7:J22)/1000","v":0},null,null,null,null,null,{"$f":"E25","v":1400},{"$f":"TEXT(SUM(MID(0&P25,LARGE(ISNUMBER(-MID(P25,ROW($1:$88),1))*ROW($1:$88),ROW($1:$15)+15)+1,1)*10^ROW($1:$15)/10),REPT(0,MIN(MAX(COUNT(1/(MID(P25,ROW($1:$88),1)+1))-15,),15)))&TEXT(SUM(MID(0&P25,LARGE(ISNUMBER(-MID(P25,ROW($1:$88),1))*ROW($1:$88),ROW($1:$15))+1,1)*10^ROW($1:$15)/10),REPT(0,MIN(COUNT(1/(MID(P25,ROW($1:$88),1)+1)),15)))","v":"1400"},{"$f":"E25","v":1400},{"$f":"TEXT(SUM(MID(0&R25,LARGE(ISNUMBER(-MID(R25,ROW($1:$88),1))*ROW($1:$88),ROW($1:$15)+15)+1,1)*10^ROW($1:$15)/10),REPT(0,MIN(MAX(COUNT(1/(MID(R25,ROW($1:$88),1)+1))-15,),15)))&TEXT(SUM(MID(0&R25,LARGE(ISNUMBER(-MID(R25,ROW($1:$88),1))*ROW($1:$88),ROW($1:$15))+1,1)*10^ROW($1:$15)/10),REPT(0,MIN(COUNT(1/(MID(R25,ROW($1:$88),1)+1)),15)))","v":"1400"},null,{"$f":"TEXT(SUM(MID(0&E25,LARGE(ISNUMBER(-MID(E25,ROW($1:$88),1))*ROW($1:$88),ROW($1:$15)+15)+1,1)*10^ROW($1:$15)/10),REPT(0,MIN(MAX(COUNT(1/(MID(E25,ROW($1:$88),1)+1))-15,),15)))&TEXT(SUM(MID(0&E25,LARGE(ISNUMBER(-MID(E25,ROW($1:$88),1))*ROW($1:$88),ROW($1:$15))+1,1)*10^ROW($1:$15)/10),REPT(0,MIN(COUNT(1/(MID(E25,ROW($1:$88),1)+1)),15)))","v":{"$error":"#NUM!"}}]
[null,null,{"$f":"IFERROR(\"AVIS С А М О В Ы В О З \"&\"  \"&VLOOKUP((LEFT(B34,(LEN(B34)))),'ТАРИФЫ ТК'!J17:L268,1,0),\"НЕТ ДОСТАВКИ\")","v":"AVIS С А М О В Ы В О З   Алматы"},{"$f":"IFERROR(VLOOKUP((LEFT(B34,(LEN(B34)))),'ТАРИФЫ ТК'!J17:L268,3,0)+0.001,\"НЕТ ДОСТАВКИ\")","v":1550.001},{"$f":"IFERROR(F24+D26,\"НЕТ ДОСТАВКИ\")","v":8721.2009999999991},{"$f":"IFERROR(D26&\" + НПл\",\"НЕТ ДОСТАВКИ\")","v":"1550,001 + НПл"},{"$f":"IFERROR(CEILING((F24+D26)*(1+$D$25/100),50),0)","v":8900},null,null,null,null,null,null,null,null,{"$f":"N26","v":0},{"$f":"TEXT(SUM(MID(0&P26,LARGE(ISNUMBER(-MID(P26,ROW($1:$88),1))*ROW($1:$88),ROW($1:$15)+15)+1,1)*10^ROW($1:$15)/10),REPT(0,MIN(MAX(COUNT(1/(MID(P26,ROW($1:$88),1)+1))-15,),15)))&TEXT(SUM(MID(0&P26,LARGE(ISNUMBER(-MID(P26,ROW($1:$88),1))*ROW($1:$88),ROW($1:$15))+1,1)*10^ROW($1:$15)/10),REPT(0,MIN(COUNT(1/(MID(P26,ROW($1:$88),1)+1)),15)))","v":"0"}]
[null,null,{"$f":"IFERROR(\"AVIS Econom\"&\"  \"&VLOOKUP((LEFT(B34,(LEN(B34)))),'ТАРИФЫ ТК'!A4:A134,1,0),\"НЕТ ДОСТАВКИ\")","v":"AVIS Econom  Алматы"},{"$f":"IFERROR(VLOOKUP((LEFT(B34,(LEN(B34)))),'ТАРИФЫ ТК'!A4:C134,3,0),\"НЕТ ДОСТАВКИ\")","v":1300},{"$f":"IFERROR(F24+D27,\"НЕТ ДОСТАВКИ\")","v":8471.2000000000007},{"$f":"IFERROR(D27&\" + НПл\",\"НЕТ ДОСТАВКИ\")","v":"1300 + НПл"},{"$f":"IFERROR(CEILING((F24+D27)*(1+$D$25/100),50),0)","v":8650},null,null,null,null,null,null,null,null,0,{"$f":"TEXT(SUM(MID(0&P27,LARGE(ISNUMBER(-MID(P27,ROW($1:$88),1))*ROW($1:$88),ROW($1:$15)+15)+1,1)*10^ROW($1:$15)/10),REPT(0,MIN(MAX(COUNT(1/(MID(P27,ROW($1:$88),1)+1))-15,),15)))&TEXT(SUM(MID(0&P27,LARGE(ISNUMBER(-MID(P27,ROW($1:$88),1))*ROW($1:$88),ROW($1:$15))+1,1)*10^ROW($1:$15)/10),REPT(0,MIN(COUNT(1/(MID(P27,ROW($1:$88),1)+1)),15)))","v":"0"}]
[null,null,{"$f":"IFERROR(IF(A29<1,\"AVIS EXPRESS\"&\"  \"&VLOOKUP((LEFT(B34,(LEN(B34)))),'ТАРИФЫ ТК'!E4:G20,1,0),\"AV ВИМАНИЕ:   В Е С    П О С Ы Л К И    Б О Л Ь Ш Е   0,5 КГ   !!!\"),\"НЕТ ДОСТАВКИ\")","v":"AVIS EXPRESS  Алматы"},{"$f":"IFERROR(VLOOKUP((LEFT(B34,(LEN(B34)))),'ТАРИФЫ ТК'!E4:G20,3,0),\"НЕТ ДОСТАВКИ\")","v":1400},{"$f":"IFERROR(F24+D28,\"НЕТ ДОСТАВКИ\")","v":8571.2000000000007},{"$f":"D28&\" + НПл\"","v":"1400 + НПл"},{"$f":"IFERROR(CEILING((F24+D28)*(1+$D$25/100),50),\"НЕТ ДОСТАВКИ\")","v":8750},null,null,null,null,null,null,null,null,0,{"$f":"TEXT(SUM(MID(0&P28,LARGE(ISNUMBER(-MID(P28,ROW($1:$88),1))*ROW($1:$88),ROW($1:$15)+15)+1,1)*10^ROW($1:$15)/10),REPT(0,MIN(MAX(COUNT(1/(MID(P28,ROW($1:$88),1)+1))-15,),15)))&TEXT(SUM(MID(0&P28,LARGE(ISNUMBER(-MID(P28,ROW($1:$88),1))*ROW($1:$88),ROW($1:$15))+1,1)*10^ROW($1:$15)/10),REPT(0,MIN(COUNT(1/(MID(P28,ROW($1:$88),1)+1)),15)))","v":"0"}]
[{"$f":"IFERROR(A25*1.5,\"Количество ??\")","v":0},null,null,"К ОПЛАТЕ:",{"$f":"IFERROR(F24+E25,0)","v":8571.2000000000007},8592,{"$f":"IFERROR(CEILING((F24+E25)*1.03,50),0)","v":8850},null,null,{"$f":"IFERROR(J25*1.5,\"Количество ??\")","v":0},null,null,null,null,null,0,{"$f":"TEXT(SUM(MID(0&P29,LARGE(ISNUMBER(-MID(P29,ROW($1:$88),1))*ROW($1:$88),ROW($1:$15)+15)+1,1)*10^ROW($1:$15)/10),REPT(0,MIN(MAX(COUNT(1/(MID(P29,ROW($1:$88),1)+1))-15,),15)))&TEXT(SUM(MID(0&P29,LARGE(ISNUMBER(-MID(P29,ROW($1:$88),1))*ROW($1:$88),ROW($1:$15))+1,1)*10^ROW($1:$15)/10),REPT(0,MIN(COUNT(1/(MID(P29,ROW($1:$88),1)+1)),15)))","v":"0"}]
["rc11091kz",null,{"$f":"IFERROR((P14&\"        \"&LEFT(P15,8)&\" = \"&TEXT(R15,\"### ### ###\")&\" т.\"),\"НЕТ ДОСТАВКИ\")","v":"        0 =  т."},null,{"$f":"IFERROR(\"QIWI = \"&CEILING((E26*1.02),10),0)","v":"QIWI = 8900"},{"$f":"IFERROR(F29-F24,\"УКАЖИТЕ ТК\")","v":1420.8000000000002},null,null,null,null,null,null,null,null,null,0,{"$f":"TEXT(SUM(MID(0&P30,LARGE(ISNUMBER(-MID(P30,ROW($1:$88),1))*ROW($1:$88),ROW($1:$15)+15)+1,1)*10^ROW($1:$15)/10),REPT(0,MIN(MAX(COUNT(1/(MID(P30,ROW($1:$88),1)+1))-15,),15)))&TEXT(SUM(MID(0&P30,LARGE(ISNUMBER(-MID(P30,ROW($1:$88),1))*ROW($1:$88),ROW($1:$15))+1,1)*10^ROW($1:$15)/10),REPT(0,MIN(COUNT(1/(MID(P30,ROW($1:$88),1)+1)),15)))","v":"0"}]
[{"$f":"A1","v":"+СЧЁТ Альфа-Банк+Сч0608_1++0"},"ПОЛУЧАТЕЛЬ:","rc11091kz",null,null,null,null,null,null,null,null,null,null,null,null,0,{"$f":"TEXT(SUM(MID(0&P31,LARGE(ISNUMBER(-MID(P31,ROW($1:$88),1))*ROW($1:$88),ROW($1:$15)+15)+1,1)*10^ROW($1:$15)/10),REPT(0,MIN(MAX(COUNT(1/(MID(P31,ROW($1:$88),1)+1))-15,),15)))&TEXT(SUM(MID(0&P31,LARGE(ISNUMBER(-MID(P31,ROW($1:$88),1))*ROW($1:$88),ROW($1:$15))+1,1)*10^ROW($1:$15)/10),REPT(0,MIN(COUNT(1/(MID(P31,ROW($1:$88),1)+1)),15)))","v":"0"}]
[{"$f":"UPPER((B3))","v":"ИП ОЛИМП СТАХАНОВА МАРИЯ "},null,{"$f":"IFERROR(MID(НайтиСтрокуПоСлову(\"Комментарий: Имя :\",K1:K45),20,99),0)","v":0},null,null,null,null,null,null,null,null,null,null,null,null,0,{"$f":"TEXT(SUM(MID(0&P32,LARGE(ISNUMBER(-MID(P32,ROW($1:$88),1))*ROW($1:$88),ROW($1:$15)+15)+1,1)*10^ROW($1:$15)/10),REPT(0,MIN(MAX(COUNT(1/(MID(P32,ROW($1:$88),1)+1))-15,),15)))&TEXT(SUM(MID(0&P32,LARGE(ISNUMBER(-MID(P32,ROW($1:$88),1))*ROW($1:$88),ROW($1:$15))+1,1)*10^ROW($1:$15)/10),REPT(0,MIN(COUNT(1/(MID(P32,ROW($1:$88),1)+1)),15)))","v":"0"}]
["Область: ",{"$f":"UPPER((P18))","v":""},{"$f":"IFERROR(ПоискСНачала(C32,\"Телефон\"),0)","v":0},null,{"$f":"IFERROR(ПоискМежду(C32,\"Телефон :\",\"Примечание\"),0)","v":0},{"$f":"IFERROR(IF(LEFT(ПоискСКонца(C32,\"Примечание : \"),2)=\"г \",MID(ПоискСКонца(C32,\"Примечание : \"),3,99),IF(LEFT(ПоискСКонца(C32,\"Примечание : \"),3)=\"г. \",MID(ПоискСКонца(C32,\"Примечание : \"),4,99),IF(LEFT(ПоискСКонца(C32,\"Примечание : \"),3)=\"гор\",MID(ПоискСКонца(C32,\"Примечание : \"),6,99),0))),0)","v":0},null,null,null,null,null,null,null,null,null,0,{"$f":"TEXT(SUM(MID(0&P33,LARGE(ISNUMBER(-MID(P33,ROW($1:$88),1))*ROW($1:$88),ROW($1:$15)+15)+1,1)*10^ROW($1:$15)/10),REPT(0,MIN(MAX(COUNT(1/(MID(P33,ROW($1:$88),1)+1))-15,),15)))&TEXT(SUM(MID(0&P33,LARGE(ISNUMBER(-MID(P33,ROW($1:$88),1))*ROW($1:$88),ROW($1:$15))+1,1)*10^ROW($1:$15)/10),REPT(0,MIN(COUNT(1/(MID(P33,ROW($1:$88),1)+1)),15)))","v":"0"}]
["Город: ","Алматы",null,null,null,null,null,null,null,null,null,null,null,null,null,0,{"$f":"TEXT(SUM(MID(0&P34,LARGE(ISNUMBER(-MID(P34,ROW($1:$88),1))*ROW($1:$88),ROW($1:$15)+15)+1,1)*10^ROW($1:$15)/10),REPT(0,MIN(MAX(COUNT(1/(MID(P34,ROW($1:$88),1)+1))-15,),15)))&TEXT(SUM(MID(0&P34,LARGE(ISNUMBER(-MID(P34,ROW($1:$88),1))*ROW($1:$88),ROW($1:$15))+1,1)*10^ROW($1:$15)/10),REPT(0,MIN(COUNT(1/(MID(P34,ROW($1:$88),1)+1)),15)))","v":"0"}]
["Улица: ","Тимирязва",null,null,null,null,null,null,null,null,null,null,null,null,null,0,{"$f":"TEXT(SUM(MID(0&P35,LARGE(ISNUMBER(-MID(P35,ROW($1:$88),1))*ROW($1:$88),ROW($1:$15)+15)+1,1)*10^ROW($1:$15)/10),REPT(0,MIN(MAX(COUNT(1/(MID(P35,ROW($1:$88),1)+1))-15,),15)))&TEXT(SUM(MID(0&P35,LARGE(ISNUMBER(-MID(P35,ROW($1:$88),1))*ROW($1:$88),ROW($1:$15))+1,1)*10^ROW($1:$15)/10),REPT(0,MIN(COUNT(1/(MID(P35,ROW($1:$88),1)+1)),15)))","v":"0"}]
["Здание: ",58,null,null,null,null,null,null,null,null,null,null,null,null,null,0,{"$f":"TEXT(SUM(MID(0&P36,LARGE(ISNUMBER(-MID(P36,ROW($1:$88),1))*ROW($1:$88),ROW($1:$15)+15)+1,1)*10^ROW($1:$15)/10),REPT(0,MIN(MAX(COUNT(1/(MID(P36,ROW($1:$88),1)+1))-15,),15)))&TEXT(SUM(MID(0&P36,LARGE(ISNUMBER(-MID(P36,ROW($1:$88),1))*ROW($1:$88),ROW($1:$15))+1,1)*10^ROW($1:$15)/10),REPT(0,MIN(COUNT(1/(MID(P36,ROW($1:$88),1)+1)),15)))","v":"0"}]
["Квартира: ",36,null,null,null,null,null,null,null,null,null,null,null,null,null,0,{"$f":"TEXT(SUM(MID(0&P37,LARGE(ISNUMBER(-MID(P37,ROW($1:$88),1))*ROW($1:$88),ROW($1:$15)+15)+1,1)*10^ROW($1:$15)/10),REPT(0,MIN(MAX(COUNT(1/(MID(P37,ROW($1:$88),1)+1))-15,),15)))&TEXT(SUM(MID(0&P37,LARGE(ISNUMBER(-MID(P37,ROW($1:$88),1))*ROW($1:$88),ROW($1:$15))+1,1)*10^ROW($1:$15)/10),REPT(0,MIN(COUNT(1/(MID(P37,ROW($1:$88),1)+1)),15)))","v":"0"}]
["Телефон: ",{"$f":"B4","v":"7-705-223-60-10   0----   ----"},null,null,null,null,null,null,null,null,null,null,null,null,null,0,{"$f":"TEXT(SUM(MID(0&P38,LARGE(ISNUMBER(-MID(P38,ROW($1:$88),1))*ROW($1:$88),ROW($1:$15)+15)+1,1)*10^ROW($1:$15)/10),REPT(0,MIN(MAX(COUNT(1/(MID(P38,ROW($1:$88),1)+1))-15,),15)))&TEXT(SUM(MID(0&P38,LARGE(ISNUMBER(-MID(P38,ROW($1:$88),1))*ROW($1:$88),ROW($1:$15))+1,1)*10^ROW($1:$15)/10),REPT(0,MIN(COUNT(1/(MID(P38,ROW($1:$88),1)+1)),15)))","v":"0"}]
["Индекс: ",{"$f":"P16","v":""},null,null,null,null,null,null,null,null,null,null,null,null,null,null,{"$f":"IF(LEFT(#REF!,4)=\"ваша\",VALUE(MID(#REF!,13,20))*100,0)","v":{"$error":"#REF!"}}]
["Компания:",null,null,null,null,null,null,null,null,null,null,null,null,null,null,null,{"$f":"IF(LEFT(#REF!,4)=\"ваша\",VALUE(MID(#REF!,13,20))*100,0)","v":{"$error":"#REF!"}}]
["ИИН:",{"$f":"F29","v":8592},null,null,null,null,null,null,null,null,null,null,null,null,null,null,{"$f":"IF(LEFT(#REF!,4)=\"ваша\",VALUE(MID(#REF!,13,20))*100,0)","v":{"$error":"#REF!"}}]
["------------------------","----------------------------------------------------","----------------------------------------------------","------------------------","------------------------","---------------------------","------------------------------","------------------------","------------------------",null,null,null,null,null,null,null,{"$f":"SUM(Q19:Q41)","v":{"$error":"#REF!"}}]

{"sheet":"+KASPI+ 9630++0","index":15,"n_rows":42,"n_cols":21,"rows_kept":42,"cut":false,"hidden":false,"merged":[[27,6,27,8],[31,0,31,1],[37,1,37,2],[0,4,0,7],[1,4,1,8],[2,1,2,2],[3,1,3,2],[25,6,25,8],[26,6,26,8]]}
[{"$f":"IF(LEFT(C29,2)=\"сп\",P1&\" ► СП\",IF(E25=D26,P1,IF(H6<>0,P1&\"++\"&\"0\",IF(E25=D27,P1&\"++\"&\"0\",IF(E25=D28,P1&\"++\"&\"0\",IF(E25=D27,P1&\"++\"&\"0\",IF(E25=D28,P1&\"++\"&\"0\",IF(LEFT(C25,2)=\"AV\",P1&\"++\"&F29,P1))))))))","v":"+KASPI+ 9630++0"},{"$f":"L4","v":"2020-08-06T07:08:52"},{"$f":"IF(E2>0,\"ОТПРАВЛЕНО\",IF(LEFT(C29,3)=\"ЗАК\",\"ЗАКАЗАНО в СПБ\",IF(G24>=0,\"ОПЛОЧЕНО\",\"ОЖИДАНИЕ ОПЛАТЫ\")))","v":"ОТПРАВЛЕНО"},{"$f":"'СПИСОК ЗАКАЗОВ'!B1","v":21},"2020-08-06",null,null,null,{"$f":"A1","v":"+KASPI+ 9630++0"},null,"Заказ № 9630",null,null,null,null,{"$f":"IF(G24>0,\"+\"&H6&\"+\"&Q1,Q1)","v":"+KASPI+ 9630"},{"$f":"ПоискСКонца(K1,\"№\")","v":" 9630"}]
["Логин",{"$f":"L3","v":"asc_84@mail.ru"},"Номер накл-ой",null,3611541,null,null,null,null,null,"Примечание"]
["ФИО",{"$f":"IF(C32=0,UPPER((P9)),UPPER(C33))","v":"ШЕЛОМЕНЦЕВ АНТОН"},null,null,null,null,null,null,null,null,"Логин","asc_84@mail.ru"]
["Телефон",{"$f":"R12","v":"8-707-998-85-08   8-777-602-92-11   ----"},null,null,{"$f":"IF(F4>0.5,\"оплачено\",IF(F4<0,\"ОПЛАТИТЬ= \"&G4,\"ОПЛАТИТЬ= \"&Q25))","v":"ОПЛАТИТЬ= 1400"},0,1100,null,null,null,"Дата заказа","2020-08-06T07:08:52"]
["e-mail:",{"$f":"L11","v":"asc_84@mail.ru"}]
["Вес","ПРИМЕЧАНИЯ","Наименование","Кол-во","Цена","Всего",{"$f":"IF(MAX(G7:G25)>0,MAX(G7:G25),\"\")","v":"2020-08-21"},{"$f":"IF(I7>0,\"НАЛ\",IF(I8>0,\"ПЕРЕВОД\",IF(I9>0,\"Beeline\",IF(I10>0,\"KASPI\",IF(I11>0,\"QIWI\",IF(I12>0,\"СЧЁТ Альфа-Банк\",0))))))","v":"KASPI"},{"$f":"SUM(I7:I28)","v":5600}]
[{"$f":"IF(L24>0,Q24*1/100,\"\")","v":""},null,{"$f":"IF(L26<>\"\",K26,\"\")","v":""},{"$f":"IF(L26>0,L26,\"\")","v":""},{"$f":"IF(M26=\"уточняйте\",0,IF(L26>0,M26,\"\"))","v":""},{"$f":"IF(D7<>\"\",E7*D7,\"\")","v":""},{"$f":"IF(I7 >0,TODAY(),\"\")","v":""},"НАЛ",null,{"$f":"IFERROR(IFERROR(VLOOKUP(C7,#REF!,3,0)*D7,VLOOKUP(C7,#REF!,7,0)*D7),\"нет веса\")","v":"нет веса"},"Заказ №9630"]
[{"$f":"IF(L25>0,Q25*1/100,\"\")","v":""},null,null,null,null,"","","ПЕРЕВОД",null,{"$f":"IFERROR(IFERROR(VLOOKUP(C8,#REF!,3,0)*D8,VLOOKUP(C8,#REF!,7,0)*D8),\"нет веса\")","v":"нет веса"}]
[{"$f":"IF(L26>0,Q26*1/100,\"\")","v":""},"списано",{"$f":"IF(L28<>\"\",K28,\"\")","v":"Неодимовый магнит D8x2mm(Аксиал)`42 (сила притяжения 1,4 кг)"},{"$f":"IF(L28>0,L28,\"\")","v":100},{"$f":"IF(M28=\"уточняйте\",0,IF(L28>0,M28,\"\"))","v":42},4200,"","Beeline",null,{"$f":"IFERROR(IFERROR(VLOOKUP(C9,#REF!,3,0)*D9,VLOOKUP(C9,#REF!,7,0)*D9),\"нет веса\")","v":"нет веса"},"Здравствуйте, Шеломенцев Антон",null,null,null,null,{"$f":"MID(K9,15,70)","v":"Шеломенцев Антон"},{"$f":"TEXT(SUM(MID(0&L9,LARGE(ISNUMBER(-MID(L9,ROW($1:$96),1))*ROW($1:$96),ROW($1:$23)+15)+1,1)*10^ROW($1:$23)/10),REPT(0,MIN(MAX(COUNT(1/(MID(L9,ROW($1:$96),1)+1))-15,),15)))&TEXT(SUM(MID(0&L9,LARGE(ISNUMBER(-MID(L9,ROW($1:$96),1))*ROW($1:$96),ROW($1:$23))+1,1)*10^ROW($1:$23)/10),REPT(0,MIN(COUNT(1/(MID(L9,ROW($1:$96),1)+1)),15)))","v":""}]
[null,null,"","","","","2020-08-21","KASPI",{"$f":"F29","v":5600},{"$f":"IFERROR(IFERROR(VLOOKUP(C10,#REF!,3,0)*D10,VLOOKUP(C10,#REF!,7,0)*D10),\"нет веса\")","v":"нет веса"},"Мы получили Ваш заказ номер 9630"]
[null,null,"","","","","","QIWI",null,{"$f":"IFERROR(IFERROR(VLOOKUP(C11,#REF!,3,0)*D11,VLOOKUP(C11,#REF!,7,0)*D11),\"нет веса\")","v":"нет веса"},"Электронная почта","asc_84@mail.ru"]
["",null,"","","","","","СЧЁТ Альфа-Банк",null,{"$f":"IFERROR(IFERROR(VLOOKUP(C12,#REF!,3,0)*D12,VLOOKUP(C12,#REF!,7,0)*D12),\"нет веса\")","v":"нет веса"},"Контактный телефон","87079988508",null,null,null,{"$f":"(L12&\"  \"&P13)","v":"87079988508  87776029211"},{"$f":"TEXT(SUM(MID(0&P12,LARGE(ISNUMBER(-MID(P12,ROW($1:$99),1))*ROW($1:$99),ROW($1:$15)+30)+1,1)*10^ROW($1:$15)/10),REPT(0,MIN(MAX(COUNT(1/(MID(P12,ROW($1:$99),1)+1))-30,),15)))&TEXT(SUM(MID(0&P12,LARGE(ISNUMBER(-MID(P12,ROW($1:$99),1))*ROW($1:$99),ROW($1:$15)+15)+1,1)*10^ROW($1:$15)/10),REPT(0,MIN(MAX(COUNT(1/(MID(P12,ROW($1:$99),1)+1))-15,),15)))&TEXT(SUM(MID(0&P12,LARGE(ISNUMBER(-MID(P12,ROW($1:$99),1))*ROW($1:$99),ROW($1:$15))+1,1)*10^ROW($1:$15)/10),REPT(0,MIN(COUNT(1/(MID(P12,ROW($1:$99),1)+1)),15)))","v":"8707998850887776029211"},{"$f":"(MID(Q12,1,1))&\"-\"&(MID(Q12,2,3))&\"-\"&(MID(Q12,5,3))&\"-\"&(MID(Q12,8,2))&\"-\"&(MID(Q12,10,2))&\"   \"&(MID(Q12,12,1))&\"-\"&(MID(Q12,13,3))&\"-\"&(MID(Q12,16,3))&\"-\"&(MID(Q12,19,2))&\"-\"&(MID(Q12,21,2))&\"   \"&(MID(Q12,23,1))&\"-\"&(MID(Q12,24,3))&\"-\"&(MID(Q12,27,3))&\"-\"&(MID(Q12,30,2))&\"-\"&(MID(Q12,32,2))","v":"8-707-998-85-08   8-777-602-92-11   ----"}]
["",null,"","","","","",null,null,{"$f":"IFERROR(IFERROR(VLOOKUP(C13,#REF!,3,0)*D13,VLOOKUP(C13,#REF!,7,0)*D13),\"нет веса\")","v":"нет веса"},null,87776029211,null,null,null,{"$f":"IF(L13=\"-\",IFERROR(НайтиСтрокуПоСлову(\"Комментарий\",K27:K60),0),L13)","v":87776029211}]
["",null,"","","","","",null,null,{"$f":"IFERROR(IFERROR(VLOOKUP(C14,#REF!,3,0)*D14,VLOOKUP(C14,#REF!,7,0)*D14),\"нет веса\")","v":"нет веса"},"Оплата:","Предоплата банковской картой",null,null,null,{"$f":"MID(L14,23,70)","v":"картой"}]
["",null,"","","","","",null,null,{"$f":"IFERROR(IFERROR(VLOOKUP(C15,#REF!,3,0)*D15,VLOOKUP(C15,#REF!,7,0)*D15),\"нет веса\")","v":"нет веса"},"Доставка:","EMS KAZPOST",null,null,null,{"$f":"IF(LEFT(P14,2)=\"EX\",MID(L15,11,70),L15)","v":"EMS KAZPOST"},{"$f":"TEXT(SUM(MID(0&P15,LARGE(ISNUMBER(-MID(P15,ROW($1:$88),1))*ROW($1:$88),ROW($1:$15)+15)+1,1)*10^ROW($1:$15)/10),REPT(0,MIN(MAX(COUNT(1/(MID(P15,ROW($1:$88),1)+1))-15,),15)))&TEXT(SUM(MID(0&P15,LARGE(ISNUMBER(-MID(P15,ROW($1:$88),1))*ROW($1:$88),ROW($1:$15))+1,1)*10^ROW($1:$15)/10),REPT(0,MIN(COUNT(1/(MID(P15,ROW($1:$88),1)+1)),15)))","v":""},{"$f":"SUMPRODUCT(--SUBSTITUTE(Q15:Q15,CHAR(160),))","v":{"$error":"#VALUE!"}},{"$f":"LEN(Q15)","v":0},{"$f":"FLOOR(S15/3,1)","v":0}]
["",null,"","","","","",null,null,{"$f":"IFERROR(IFERROR(VLOOKUP(C16,#REF!,3,0)*D16,VLOOKUP(C16,#REF!,7,0)*D16),\"нет веса\")","v":"нет веса"},"Адрес доставки","Индекс:",null,null,null,{"$f":"MID(L16,9,70)","v":""}]
["",null,"","","","","",null,null,{"$f":"IFERROR(IFERROR(VLOOKUP(C17,#REF!,3,0)*D17,VLOOKUP(C17,#REF!,7,0)*D17),\"нет веса\")","v":"нет веса"},null,"Страна: Казахстан",null,null,null,{"$f":"MID(L17,9,70)","v":"Казахстан"},{"$f":"IF(LEFT(K17,4)=\"ваша\",VALUE(MID(K17,13,20))*100,0)","v":0}]
["",null,"","","","","",null,null,{"$f":"IFERROR(IFERROR(VLOOKUP(C18,#REF!,3,0)*D18,VLOOKUP(C18,#REF!,7,0)*D18),\"нет веса\")","v":"нет веса"},null,"Область: Алматинская",null,null,null,{"$f":"MID(L18,10,70)","v":"Алматинская"}]
["",null,"","","","","",null,null,{"$f":"IFERROR(IFERROR(VLOOKUP(C19,#REF!,3,0)*D19,VLOOKUP(C19,#REF!,7,0)*D19),\"нет веса\")","v":"нет веса"},null,"Город: Алматы",null,null,null,{"$f":"MID(L19,8,70)","v":"Алматы"},{"$f":"IF(LEFT(K19,4)=\"ваша\",VALUE(MID(K19,13,20))*100,0)","v":0}]
["",null,"","","","","",null,null,{"$f":"IFERROR(IFERROR(VLOOKUP(C20,#REF!,3,0)*D20,VLOOKUP(C20,#REF!,7,0)*D20),\"нет веса\")","v":"нет веса"},null,"Улица: Толе-би",null,null,null,{"$f":"MID(L20,8,70)","v":"Толе-би"},{"$f":"IF(LEFT(K31,4)=\"ваша\",VALUE(MID(K31,13,20))*100,0)","v":0}]
["",null,"","","","","",null,null,{"$f":"IFERROR(IFERROR(VLOOKUP(C21,#REF!,3,0)*D21,VLOOKUP(C21,#REF!,7,0)*D21),\"нет веса\")","v":"нет веса"},null,"Здание: 156",null,null,null,{"$f":"MID(L21,9,70)","v":"156"},{"$f":"IF(LEFT(K32,4)=\"ваша\",VALUE(MID(K32,13,20))*100,0)","v":0}]
["",null,"","","","","",null,null,{"$f":"IFERROR(IFERROR(VLOOKUP(C22,#REF!,3,0)*D22,VLOOKUP(C22,#REF!,7,0)*D22),\"нет веса\")","v":"нет веса"},null,"Квартира: 8",null,null,null,{"$f":"MID(L22,11,70)","v":"8"},{"$f":"IF(LEFT(#REF!,4)=\"ваша\",VALUE(MID(#REF!,13,20))*100,0)","v":{"$error":"#REF!"}}]
["",null,null,null,"Итого:",{"$f":"SUM(F7:F22)","v":4200},"",null,null,{"$f":"IF(K40>0,M40,\"\")","v":""},"Комментарий: Магнит, 100 шт.",null,null,null,null,null,{"$f":"IF(LEFT(K33,4)=\"ваша\",VALUE(MID(K33,13,20))*100,0)","v":0}]
[{"$f":"IF(L41>0,N41,\"\")","v":""},null,null,"скидка:",{"$f":"IF(F23>150000,10,IF(F23>100000,8,IF(F23>60000,5,IF(F23>30000,3,0))))","v":0},{"$f":"F23-(F23*E24/100)","v":4200},{"$f":"IFERROR(SUM(I7:I22)-F29+1,0)","v":1},null,null,null,null,null,null,null,null,{"$f":"N24","v":0},{"$f":"TEXT(SUM(MID(0&P24,LARGE(ISNUMBER(-MID(P24,ROW($1:$88),1))*ROW($1:$88),ROW($1:$15)+15)+1,1)*10^ROW($1:$15)/10),REPT(0,MIN(MAX(COUNT(1/(MID(P24,ROW($1:$88),1)+1))-15,),15)))&TEXT(SUM(MID(0&P24,LARGE(ISNUMBER(-MID(P24,ROW($1:$88),1))*ROW($1:$88),ROW($1:$15))+1,1)*10^ROW($1:$15)/10),REPT(0,MIN(COUNT(1/(MID(P24,ROW($1:$88),1)+1)),15)))","v":"0"}]
[{"$f":"SUM(A7:A23)/1000*1.3","v":0},null,{"$f":"IF(E25=F26,\"Доставка БЕСПЛАТНО\",IF(E25=D26,C26,IF(E25=D27,C27,IF(E25=D28,C28,IF(E25=F27,C27&\" + НПл\",IF(E25=F28,C28&\" + НПл\",\"Укажите ТК\"))))))","v":"AVIS EXPRESS  Алматы"},2,{"$f":"D28","v":1400},null,{"$f":"IF(I25 >0,TODAY(),\"\")","v":""},null,null,{"$f":"SUM(J7:J22)/1000","v":0},"ИНСТРУКЦИЯ ПО ОПЛАТЕ",null,null,null,null,{"$f":"E25","v":1400},{"$f":"TEXT(SUM(MID(0&P25,LARGE(ISNUMBER(-MID(P25,ROW($1:$88),1))*ROW($1:$88),ROW($1:$15)+15)+1,1)*10^ROW($1:$15)/10),REPT(0,MIN(MAX(COUNT(1/(MID(P25,ROW($1:$88),1)+1))-15,),15)))&TEXT(SUM(MID(0&P25,LARGE(ISNUMBER(-MID(P25,ROW($1:$88),1))*ROW($1:$88),ROW($1:$15))+1,1)*10^ROW($1:$15)/10),REPT(0,MIN(COUNT(1/(MID(P25,ROW($1:$88),1)+1)),15)))","v":"1400"},{"$f":"E25","v":1400},{"$f":"TEXT(SUM(MID(0&R25,LARGE(ISNUMBER(-MID(R25,ROW($1:$88),1))*ROW($1:$88),ROW($1:$15)+15)+1,1)*10^ROW($1:$15)/10),REPT(0,MIN(MAX(COUNT(1/(MID(R25,ROW($1:$88),1)+1))-15,),15)))&TEXT(SUM(MID(0&R25,LARGE(ISNUMBER(-MID(R25,ROW($1:$88),1))*ROW($1:$88),ROW($1:$15))+1,1)*10^ROW($1:$15)/10),REPT(0,MIN(COUNT(1/(MID(R25,ROW($1:$88),1)+1)),15)))","v":"1400"},null,{"$f":"TEXT(SUM(MID(0&E25,LARGE(ISNUMBER(-MID(E25,ROW($1:$88),1))*ROW($1:$88),ROW($1:$15)+15)+1,1)*10^ROW($1:$15)/10),REPT(0,MIN(MAX(COUNT(1/(MID(E25,ROW($1:$88),1)+1))-15,),15)))&TEXT(SUM(MID(0&E25,LARGE(ISNUMBER(-MID(E25,ROW($1:$88),1))*ROW($1:$88),ROW($1:$15))+1,1)*10^ROW($1:$15)/10),REPT(0,MIN(COUNT(1/(MID(E25,ROW($1:$88),1)+1)),15)))","v":{"$error":"#NUM!"}}]
[null,null,{"$f":"IFERROR(\"AVIS С А М О В Ы В О З \"&\"  \"&VLOOKUP((LEFT(B34,(LEN(B34)))),'ТАРИФЫ ТК'!J17:L268,1,0),\"НЕТ ДОСТАВКИ\")","v":"AVIS С А М О В Ы В О З   Алматы"},{"$f":"IFERROR(VLOOKUP((LEFT(B34,(LEN(B34)))),'ТАРИФЫ ТК'!J17:L268,3,0)+0.001,\"НЕТ ДОСТАВКИ\")","v":1550.001},{"$f":"IFERROR(F24+D26,\"НЕТ ДОСТАВКИ\")","v":5750.0010000000002},{"$f":"IFERROR(D26&\" + НПл\",\"НЕТ ДОСТАВКИ\")","v":"1550,001 + НПл"},{"$f":"IFERROR(CEILING((F24+D26)*(1+$D$25/100),50),0)","v":5900},null,null,null,null,null,null,null,null,{"$f":"N26","v":0},{"$f":"TEXT(SUM(MID(0&P26,LARGE(ISNUMBER(-MID(P26,ROW($1:$88),1))*ROW($1:$88),ROW($1:$15)+15)+1,1)*10^ROW($1:$15)/10),REPT(0,MIN(MAX(COUNT(1/(MID(P26,ROW($1:$88),1)+1))-15,),15)))&TEXT(SUM(MID(0&P26,LARGE(ISNUMBER(-MID(P26,ROW($1:$88),1))*ROW($1:$88),ROW($1:$15))+1,1)*10^ROW($1:$15)/10),REPT(0,MIN(COUNT(1/(MID(P26,ROW($1:$88),1)+1)),15)))","v":"0"}]
[null,null,{"$f":"IFERROR(\"AVIS Econom\"&\"  \"&VLOOKUP((LEFT(B34,(LEN(B34)))),'ТАРИФЫ ТК'!A4:A134,1,0),\"НЕТ ДОСТАВКИ\")","v":"AVIS Econom  Алматы"},{"$f":"IFERROR(VLOOKUP((LEFT(B34,(LEN(B34)))),'ТАРИФЫ ТК'!A4:C134,3,0),\"НЕТ ДОСТАВКИ\")","v":1300},{"$f":"IFERROR(F24+D27,\"НЕТ ДОСТАВКИ\")","v":5500},{"$f":"IFERROR(D27&\" + НПл\",\"НЕТ ДОСТАВКИ\")","v":"1300 + НПл"},{"$f":"IFERROR(CEILING((F24+D27)*(1+$D$25/100),50),0)","v":5650},null,null,null,"Наименование","Количество","Цена","Вес","Всего","Вес",{"$f":"TEXT(SUM(MID(0&P27,LARGE(ISNUMBER(-MID(P27,ROW($1:$88),1))*ROW($1:$88),ROW($1:$15)+15)+1,1)*10^ROW($1:$15)/10),REPT(0,MIN(MAX(COUNT(1/(MID(P27,ROW($1:$88),1)+1))-15,),15)))&TEXT(SUM(MID(0&P27,LARGE(ISNUMBER(-MID(P27,ROW($1:$88),1))*ROW($1:$88),ROW($1:$15))+1,1)*10^ROW($1:$15)/10),REPT(0,MIN(COUNT(1/(MID(P27,ROW($1:$88),1)+1)),15)))","v":""}]
[null,null,{"$f":"IFERROR(IF(A29<1,\"AVIS EXPRESS\"&\"  \"&VLOOKUP((LEFT(B34,(LEN(B34)))),'ТАРИФЫ ТК'!E4:G20,1,0),\"AV ВИМАНИЕ:   В Е С    П О С Ы Л К И    Б О Л Ь Ш Е   0,5 КГ   !!!\"),\"НЕТ ДОСТАВКИ\")","v":"AVIS EXPRESS  Алматы"},{"$f":"IFERROR(VLOOKUP((LEFT(B34,(LEN(B34)))),'ТАРИФЫ ТК'!E4:G20,3,0),\"НЕТ ДОСТАВКИ\")","v":1400},{"$f":"IFERROR(F24+D28,\"НЕТ ДОСТАВКИ\")","v":5600},{"$f":"D28&\" + НПл\"","v":"1400 + НПл"},{"$f":"IFERROR(CEILING((F24+D28)*(1+$D$25/100),50),\"НЕТ ДОСТАВКИ\")","v":5750},null,null,null,"Неодимовый магнит D8x2mm(Аксиал)`42 (сила притяжения 1,4 кг)",100,42,"75 гр.",4200,"75 гр.",{"$f":"TEXT(SUM(MID(0&P28,LARGE(ISNUMBER(-MID(P28,ROW($1:$88),1))*ROW($1:$88),ROW($1:$15)+15)+1,1)*10^ROW($1:$15)/10),REPT(0,MIN(MAX(COUNT(1/(MID(P28,ROW($1:$88),1)+1))-15,),15)))&TEXT(SUM(MID(0&P28,LARGE(ISNUMBER(-MID(P28,ROW($1:$88),1))*ROW($1:$88),ROW($1:$15))+1,1)*10^ROW($1:$15)/10),REPT(0,MIN(COUNT(1/(MID(P28,ROW($1:$88),1)+1)),15)))","v":"75"}]
[{"$f":"IFERROR(A25*1.5,\"Количество ??\")","v":0},null,null,"К ОПЛАТЕ:",{"$f":"IFERROR(F24+E25,0)","v":5600},{"$f":"IF(E25=C29,\"Доставка БЕСПЛАТНО\",IF(E25=D26,E26,IF(E25=D27,E27,IF(E25=D28,E28,IF(E25=F27,G27,IF(E25=F28,G28,IF(E25=F26,G26,\"Укажите ТК\")))))))","v":5600},{"$f":"IFERROR(CEILING((F24+E25)*1.03,50),0)","v":5800},null,null,{"$f":"IFERROR(J25*1.5,\"Количество ??\")","v":0},"Общий вес товаров: 75 гр.",null,null,null,null,0,{"$f":"TEXT(SUM(MID(0&P29,LARGE(ISNUMBER(-MID(P29,ROW($1:$88),1))*ROW($1:$88),ROW($1:$15)+15)+1,1)*10^ROW($1:$15)/10),REPT(0,MIN(MAX(COUNT(1/(MID(P29,ROW($1:$88),1)+1))-15,),15)))&TEXT(SUM(MID(0&P29,LARGE(ISNUMBER(-MID(P29,ROW($1:$88),1))*ROW($1:$88),ROW($1:$15))+1,1)*10^ROW($1:$15)/10),REPT(0,MIN(COUNT(1/(MID(P29,ROW($1:$88),1)+1)),15)))","v":"0"}]
["rc11091kz",null,{"$f":"IFERROR((P14&\"        \"&LEFT(P15,8)&\" = \"&TEXT(R15,\"### ### ###\")&\" т.\"),\"НЕТ ДОСТАВКИ\")","v":"НЕТ ДОСТАВКИ"},null,{"$f":"IFERROR(\"QIWI = \"&CEILING((E26*1.02),10),0)","v":"QIWI = 5870"},{"$f":"IFERROR(F29-F24,\"УКАЖИТЕ ТК\")","v":1400},null,null,null,null,"Доставка: 1750 тг.",null,null,null,null,0,{"$f":"TEXT(SUM(MID(0&P30,LARGE(ISNUMBER(-MID(P30,ROW($1:$88),1))*ROW($1:$88),ROW($1:$15)+15)+1,1)*10^ROW($1:$15)/10),REPT(0,MIN(MAX(COUNT(1/(MID(P30,ROW($1:$88),1)+1))-15,),15)))&TEXT(SUM(MID(0&P30,LARGE(ISNUMBER(-MID(P30,ROW($1:$88),1))*ROW($1:$88),ROW($1:$15))+1,1)*10^ROW($1:$15)/10),REPT(0,MIN(COUNT(1/(MID(P30,ROW($1:$88),1)+1)),15)))","v":"0"}]
[{"$f":"A1","v":"+KASPI+ 9630++0"},"ПОЛУЧАТЕЛЬ:","rc11091kz",null,null,null,null,null,null,null,"Итого: 5950 тг.",null,null,null,null,0,{"$f":"TEXT(SUM(MID(0&P31,LARGE(ISNUMBER(-MID(P31,ROW($1:$88),1))*ROW($1:$88),ROW($1:$15)+15)+1,1)*10^ROW($1:$15)/10),REPT(0,MIN(MAX(COUNT(1/(MID(P31,ROW($1:$88),1)+1))-15,),15)))&TEXT(SUM(MID(0&P31,LARGE(ISNUMBER(-MID(P31,ROW($1:$88),1))*ROW($1:$88),ROW($1:$15))+1,1)*10^ROW($1:$15)/10),REPT(0,MIN(COUNT(1/(MID(P31,ROW($1:$88),1)+1)),15)))","v":"0"}]
[{"$f":"UPPER((B3))","v":"ШЕЛОМЕНЦЕВ АНТОН"},null,{"$f":"IFERROR(MID(НайтиСтрокуПоСлову(\"Комментарий: Имя :\",K1:K45),20,99),0)","v":0},null,null,null,null,null,null,null,null,null,null,null,null,0,{"$f":"TEXT(SUM(MID(0&P32,LARGE(ISNUMBER(-MID(P32,ROW($1:$88),1))*ROW($1:$88),ROW($1:$15)+15)+1,1)*10^ROW($1:$15)/10),REPT(0,MIN(MAX(COUNT(1/(MID(P32,ROW($1:$88),1)+1))-15,),15)))&TEXT(SUM(MID(0&P32,LARGE(ISNUMBER(-MID(P32,ROW($1:$88),1))*ROW($1:$88),ROW($1:$15))+1,1)*10^ROW($1:$15)/10),REPT(0,MIN(COUNT(1/(MID(P32,ROW($1:$88),1)+1)),15)))","v":"0"}]
["Область: ",{"$f":"UPPER((P18))","v":"АЛМАТИНСКАЯ"},{"$f":"IFERROR(ПоискСНачала(C32,\"Телефон\"),0)","v":0},null,{"$f":"IFERROR(ПоискМежду(C32,\"Телефон :\",\"Примечание\"),0)","v":0},{"$f":"IFERROR(IF(LEFT(ПоискСКонца(C32,\"Примечание : \"),2)=\"г \",MID(ПоискСКонца(C32,\"Примечание : \"),3,99),IF(LEFT(ПоискСКонца(C32,\"Примечание : \"),3)=\"г. \",MID(ПоискСКонца(C32,\"Примечание : \"),4,99),IF(LEFT(ПоискСКонца(C32,\"Примечание : \"),3)=\"гор\",MID(ПоискСКонца(C32,\"Примечание : \"),6,99),0))),0)","v":0},null,null,null,null,null,null,null,null,null,0,{"$f":"TEXT(SUM(MID(0&P33,LARGE(ISNUMBER(-MID(P33,ROW($1:$88),1))*ROW($1:$88),ROW($1:$15)+15)+1,1)*10^ROW($1:$15)/10),REPT(0,MIN(MAX(COUNT(1/(MID(P33,ROW($1:$88),1)+1))-15,),15)))&TEXT(SUM(MID(0&P33,LARGE(ISNUMBER(-MID(P33,ROW($1:$88),1))*ROW($1:$88),ROW($1:$15))+1,1)*10^ROW($1:$15)/10),REPT(0,MIN(COUNT(1/(MID(P33,ROW($1:$88),1)+1)),15)))","v":"0"}]
["Город: ",{"$f":"UPPER((P19))","v":"АЛМАТЫ"},null,null,null,null,null,null,null,null,"EMS KAZPOST - Предоплата банковской картой",null,null,null,null,0,{"$f":"TEXT(SUM(MID(0&P34,LARGE(ISNUMBER(-MID(P34,ROW($1:$88),1))*ROW($1:$88),ROW($1:$15)+15)+1,1)*10^ROW($1:$15)/10),REPT(0,MIN(MAX(COUNT(1/(MID(P34,ROW($1:$88),1)+1))-15,),15)))&TEXT(SUM(MID(0&P34,LARGE(ISNUMBER(-MID(P34,ROW($1:$88),1))*ROW($1:$88),ROW($1:$15))+1,1)*10^ROW($1:$15)/10),REPT(0,MIN(COUNT(1/(MID(P34,ROW($1:$88),1)+1)),15)))","v":"0"}]
["Улица: ",{"$f":"UPPER((P20))","v":"ТОЛЕ-БИ"},null,null,null,null,null,null,null,null,"Назад",null,null,null,null,0,{"$f":"TEXT(SUM(MID(0&P35,LARGE(ISNUMBER(-MID(P35,ROW($1:$88),1))*ROW($1:$88),ROW($1:$15)+15)+1,1)*10^ROW($1:$15)/10),REPT(0,MIN(MAX(COUNT(1/(MID(P35,ROW($1:$88),1)+1))-15,),15)))&TEXT(SUM(MID(0&P35,LARGE(ISNUMBER(-MID(P35,ROW($1:$88),1))*ROW($1:$88),ROW($1:$15))+1,1)*10^ROW($1:$15)/10),REPT(0,MIN(COUNT(1/(MID(P35,ROW($1:$88),1)+1)),15)))","v":"0"}]
["Здание: ",{"$f":"P21","v":"156"},null,null,null,null,null,null,null,null,null,null,null,null,null,0,{"$f":"TEXT(SUM(MID(0&P36,LARGE(ISNUMBER(-MID(P36,ROW($1:$88),1))*ROW($1:$88),ROW($1:$15)+15)+1,1)*10^ROW($1:$15)/10),REPT(0,MIN(MAX(COUNT(1/(MID(P36,ROW($1:$88),1)+1))-15,),15)))&TEXT(SUM(MID(0&P36,LARGE(ISNUMBER(-MID(P36,ROW($1:$88),1))*ROW($1:$88),ROW($1:$15))+1,1)*10^ROW($1:$15)/10),REPT(0,MIN(COUNT(1/(MID(P36,ROW($1:$88),1)+1)),15)))","v":"0"}]
["Квартира: ",{"$f":"P22","v":"8"},null,null,null,null,null,null,null,null,null,null,null,null,null,0,{"$f":"TEXT(SUM(MID(0&P37,LARGE(ISNUMBER(-MID(P37,ROW($1:$88),1))*ROW($1:$88),ROW($1:$15)+15)+1,1)*10^ROW($1:$15)/10),REPT(0,MIN(MAX(COUNT(1/(MID(P37,ROW($1:$88),1)+1))-15,),15)))&TEXT(SUM(MID(0&P37,LARGE(ISNUMBER(-MID(P37,ROW($1:$88),1))*ROW($1:$88),ROW($1:$15))+1,1)*10^ROW($1:$15)/10),REPT(0,MIN(COUNT(1/(MID(P37,ROW($1:$88),1)+1)),15)))","v":"0"}]
["Телефон: ",{"$f":"B4","v":"8-707-998-85-08   8-777-602-92-11   ----"},null,null,null,null,null,null,null,null,null,null,null,null,null,0,{"$f":"TEXT(SUM(MID(0&P38,LARGE(ISNUMBER(-MID(P38,ROW($1:$88),1))*ROW($1:$88),ROW($1:$15)+15)+1,1)*10^ROW($1:$15)/10),REPT(0,MIN(MAX(COUNT(1/(MID(P38,ROW($1:$88),1)+1))-15,),15)))&TEXT(SUM(MID(0&P38,LARGE(ISNUMBER(-MID(P38,ROW($1:$88),1))*ROW($1:$88),ROW($1:$15))+1,1)*10^ROW($1:$15)/10),REPT(0,MIN(COUNT(1/(MID(P38,ROW($1:$88),1)+1)),15)))","v":"0"}]
["Индекс: ",{"$f":"P16","v":""},null,null,null,null,null,null,null,null,null,null,null,null,null,null,{"$f":"IF(LEFT(#REF!,4)=\"ваша\",VALUE(MID(#REF!,13,20))*100,0)","v":{"$error":"#REF!"}}]
["Компания:",null,null,null,null,null,null,null,null,null,null,null,null,null,null,null,{"$f":"IF(LEFT(#REF!,4)=\"ваша\",VALUE(MID(#REF!,13,20))*100,0)","v":{"$error":"#REF!"}}]
["ИИН:",{"$f":"F29","v":5600},null,null,null,null,null,null,null,null,null,null,null,null,null,null,{"$f":"IF(LEFT(#REF!,4)=\"ваша\",VALUE(MID(#REF!,13,20))*100,0)","v":{"$error":"#REF!"}}]
["------------------------","----------------------------------------------------","----------------------------------------------------","------------------------","------------------------","---------------------------","------------------------------","------------------------","------------------------",null,null,null,null,null,null,null,{"$f":"SUM(Q19:Q41)","v":{"$error":"#REF!"}}]

{"sheet":" +","index":16,"n_rows":49,"n_cols":21,"rows_kept":49,"cut":false,"hidden":false,"merged":[[24,20,24,22],[26,6,26,8],[27,6,27,8],[0,4,0,7],[1,2,1,3],[1,4,1,8],[2,1,2,2],[2,4,2,8],[3,1,3,2],[32,2,32,3],[32,5,32,9],[4,4,4,8],[23,6,23,8],[24,4,24,5],[28,0,28,1],[28,6,28,7],[28,9,29,9],[31,0,31,1],[31,2,31,9],[39,1,39,2],[33,1,33,2],[34,1,34,2],[35,1,35,2],[36,1,36,2],[37,1,37,2],[38,1,38,2]]}
[{"$f":"IF(LEFT(C29,2)=\"сп\",P1&\" ► СП\",IF(E25=D26,P1,IF(H6<>0,P1&\"++\"&\"0\",IF(E25=D27,P1&\"++\"&\"0\",IF(E25=D28,P1&\"++\"&\"0\",IF(E25=D27,P1&\"++\"&\"0\",IF(E25=D28,P1&\"++\"&\"0\",IF(LEFT(C25,2)=\"AV\",P1&\"++\"&F29,P1))))))))","v":" +"},{"$f":"L4","v":"дата заказа"},{"$f":"IF(E2>0,\"ОТПРАВЛЕНО\",IF(LEFT(C29,3)=\"ЗАК\",\"ЗАКАЗАНО в СПБ\",IF(G24>=0,\"ОПЛОЧЕНО\",\"ОЖИДАНИЕ ОПЛАТЫ\")))","v":"ОПЛОЧЕНО"},{"$f":"'СПИСОК ЗАКАЗОВ'!B1","v":21},null,null,null,null,{"$f":"A1","v":" +"},null,"Заказ № +",null,null,null,null,{"$f":"IF(G24>0,\"+\"&H6&\"+\"&Q1,Q1)","v":" +"},{"$f":"ПоискСКонца(K1,\"№\")","v":" +"}]
["Логин",{"$f":"L3","v":"Логин"},"Номер накл-ой",null,null,null,null,null,null,null,"Примечание"]
["ФИО",{"$f":"IF(C32=0,UPPER((P9)),UPPER(C33))","v":"ФИО"},null,null,null,null,null,null,null,null,"Логин","Логин"]
["Телефон",{"$f":"R12","v":"0----   ----   ----"},null,null,{"$f":"IF(F4>0.5,\"оплачено\",IF(F4<0,\"ОПЛАТИТЬ= \"&G4,\"ОПЛАТИТЬ= \"&Q25))","v":"ОПЛАТИТЬ= 0"},0,1100,null,null,null,"Дата заказа","дата заказа"]
["e-mail:",{"$f":"L11","v":"мыло"}]
["Вес","ПРИМЕЧАНИЯ","Наименование","Кол-во","Цена","Всего",{"$f":"IF(MAX(G7:G25)>0,MAX(G7:G25),\"\")","v":""},{"$f":"IF(I7>0,\"НАЛ\",IF(I8>0,\"ПЕРЕВОД\",IF(I9>0,\"ККБ\",IF(I10>0,\"КСБ\",IF(I11>0,\"QIWI\",IF(I12>0,\"СчётСб\",0))))))","v":0},{"$f":"SUM(I7:I28)","v":0}]
[{"$f":"IF(L24>0,Q24*1/100,\"\")","v":""},null,{"$f":"IF(L24<>\"\",K24,\"\")","v":""},{"$f":"IF(L24>0,L24,\"\")","v":""},{"$f":"IF(M24=\"уточняйте\",0,IF(L24>0,M24,\"\"))","v":""},{"$f":"IF(D7<>\"\",E7*D7,\"\")","v":""},{"$f":"IF(I7 >0,TODAY(),\"\")","v":""},"НАЛ",null,{"$f":"IFERROR(IFERROR(VLOOKUP(C7,#REF!,3,0)*D7,VLOOKUP(C7,#REF!,7,0)*D7),\"нет веса\")","v":"нет веса"},"Заказ №2080"]
[{"$f":"IF(L25>0,Q25*1/100,\"\")","v":""},null,{"$f":"IF(L25<>\"\",K25,\"\")","v":""},{"$f":"IF(L25>0,L25,\"\")","v":""},{"$f":"IF(M25=\"уточняйте\",0,IF(L25>0,M25,\"\"))","v":""},"","","ПЕРЕВОД",null,{"$f":"IFERROR(IFERROR(VLOOKUP(C8,#REF!,3,0)*D8,VLOOKUP(C8,#REF!,7,0)*D8),\"нет веса\")","v":"нет веса"}]
[{"$f":"IF(L26>0,Q26*1/100,\"\")","v":""},null,"","","","","","КАРТА ККОМ",null,{"$f":"IFERROR(IFERROR(VLOOKUP(C9,#REF!,3,0)*D9,VLOOKUP(C9,#REF!,7,0)*D9),\"нет веса\")","v":"нет веса"},"Здравствуйте, ФИО",null,null,null,null,{"$f":"MID(K9,15,70)","v":"ФИО"},{"$f":"TEXT(SUM(MID(0&L9,LARGE(ISNUMBER(-MID(L9,ROW($1:$96),1))*ROW($1:$96),ROW($1:$23)+15)+1,1)*10^ROW($1:$23)/10),REPT(0,MIN(MAX(COUNT(1/(MID(L9,ROW($1:$96),1)+1))-15,),15)))&TEXT(SUM(MID(0&L9,LARGE(ISNUMBER(-MID(L9,ROW($1:$96),1))*ROW($1:$96),ROW($1:$23))+1,1)*10^ROW($1:$23)/10),REPT(0,MIN(COUNT(1/(MID(L9,ROW($1:$96),1)+1)),15)))","v":""}]
["",null,"","","","","","КАРТА СБЕР",null,{"$f":"IFERROR(IFERROR(VLOOKUP(C10,#REF!,3,0)*D10,VLOOKUP(C10,#REF!,7,0)*D10),\"нет веса\")","v":"нет веса"},"Мы получили Ваш заказ номер, 2080"]
["",null,"","","","","","QIWI",null,{"$f":"IFERROR(IFERROR(VLOOKUP(C11,#REF!,3,0)*D11,VLOOKUP(C11,#REF!,7,0)*D11),\"нет веса\")","v":"нет веса"},"Электронная почта","мыло"]
["",null,"","","","","","СЧЁТ СберБанк",null,{"$f":"IFERROR(IFERROR(VLOOKUP(C12,#REF!,3,0)*D12,VLOOKUP(C12,#REF!,7,0)*D12),\"нет веса\")","v":"нет веса"},"Контактный телефон",null,null,null,null,{"$f":"(L12&\"  \"&P13)","v":"  0"},{"$f":"TEXT(SUM(MID(0&P12,LARGE(ISNUMBER(-MID(P12,ROW($1:$99),1))*ROW($1:$99),ROW($1:$15)+30)+1,1)*10^ROW($1:$15)/10),REPT(0,MIN(MAX(COUNT(1/(MID(P12,ROW($1:$99),1)+1))-30,),15)))&TEXT(SUM(MID(0&P12,LARGE(ISNUMBER(-MID(P12,ROW($1:$99),1))*ROW($1:$99),ROW($1:$15)+15)+1,1)*10^ROW($1:$15)/10),REPT(0,MIN(MAX(COUNT(1/(MID(P12,ROW($1:$99),1)+1))-15,),15)))&TEXT(SUM(MID(0&P12,LARGE(ISNUMBER(-MID(P12,ROW($1:$99),1))*ROW($1:$99),ROW($1:$15))+1,1)*10^ROW($1:$15)/10),REPT(0,MIN(COUNT(1/(MID(P12,ROW($1:$99),1)+1)),15)))","v":"0"},{"$f":"(MID(Q12,1,1))&\"-\"&(MID(Q12,2,3))&\"-\"&(MID(Q12,5,3))&\"-\"&(MID(Q12,8,2))&\"-\"&(MID(Q12,10,2))&\"   \"&(MID(Q12,12,1))&\"-\"&(MID(Q12,13,3))&\"-\"&(MID(Q12,16,3))&\"-\"&(MID(Q12,19,2))&\"-\"&(MID(Q12,21,2))&\"   \"&(MID(Q12,23,1))&\"-\"&(MID(Q12,24,3))&\"-\"&(MID(Q12,27,3))&\"-\"&(MID(Q12,30,2))&\"-\"&(MID(Q12,32,2))","v":"0----   ----   ----"}]
["",null,"","","","","",null,null,{"$f":"IFERROR(IFERROR(VLOOKUP(C13,#REF!,3,0)*D13,VLOOKUP(C13,#REF!,7,0)*D13),\"нет веса\")","v":"нет веса"},null,null,null,null,null,{"$f":"IF(L13=\"-\",IFERROR(НайтиСтрокуПоСлову(\"Комментарий\",K27:K60),0),L13)","v":0}]
["",null,"","","","","",null,null,{"$f":"IFERROR(IFERROR(VLOOKUP(C14,#REF!,3,0)*D14,VLOOKUP(C14,#REF!,7,0)*D14),\"нет веса\")","v":"нет веса"},"Доставка:",null,null,null,null,{"$f":"MID(L14,23,70)","v":""}]
["",null,"","","","","",null,null,{"$f":"IFERROR(IFERROR(VLOOKUP(C15,#REF!,3,0)*D15,VLOOKUP(C15,#REF!,7,0)*D15),\"нет веса\")","v":"нет веса"},"Оплата:",null,null,null,null,{"$f":"IF(LEFT(P14,2)=\"EX\",MID(L15,11,70),L15)","v":0},{"$f":"TEXT(SUM(MID(0&P15,LARGE(ISNUMBER(-MID(P15,ROW($1:$88),1))*ROW($1:$88),ROW($1:$15)+15)+1,1)*10^ROW($1:$15)/10),REPT(0,MIN(MAX(COUNT(1/(MID(P15,ROW($1:$88),1)+1))-15,),15)))&TEXT(SUM(MID(0&P15,LARGE(ISNUMBER(-MID(P15,ROW($1:$88),1))*ROW($1:$88),ROW($1:$15))+1,1)*10^ROW($1:$15)/10),REPT(0,MIN(COUNT(1/(MID(P15,ROW($1:$88),1)+1)),15)))","v":"0"},{"$f":"SUMPRODUCT(--SUBSTITUTE(Q15:Q15,CHAR(160),))","v":0},{"$f":"LEN(Q15)","v":1},{"$f":"FLOOR(S15/3,1)","v":0}]
["",null,"","","","","",null,null,{"$f":"IFERROR(IFERROR(VLOOKUP(C16,#REF!,3,0)*D16,VLOOKUP(C16,#REF!,7,0)*D16),\"нет веса\")","v":"нет веса"},"Адрес доставки","Индекс: ",null,null,null,{"$f":"MID(L16,9,70)","v":""}]
["",null,"","","","","",null,null,{"$f":"IFERROR(IFERROR(VLOOKUP(C17,#REF!,3,0)*D17,VLOOKUP(C17,#REF!,7,0)*D17),\"нет веса\")","v":"нет веса"},null,"Страна: ",null,null,null,{"$f":"MID(L17,9,70)","v":""},{"$f":"IF(LEFT(K17,4)=\"ваша\",VALUE(MID(K17,13,20))*100,0)","v":0}]
["",null,"","","","","",null,null,{"$f":"IFERROR(IFERROR(VLOOKUP(C18,#REF!,3,0)*D18,VLOOKUP(C18,#REF!,7,0)*D18),\"нет веса\")","v":"нет веса"},null,"Область: ",null,null,null,{"$f":"MID(L18,10,70)","v":""}]
["",null,"","","","","",null,null,{"$f":"IFERROR(IFERROR(VLOOKUP(C19,#REF!,3,0)*D19,VLOOKUP(C19,#REF!,7,0)*D19),\"нет веса\")","v":"нет веса"},null,"Город: ",null,null,null,{"$f":"MID(L19,8,70)","v":""},{"$f":"IF(LEFT(K19,4)=\"ваша\",VALUE(MID(K19,13,20))*100,0)","v":0}]
["",null,"","","","","",null,null,{"$f":"IFERROR(IFERROR(VLOOKUP(C20,#REF!,3,0)*D20,VLOOKUP(C20,#REF!,7,0)*D20),\"нет веса\")","v":"нет веса"},null,"Улица: ",null,null,null,{"$f":"MID(L20,8,70)","v":""},{"$f":"IF(LEFT(K31,4)=\"ваша\",VALUE(MID(K31,13,20))*100,0)","v":0}]
["",null,"","","","","",null,null,{"$f":"IFERROR(IFERROR(VLOOKUP(C21,#REF!,3,0)*D21,VLOOKUP(C21,#REF!,7,0)*D21),\"нет веса\")","v":"нет веса"},null,"Здание: ",null,null,null,{"$f":"MID(L21,9,70)","v":""},{"$f":"IF(LEFT(K32,4)=\"ваша\",VALUE(MID(K32,13,20))*100,0)","v":0}]
["",null,"","","","","",null,null,{"$f":"IFERROR(IFERROR(VLOOKUP(C22,#REF!,3,0)*D22,VLOOKUP(C22,#REF!,7,0)*D22),\"нет веса\")","v":"нет веса"},null,"Квартира: ",null,null,null,{"$f":"MID(L22,11,70)","v":""},{"$f":"IF(LEFT(#REF!,4)=\"ваша\",VALUE(MID(#REF!,13,20))*100,0)","v":{"$error":"#REF!"}}]
["",null,null,null,"Итого:",{"$f":"SUM(F7:F22)","v":0},"",null,null,{"$f":"IF(K40>0,M40,\"\")","v":""},"Наименование","Количество","Цена","Вес","Всего",null,{"$f":"IF(LEFT(K33,4)=\"ваша\",VALUE(MID(K33,13,20))*100,0)","v":0}]
[{"$f":"IF(L41>0,N41,\"\")","v":""},null,null,"скидка:",{"$f":"IF(F23>150000,10,IF(F23>100000,8,IF(F23>60000,5,IF(F23>30000,3,0))))","v":0},{"$f":"F23-(F23*E24/100)","v":0},{"$f":"IFERROR(SUM(I7:I22)-F29+1,0)","v":0},null,null,null,null,null,null,null,null,{"$f":"N24","v":0},{"$f":"TEXT(SUM(MID(0&P24,LARGE(ISNUMBER(-MID(P24,ROW($1:$88),1))*ROW($1:$88),ROW($1:$15)+15)+1,1)*10^ROW($1:$15)/10),REPT(0,MIN(MAX(COUNT(1/(MID(P24,ROW($1:$88),1)+1))-15,),15)))&TEXT(SUM(MID(0&P24,LARGE(ISNUMBER(-MID(P24,ROW($1:$88),1))*ROW($1:$88),ROW($1:$15))+1,1)*10^ROW($1:$15)/10),REPT(0,MIN(COUNT(1/(MID(P24,ROW($1:$88),1)+1)),15)))","v":"0"}]
[{"$f":"SUM(A7:A23)/1000*1.3","v":0},null,{"$f":"IF(E25=F26,\"Доставка БЕСПЛАТНО\",IF(E25=D26,C26,IF(E25=D27,C27,IF(E25=D28,C28,IF(E25=F27,C27&\" + НПл\",IF(E25=F28,C28&\" + НПл\",\"Укажите ТК\"))))))","v":"Доставка БЕСПЛАТНО"},2,0,null,{"$f":"IF(I25 >0,TODAY(),\"\")","v":""},null,null,{"$f":"SUM(J7:J22)/1000","v":0},null,null,null,null,null,{"$f":"E25","v":0},{"$f":"TEXT(SUM(MID(0&P25,LARGE(ISNUMBER(-MID(P25,ROW($1:$88),1))*ROW($1:$88),ROW($1:$15)+15)+1,1)*10^ROW($1:$15)/10),REPT(0,MIN(MAX(COUNT(1/(MID(P25,ROW($1:$88),1)+1))-15,),15)))&TEXT(SUM(MID(0&P25,LARGE(ISNUMBER(-MID(P25,ROW($1:$88),1))*ROW($1:$88),ROW($1:$15))+1,1)*10^ROW($1:$15)/10),REPT(0,MIN(COUNT(1/(MID(P25,ROW($1:$88),1)+1)),15)))","v":"0"},{"$f":"E25","v":0},{"$f":"TEXT(SUM(MID(0&R25,LARGE(ISNUMBER(-MID(R25,ROW($1:$88),1))*ROW($1:$88),ROW($1:$15)+15)+1,1)*10^ROW($1:$15)/10),REPT(0,MIN(MAX(COUNT(1/(MID(R25,ROW($1:$88),1)+1))-15,),15)))&TEXT(SUM(MID(0&R25,LARGE(ISNUMBER(-MID(R25,ROW($1:$88),1))*ROW($1:$88),ROW($1:$15))+1,1)*10^ROW($1:$15)/10),REPT(0,MIN(COUNT(1/(MID(R25,ROW($1:$88),1)+1)),15)))","v":"0"},null,{"$f":"TEXT(SUM(MID(0&E25,LARGE(ISNUMBER(-MID(E25,ROW($1:$88),1))*ROW($1:$88),ROW($1:$15)+15)+1,1)*10^ROW($1:$15)/10),REPT(0,MIN(MAX(COUNT(1/(MID(E25,ROW($1:$88),1)+1))-15,),15)))&TEXT(SUM(MID(0&E25,LARGE(ISNUMBER(-MID(E25,ROW($1:$88),1))*ROW($1:$88),ROW($1:$15))+1,1)*10^ROW($1:$15)/10),REPT(0,MIN(COUNT(1/(MID(E25,ROW($1:$88),1)+1)),15)))","v":{"$error":"#NUM!"}}]
[null,null,{"$f":"IFERROR(\"AVIS С А М О В Ы В О З \"&\"  \"&VLOOKUP((LEFT(B34,(LEN(B34)))),'ТАРИФЫ ТК'!J17:L268,1,0),\"НЕТ ДОСТАВКИ\")","v":"НЕТ ДОСТАВКИ"},{"$f":"IFERROR(VLOOKUP((LEFT(B34,(LEN(B34)))),'ТАРИФЫ ТК'!J17:L268,3,0)+0.001,\"НЕТ ДОСТАВКИ\")","v":"НЕТ ДОСТАВКИ"},{"$f":"IFERROR(F24+D26,\"НЕТ ДОСТАВКИ\")","v":"НЕТ ДОСТАВКИ"},0,null,null,null,null,null,null,null,null,null,{"$f":"N26","v":0},{"$f":"TEXT(SUM(MID(0&P26,LARGE(ISNUMBER(-MID(P26,ROW($1:$88),1))*ROW($1:$88),ROW($1:$15)+15)+1,1)*10^ROW($1:$15)/10),REPT(0,MIN(MAX(COUNT(1/(MID(P26,ROW($1:$88),1)+1))-15,),15)))&TEXT(SUM(MID(0&P26,LARGE(ISNUMBER(-MID(P26,ROW($1:$88),1))*ROW($1:$88),ROW($1:$15))+1,1)*10^ROW($1:$15)/10),REPT(0,MIN(COUNT(1/(MID(P26,ROW($1:$88),1)+1)),15)))","v":"0"}]
[null,null,{"$f":"IFERROR(\"AVIS Econom\"&\"  \"&VLOOKUP((LEFT(B34,(LEN(B34)))),'ТАРИФЫ ТК'!A4:A134,1,0),\"НЕТ ДОСТАВКИ\")","v":"НЕТ ДОСТАВКИ"},{"$f":"IFERROR(VLOOKUP((LEFT(B34,(LEN(B34)))),'ТАРИФЫ ТК'!A4:C134,3,0),\"НЕТ ДОСТАВКИ\")","v":"НЕТ ДОСТАВКИ"},{"$f":"IFERROR(F24+D27,\"НЕТ ДОСТАВКИ\")","v":"НЕТ ДОСТАВКИ"},{"$f":"IFERROR(D27&\" + НПл\",\"НЕТ ДОСТАВКИ\")","v":"НЕТ ДОСТАВКИ + НПл"},{"$f":"IFERROR(CEILING((F24+D27)*(1+$D$25/100),50),0)","v":0},null,null,null,null,null,null,null,null,0,{"$f":"TEXT(SUM(MID(0&P27,LARGE(ISNUMBER(-MID(P27,ROW($1:$88),1))*ROW($1:$88),ROW($1:$15)+15)+1,1)*10^ROW($1:$15)/10),REPT(0,MIN(MAX(COUNT(1/(MID(P27,ROW($1:$88),1)+1))-15,),15)))&TEXT(SUM(MID(0&P27,LARGE(ISNUMBER(-MID(P27,ROW($1:$88),1))*ROW($1:$88),ROW($1:$15))+1,1)*10^ROW($1:$15)/10),REPT(0,MIN(COUNT(1/(MID(P27,ROW($1:$88),1)+1)),15)))","v":"0"}]
[null,null,{"$f":"IFERROR(IF(A29<0.5,\"AVIS EXPRESS\"&\"  \"&VLOOKUP((LEFT(B34,(LEN(B34)))),'ТАРИФЫ ТК'!E4:G20,1,0),\"AV ВИМАНИЕ:   В Е С    П О С Ы Л К И    Б О Л Ь Ш Е   0,5 КГ   !!!\"),\"НЕТ ДОСТАВКИ\")","v":"НЕТ ДОСТАВКИ"},{"$f":"IFERROR(VLOOKUP((LEFT(B34,(LEN(B34)))),'ТАРИФЫ ТК'!E4:G20,3,0),\"НЕТ ДОСТАВКИ\")","v":"НЕТ ДОСТАВКИ"},{"$f":"IFERROR(F24+D28,\"НЕТ ДОСТАВКИ\")","v":"НЕТ ДОСТАВКИ"},{"$f":"D28&\" + НПл\"","v":"НЕТ ДОСТАВКИ + НПл"},{"$f":"IFERROR(CEILING((F24+D28)*(1+$D$25/100),50),\"НЕТ ДОСТАВКИ\")","v":"НЕТ ДОСТАВКИ"},null,null,null,null,null,null,null,null,0,{"$f":"TEXT(SUM(MID(0&P28,LARGE(ISNUMBER(-MID(P28,ROW($1:$88),1))*ROW($1:$88),ROW($1:$15)+15)+1,1)*10^ROW($1:$15)/10),REPT(0,MIN(MAX(COUNT(1/(MID(P28,ROW($1:$88),1)+1))-15,),15)))&TEXT(SUM(MID(0&P28,LARGE(ISNUMBER(-MID(P28,ROW($1:$88),1))*ROW($1:$88),ROW($1:$15))+1,1)*10^ROW($1:$15)/10),REPT(0,MIN(COUNT(1/(MID(P28,ROW($1:$88),1)+1)),15)))","v":"0"}]
[{"$f":"IFERROR(A25*1.5,\"Количество ??\")","v":0},null,null,"К ОПЛАТЕ:",{"$f":"IFERROR(F24+E25,0)","v":0},{"$f":"IF(E25=F26,\"Доставка БЕСПЛАТНО\",IF(E25=D26,E26,IF(E25=D27,E27,IF(E25=D28,E28,IF(E25=F27,G27,IF(E25=F28,G28,\"Укажите ТК\"))))))","v":"Доставка БЕСПЛАТНО"},{"$f":"IFERROR(CEILING((F24+E25)*1.03,50),0)","v":0},null,null,{"$f":"IFERROR(J25*1.5,\"Количество ??\")","v":0},null,null,null,null,null,0,{"$f":"TEXT(SUM(MID(0&P29,LARGE(ISNUMBER(-MID(P29,ROW($1:$88),1))*ROW($1:$88),ROW($1:$15)+15)+1,1)*10^ROW($1:$15)/10),REPT(0,MIN(MAX(COUNT(1/(MID(P29,ROW($1:$88),1)+1))-15,),15)))&TEXT(SUM(MID(0&P29,LARGE(ISNUMBER(-MID(P29,ROW($1:$88),1))*ROW($1:$88),ROW($1:$15))+1,1)*10^ROW($1:$15)/10),REPT(0,MIN(COUNT(1/(MID(P29,ROW($1:$88),1)+1)),15)))","v":"0"}]
["rc11091kz",null,{"$f":"IFERROR((P14&\"        \"&LEFT(P15,8)&\" = \"&TEXT(R15,\"### ### ###\")&\" т.\"),\"НЕТ ДОСТАВКИ\")","v":"        0 =  т."},null,{"$f":"IFERROR(\"QIWI = \"&CEILING((E26*1.02),10),0)","v":0},{"$f":"IFERROR(F29-F24,\"УКАЖИТЕ ТК\")","v":"УКАЖИТЕ ТК"},null,null,null,null,null,null,null,null,null,0,{"$f":"TEXT(SUM(MID(0&P30,LARGE(ISNUMBER(-MID(P30,ROW($1:$88),1))*ROW($1:$88),ROW($1:$15)+15)+1,1)*10^ROW($1:$15)/10),REPT(0,MIN(MAX(COUNT(1/(MID(P30,ROW($1:$88),1)+1))-15,),15)))&TEXT(SUM(MID(0&P30,LARGE(ISNUMBER(-MID(P30,ROW($1:$88),1))*ROW($1:$88),ROW($1:$15))+1,1)*10^ROW($1:$15)/10),REPT(0,MIN(COUNT(1/(MID(P30,ROW($1:$88),1)+1)),15)))","v":"0"}]
[{"$f":"A1","v":" +"},"ПОЛУЧАТЕЛЬ:","rc11091kz",null,null,null,null,null,null,null,null,null,null,null,null,0,{"$f":"TEXT(SUM(MID(0&P31,LARGE(ISNUMBER(-MID(P31,ROW($1:$88),1))*ROW($1:$88),ROW($1:$15)+15)+1,1)*10^ROW($1:$15)/10),REPT(0,MIN(MAX(COUNT(1/(MID(P31,ROW($1:$88),1)+1))-15,),15)))&TEXT(SUM(MID(0&P31,LARGE(ISNUMBER(-MID(P31,ROW($1:$88),1))*ROW($1:$88),ROW($1:$15))+1,1)*10^ROW($1:$15)/10),REPT(0,MIN(COUNT(1/(MID(P31,ROW($1:$88),1)+1)),15)))","v":"0"}]
[{"$f":"UPPER((B3))","v":"ФИО"},null,{"$f":"IFERROR(MID(НайтиСтрокуПоСлову(\"Комментарий: Имя :\",K1:K45),20,99),0)","v":0},null,null,null,null,null,null,null,null,null,null,null,null,0,{"$f":"TEXT(SUM(MID(0&P32,LARGE(ISNUMBER(-MID(P32,ROW($1:$88),1))*ROW($1:$88),ROW($1:$15)+15)+1,1)*10^ROW($1:$15)/10),REPT(0,MIN(MAX(COUNT(1/(MID(P32,ROW($1:$88),1)+1))-15,),15)))&TEXT(SUM(MID(0&P32,LARGE(ISNUMBER(-MID(P32,ROW($1:$88),1))*ROW($1:$88),ROW($1:$15))+1,1)*10^ROW($1:$15)/10),REPT(0,MIN(COUNT(1/(MID(P32,ROW($1:$88),1)+1)),15)))","v":"0"}]
["Область: ",{"$f":"UPPER((P18))","v":""},{"$f":"IFERROR(ПоискСНачала(C32,\"Телефон\"),0)","v":0},null,{"$f":"IFERROR(ПоискМежду(C32,\"Телефон :\",\"Примечание\"),0)","v":0},{"$f":"IFERROR(IF(LEFT(ПоискСКонца(C32,\"Примечание : \"),2)=\"г \",MID(ПоискСКонца(C32,\"Примечание : \"),3,99),IF(LEFT(ПоискСКонца(C32,\"Примечание : \"),3)=\"г. \",MID(ПоискСКонца(C32,\"Примечание : \"),4,99),IF(LEFT(ПоискСКонца(C32,\"Примечание : \"),3)=\"гор\",MID(ПоискСКонца(C32,\"Примечание : \"),6,99),0))),0)","v":0},null,null,null,null,null,null,null,null,null,0,{"$f":"TEXT(SUM(MID(0&P33,LARGE(ISNUMBER(-MID(P33,ROW($1:$88),1))*ROW($1:$88),ROW($1:$15)+15)+1,1)*10^ROW($1:$15)/10),REPT(0,MIN(MAX(COUNT(1/(MID(P33,ROW($1:$88),1)+1))-15,),15)))&TEXT(SUM(MID(0&P33,LARGE(ISNUMBER(-MID(P33,ROW($1:$88),1))*ROW($1:$88),ROW($1:$15))+1,1)*10^ROW($1:$15)/10),REPT(0,MIN(COUNT(1/(MID(P33,ROW($1:$88),1)+1)),15)))","v":"0"}]
["Город: ",{"$f":"UPPER((P19))","v":""},null,null,null,null,null,null,null,null,null,null,null,null,null,0,{"$f":"TEXT(SUM(MID(0&P34,LARGE(ISNUMBER(-MID(P34,ROW($1:$88),1))*ROW($1:$88),ROW($1:$15)+15)+1,1)*10^ROW($1:$15)/10),REPT(0,MIN(MAX(COUNT(1/(MID(P34,ROW($1:$88),1)+1))-15,),15)))&TEXT(SUM(MID(0&P34,LARGE(ISNUMBER(-MID(P34,ROW($1:$88),1))*ROW($1:$88),ROW($1:$15))+1,1)*10^ROW($1:$15)/10),REPT(0,MIN(COUNT(1/(MID(P34,ROW($1:$88),1)+1)),15)))","v":"0"}]
["Улица: ",{"$f":"UPPER((P20))","v":""},null,null,null,null,null,null,null,null,null,null,null,null,null,0,{"$f":"TEXT(SUM(MID(0&P35,LARGE(ISNUMBER(-MID(P35,ROW($1:$88),1))*ROW($1:$88),ROW($1:$15)+15)+1,1)*10^ROW($1:$15)/10),REPT(0,MIN(MAX(COUNT(1/(MID(P35,ROW($1:$88),1)+1))-15,),15)))&TEXT(SUM(MID(0&P35,LARGE(ISNUMBER(-MID(P35,ROW($1:$88),1))*ROW($1:$88),ROW($1:$15))+1,1)*10^ROW($1:$15)/10),REPT(0,MIN(COUNT(1/(MID(P35,ROW($1:$88),1)+1)),15)))","v":"0"}]
["Здание: ",{"$f":"P21","v":""},null,null,null,null,null,null,null,null,null,null,null,null,null,0,{"$f":"TEXT(SUM(MID(0&P36,LARGE(ISNUMBER(-MID(P36,ROW($1:$88),1))*ROW($1:$88),ROW($1:$15)+15)+1,1)*10^ROW($1:$15)/10),REPT(0,MIN(MAX(COUNT(1/(MID(P36,ROW($1:$88),1)+1))-15,),15)))&TEXT(SUM(MID(0&P36,LARGE(ISNUMBER(-MID(P36,ROW($1:$88),1))*ROW($1:$88),ROW($1:$15))+1,1)*10^ROW($1:$15)/10),REPT(0,MIN(COUNT(1/(MID(P36,ROW($1:$88),1)+1)),15)))","v":"0"}]
["Квартира: ",{"$f":"P22","v":""},null,null,null,null,null,null,null,null,null,null,null,null,null,0,{"$f":"TEXT(SUM(MID(0&P37,LARGE(ISNUMBER(-MID(P37,ROW($1:$88),1))*ROW($1:$88),ROW($1:$15)+15)+1,1)*10^ROW($1:$15)/10),REPT(0,MIN(MAX(COUNT(1/(MID(P37,ROW($1:$88),1)+1))-15,),15)))&TEXT(SUM(MID(0&P37,LARGE(ISNUMBER(-MID(P37,ROW($1:$88),1))*ROW($1:$88),ROW($1:$15))+1,1)*10^ROW($1:$15)/10),REPT(0,MIN(COUNT(1/(MID(P37,ROW($1:$88),1)+1)),15)))","v":"0"}]
["Телефон: ",{"$f":"B4","v":"0----   ----   ----"},null,null,null,null,null,null,null,null,null,null,null,null,null,0,{"$f":"TEXT(SUM(MID(0&P38,LARGE(ISNUMBER(-MID(P38,ROW($1:$88),1))*ROW($1:$88),ROW($1:$15)+15)+1,1)*10^ROW($1:$15)/10),REPT(0,MIN(MAX(COUNT(1/(MID(P38,ROW($1:$88),1)+1))-15,),15)))&TEXT(SUM(MID(0&P38,LARGE(ISNUMBER(-MID(P38,ROW($1:$88),1))*ROW($1:$88),ROW($1:$15))+1,1)*10^ROW($1:$15)/10),REPT(0,MIN(COUNT(1/(MID(P38,ROW($1:$88),1)+1)),15)))","v":"0"}]
["Индекс: ",{"$f":"P16","v":""},null,null,null,null,null,null,null,null,null,null,null,null,null,null,{"$f":"IF(LEFT(#REF!,4)=\"ваша\",VALUE(MID(#REF!,13,20))*100,0)","v":{"$error":"#REF!"}}]
["Компания:",null,null,null,null,null,null,null,null,null,null,null,null,null,null,null,{"$f":"IF(LEFT(#REF!,4)=\"ваша\",VALUE(MID(#REF!,13,20))*100,0)","v":{"$error":"#REF!"}}]
["ИИН:",{"$f":"F29","v":"Доставка БЕСПЛАТНО"},null,null,null,null,null,null,null,null,null,null,null,null,null,null,{"$f":"IF(LEFT(#REF!,4)=\"ваша\",VALUE(MID(#REF!,13,20))*100,0)","v":{"$error":"#REF!"}}]
["------------------------","----------------------------------------------------","----------------------------------------------------","------------------------","------------------------","---------------------------","------------------------------","------------------------","------------------------",null,null,null,null,null,null,null,{"$f":"SUM(Q19:Q41)","v":{"$error":"#REF!"}}]
["Дата1","2014-05-10",null,"Дата1","2014-05-10"]
["Дата2","2014-06-10",null,"кол дней",59]
["Итог кол дней",{"$f":"B44-B43","v":31},null,"Итог Дата2",{"$f":"E43+E44","v":"2014-07-08"}]
[null,null,"Пожалуйста, оставьте отзыв о нашей компании. "]
[null,null,"Вы поможете нам стать лучше или просто поднимите нам настроение положительной оценкой."]
[null,null,"Спасибо."]
[null,null,"С Уважением, Евгений."]

{"sheet":"+СЧЁТ Альфа-Банк+Сч1708++0","index":17,"n_rows":42,"n_cols":21,"rows_kept":42,"cut":false,"hidden":false,"merged":[[27,6,27,8],[31,0,31,1],[37,1,37,2],[0,4,0,7],[1,4,1,8],[2,1,2,2],[3,1,3,2],[25,6,25,8],[26,6,26,8]]}
[{"$f":"IF(LEFT(C29,2)=\"сп\",P1&\" ► СП\",IF(E25=D26,P1,IF(H6<>0,P1&\"++\"&\"0\",IF(E25=D27,P1&\"++\"&\"0\",IF(E25=D28,P1&\"++\"&\"0\",IF(E25=D27,P1&\"++\"&\"0\",IF(E25=D28,P1&\"++\"&\"0\",IF(LEFT(C25,2)=\"AV\",P1&\"++\"&F29,P1))))))))","v":"+СЧЁТ Альфа-Банк+Сч1708++0"},"2020-08-17",{"$f":"IF(E2>0,\"ОТПРАВЛЕНО\",IF(LEFT(C29,3)=\"ЗАК\",\"ЗАКАЗАНО в СПБ\",IF(G24>=0,\"ОПЛОЧЕНО\",\"ОЖИДАНИЕ ОПЛАТЫ\")))","v":"ОПЛОЧЕНО"},{"$f":"'СПИСОК ЗАКАЗОВ'!B1","v":21},null,null,null,null,{"$f":"A1","v":"+СЧЁТ Альфа-Банк+Сч1708++0"},null,"Сч1708",null,null,null,null,{"$f":"IF(G24>0,\"+\"&H6&\"+\"&Q1,Q1)","v":"+СЧЁТ Альфа-Банк+Сч1708"},{"$f":"ПоискСКонца(K1,\"№\")","v":"Сч1708"}]
["Логин",{"$f":"L3","v":"Логин"},"Номер накл-ой",null,null,null,null,null,null,null,"Примечание"]
["ФИО",{"$f":"IF(C32=0,UPPER((P9)),UPPER(C33))","v":"РЕГРО «ХРИСТИАНСКИЙ ЦЕНТР СВИДЕТЕЛЕЙ ИЕГОВЫ»"},null,null,null,null,null,null,null,null,"Логин","Логин"]
["Телефон",{"$f":"R12","v":"7-771-790-09-84   0----   ----"},null,null,{"$f":"IF(F4>0.5,\"оплачено\",IF(F4<0,\"ОПЛАТИТЬ= \"&G4,\"ОПЛАТИТЬ= \"&Q25))","v":"ОПЛАТИТЬ= 1400"},0,1100,null,null,null,"Дата заказа","дата заказа"]
["e-mail:",{"$f":"L11","v":"мыло"}]
["Вес","ПРИМЕЧАНИЯ","Наименование","Кол-во","Цена","Всего",{"$f":"IF(MAX(G7:G25)>0,MAX(G7:G25),\"\")","v":"2020-08-21"},{"$f":"IF(I7>0,\"НАЛ\",IF(I8>0,\"ПЕРЕВОД\",IF(I9>0,\"Beeline\",IF(I10>0,\"KASPI\",IF(I11>0,\"QIWI\",IF(I12>0,\"СЧЁТ Альфа-Банк\",0))))))","v":"СЧЁТ Альфа-Банк"},{"$f":"SUM(I7:I28)","v":11350}]
[{"$f":"IF(L24>0,Q24*1/100,\"\")","v":""},null,"Неодимовый магнит диск D3x2 мм., N35",500,12.2,{"$f":"IF(D7<>\"\",E7*D7,\"\")","v":6100},{"$f":"IF(I7 >0,TODAY(),\"\")","v":""},"НАЛ",null,{"$f":"IFERROR(IFERROR(VLOOKUP(C7,#REF!,3,0)*D7,VLOOKUP(C7,#REF!,7,0)*D7),\"нет веса\")","v":"нет веса"},"Заказ №2080"]
[{"$f":"IF(L25>0,Q25*1/100,\"\")","v":""},null,{"$f":"IF(L27<>\"\",K27,\"\")","v":""},{"$f":"IF(L27>0,L27,\"\")","v":""},{"$f":"IF(M27=\"уточняйте\",0,IF(L27>0,M27,\"\"))","v":""},"","","ПЕРЕВОД",null,{"$f":"IFERROR(IFERROR(VLOOKUP(C8,#REF!,3,0)*D8,VLOOKUP(C8,#REF!,7,0)*D8),\"нет веса\")","v":"нет веса"}]
[{"$f":"IF(L26>0,Q26*1/100,\"\")","v":""},null,"","","","","","Beeline",null,{"$f":"IFERROR(IFERROR(VLOOKUP(C9,#REF!,3,0)*D9,VLOOKUP(C9,#REF!,7,0)*D9),\"нет веса\")","v":"нет веса"},"Здравствуйте, РегРО «Христианский центр Свидетелей Иеговы»",null,null,null,null,{"$f":"MID(K9,15,70)","v":"РегРО «Христианский центр Свидетелей Иеговы»"},{"$f":"TEXT(SUM(MID(0&L9,LARGE(ISNUMBER(-MID(L9,ROW($1:$96),1))*ROW($1:$96),ROW($1:$23)+15)+1,1)*10^ROW($1:$23)/10),REPT(0,MIN(MAX(COUNT(1/(MID(L9,ROW($1:$96),1)+1))-15,),15)))&TEXT(SUM(MID(0&L9,LARGE(ISNUMBER(-MID(L9,ROW($1:$96),1))*ROW($1:$96),ROW($1:$23))+1,1)*10^ROW($1:$23)/10),REPT(0,MIN(COUNT(1/(MID(L9,ROW($1:$96),1)+1)),15)))","v":""}]
["",null,"","","","","","KASPI",null,{"$f":"IFERROR(IFERROR(VLOOKUP(C10,#REF!,3,0)*D10,VLOOKUP(C10,#REF!,7,0)*D10),\"нет веса\")","v":"нет веса"},"Мы получили Ваш заказ номер, 2080"]
["",null,"Доставка с завода",1,3850,3850,"","QIWI",null,{"$f":"IFERROR(IFERROR(VLOOKUP(C11,#REF!,3,0)*D11,VLOOKUP(C11,#REF!,7,0)*D11),\"нет веса\")","v":"нет веса"},"Электронная почта","мыло"]
["",null,"","","","","2020-08-21","СЧЁТ Альфа-Банк",{"$f":"F29","v":11350},{"$f":"IFERROR(IFERROR(VLOOKUP(C12,#REF!,3,0)*D12,VLOOKUP(C12,#REF!,7,0)*D12),\"нет веса\")","v":"нет веса"},"Контактный телефон","+7-771-790-09-84",null,null,null,{"$f":"(L12&\"  \"&P13)","v":"+7-771-790-09-84  0"},{"$f":"TEXT(SUM(MID(0&P12,LARGE(ISNUMBER(-MID(P12,ROW($1:$99),1))*ROW($1:$99),ROW($1:$15)+30)+1,1)*10^ROW($1:$15)/10),REPT(0,MIN(MAX(COUNT(1/(MID(P12,ROW($1:$99),1)+1))-30,),15)))&TEXT(SUM(MID(0&P12,LARGE(ISNUMBER(-MID(P12,ROW($1:$99),1))*ROW($1:$99),ROW($1:$15)+15)+1,1)*10^ROW($1:$15)/10),REPT(0,MIN(MAX(COUNT(1/(MID(P12,ROW($1:$99),1)+1))-15,),15)))&TEXT(SUM(MID(0&P12,LARGE(ISNUMBER(-MID(P12,ROW($1:$99),1))*ROW($1:$99),ROW($1:$15))+1,1)*10^ROW($1:$15)/10),REPT(0,MIN(COUNT(1/(MID(P12,ROW($1:$99),1)+1)),15)))","v":"777179009840"},{"$f":"(MID(Q12,1,1))&\"-\"&(MID(Q12,2,3))&\"-\"&(MID(Q12,5,3))&\"-\"&(MID(Q12,8,2))&\"-\"&(MID(Q12,10,2))&\"   \"&(MID(Q12,12,1))&\"-\"&(MID(Q12,13,3))&\"-\"&(MID(Q12,16,3))&\"-\"&(MID(Q12,19,2))&\"-\"&(MID(Q12,21,2))&\"   \"&(MID(Q12,23,1))&\"-\"&(MID(Q12,24,3))&\"-\"&(MID(Q12,27,3))&\"-\"&(MID(Q12,30,2))&\"-\"&(MID(Q12,32,2))","v":"7-771-790-09-84   0----   ----"}]
["",null,"Оплочено 18.08.2020","","","","",null,null,{"$f":"IFERROR(IFERROR(VLOOKUP(C13,#REF!,3,0)*D13,VLOOKUP(C13,#REF!,7,0)*D13),\"нет веса\")","v":"нет веса"},null,null,null,null,null,{"$f":"IF(L13=\"-\",IFERROR(НайтиСтрокуПоСлову(\"Комментарий\",K27:K60),0),L13)","v":0}]
["",null,"Заказал на заводе 18.08.2020","","","","",null,null,{"$f":"IFERROR(IFERROR(VLOOKUP(C14,#REF!,3,0)*D14,VLOOKUP(C14,#REF!,7,0)*D14),\"нет веса\")","v":"нет веса"},"Доставка:",null,null,null,null,{"$f":"MID(L14,23,70)","v":""}]
["",null,"","","","","",null,null,{"$f":"IFERROR(IFERROR(VLOOKUP(C15,#REF!,3,0)*D15,VLOOKUP(C15,#REF!,7,0)*D15),\"нет веса\")","v":"нет веса"},"Оплата:",null,null,null,null,{"$f":"IF(LEFT(P14,2)=\"EX\",MID(L15,11,70),L15)","v":0},{"$f":"TEXT(SUM(MID(0&P15,LARGE(ISNUMBER(-MID(P15,ROW($1:$88),1))*ROW($1:$88),ROW($1:$15)+15)+1,1)*10^ROW($1:$15)/10),REPT(0,MIN(MAX(COUNT(1/(MID(P15,ROW($1:$88),1)+1))-15,),15)))&TEXT(SUM(MID(0&P15,LARGE(ISNUMBER(-MID(P15,ROW($1:$88),1))*ROW($1:$88),ROW($1:$15))+1,1)*10^ROW($1:$15)/10),REPT(0,MIN(COUNT(1/(MID(P15,ROW($1:$88),1)+1)),15)))","v":"0"},{"$f":"SUMPRODUCT(--SUBSTITUTE(Q15:Q15,CHAR(160),))","v":0},{"$f":"LEN(Q15)","v":1},{"$f":"FLOOR(S15/3,1)","v":0}]
["",null,"","","","","",null,null,{"$f":"IFERROR(IFERROR(VLOOKUP(C16,#REF!,3,0)*D16,VLOOKUP(C16,#REF!,7,0)*D16),\"нет веса\")","v":"нет веса"},"Адрес доставки","Индекс: ",null,null,null,{"$f":"MID(L16,9,70)","v":""}]
["",null,"","","","","",null,null,{"$f":"IFERROR(IFERROR(VLOOKUP(C17,#REF!,3,0)*D17,VLOOKUP(C17,#REF!,7,0)*D17),\"нет веса\")","v":"нет веса"},null,"Страна: ",null,null,null,{"$f":"MID(L17,9,70)","v":""},{"$f":"IF(LEFT(K17,4)=\"ваша\",VALUE(MID(K17,13,20))*100,0)","v":0}]
["",null,"","","","","",null,null,{"$f":"IFERROR(IFERROR(VLOOKUP(C18,#REF!,3,0)*D18,VLOOKUP(C18,#REF!,7,0)*D18),\"нет веса\")","v":"нет веса"},null,"Область: ",null,null,null,{"$f":"MID(L18,10,70)","v":""}]
["",null,"","","","","",null,null,{"$f":"IFERROR(IFERROR(VLOOKUP(C19,#REF!,3,0)*D19,VLOOKUP(C19,#REF!,7,0)*D19),\"нет веса\")","v":"нет веса"},null,"Город: ",null,null,null,{"$f":"MID(L19,8,70)","v":""},{"$f":"IF(LEFT(K19,4)=\"ваша\",VALUE(MID(K19,13,20))*100,0)","v":0}]
["",null,"","","","","",null,null,{"$f":"IFERROR(IFERROR(VLOOKUP(C20,#REF!,3,0)*D20,VLOOKUP(C20,#REF!,7,0)*D20),\"нет веса\")","v":"нет веса"},null,"Улица: ",null,null,null,{"$f":"MID(L20,8,70)","v":""},{"$f":"IF(LEFT(K31,4)=\"ваша\",VALUE(MID(K31,13,20))*100,0)","v":0}]
["",null,"","","","","",null,null,{"$f":"IFERROR(IFERROR(VLOOKUP(C21,#REF!,3,0)*D21,VLOOKUP(C21,#REF!,7,0)*D21),\"нет веса\")","v":"нет веса"},null,"Здание: ",null,null,null,{"$f":"MID(L21,9,70)","v":""},{"$f":"IF(LEFT(K32,4)=\"ваша\",VALUE(MID(K32,13,20))*100,0)","v":0}]
["",null,"","","","","",null,null,{"$f":"IFERROR(IFERROR(VLOOKUP(C22,#REF!,3,0)*D22,VLOOKUP(C22,#REF!,7,0)*D22),\"нет веса\")","v":"нет веса"},null,"Квартира: ",null,null,null,{"$f":"MID(L22,11,70)","v":""},{"$f":"IF(LEFT(#REF!,4)=\"ваша\",VALUE(MID(#REF!,13,20))*100,0)","v":{"$error":"#REF!"}}]
["",null,null,null,"Итого:",{"$f":"SUM(F7:F22)","v":9950},"",null,null,{"$f":"IF(K40>0,M40,\"\")","v":""},"Наименование","Количество","Цена","Вес","Всего",null,{"$f":"IF(LEFT(K33,4)=\"ваша\",VALUE(MID(K33,13,20))*100,0)","v":0}]
[{"$f":"IF(L41>0,N41,\"\")","v":""},null,null,"скидка:",{"$f":"IF(F23>150000,10,IF(F23>100000,8,IF(F23>60000,5,IF(F23>30000,3,0))))","v":0},{"$f":"F23-(F23*E24/100)","v":9950},{"$f":"IFERROR(SUM(I7:I22)-F29+1,0)","v":1},null,null,null,null,null,null,null,null,{"$f":"N24","v":0},{"$f":"TEXT(SUM(MID(0&P24,LARGE(ISNUMBER(-MID(P24,ROW($1:$88),1))*ROW($1:$88),ROW($1:$15)+15)+1,1)*10^ROW($1:$15)/10),REPT(0,MIN(MAX(COUNT(1/(MID(P24,ROW($1:$88),1)+1))-15,),15)))&TEXT(SUM(MID(0&P24,LARGE(ISNUMBER(-MID(P24,ROW($1:$88),1))*ROW($1:$88),ROW($1:$15))+1,1)*10^ROW($1:$15)/10),REPT(0,MIN(COUNT(1/(MID(P24,ROW($1:$88),1)+1)),15)))","v":"0"}]
[{"$f":"SUM(A7:A23)/1000*1.3","v":0},null,{"$f":"IF(E25=F26,\"Доставка БЕСПЛАТНО\",IF(E25=D26,C26,IF(E25=D27,C27,IF(E25=D28,C28,IF(E25=F27,C27&\" + НПл\",IF(E25=F28,C28&\" + НПл\",\"Укажите ТК\"))))))","v":"AVIS EXPRESS  Алматы"},2,{"$f":"D28","v":1400},null,{"$f":"IF(I25 >0,TODAY(),\"\")","v":""},null,null,{"$f":"SUM(J7:J22)/1000","v":0},null,null,null,null,null,{"$f":"E25","v":1400},{"$f":"TEXT(SUM(MID(0&P25,LARGE(ISNUMBER(-MID(P25,ROW($1:$88),1))*ROW($1:$88),ROW($1:$15)+15)+1,1)*10^ROW($1:$15)/10),REPT(0,MIN(MAX(COUNT(1/(MID(P25,ROW($1:$88),1)+1))-15,),15)))&TEXT(SUM(MID(0&P25,LARGE(ISNUMBER(-MID(P25,ROW($1:$88),1))*ROW($1:$88),ROW($1:$15))+1,1)*10^ROW($1:$15)/10),REPT(0,MIN(COUNT(1/(MID(P25,ROW($1:$88),1)+1)),15)))","v":"1400"},{"$f":"E25","v":1400},{"$f":"TEXT(SUM(MID(0&R25,LARGE(ISNUMBER(-MID(R25,ROW($1:$88),1))*ROW($1:$88),ROW($1:$15)+15)+1,1)*10^ROW($1:$15)/10),REPT(0,MIN(MAX(COUNT(1/(MID(R25,ROW($1:$88),1)+1))-15,),15)))&TEXT(SUM(MID(0&R25,LARGE(ISNUMBER(-MID(R25,ROW($1:$88),1))*ROW($1:$88),ROW($1:$15))+1,1)*10^ROW($1:$15)/10),REPT(0,MIN(COUNT(1/(MID(R25,ROW($1:$88),1)+1)),15)))","v":"1400"},null,{"$f":"TEXT(SUM(MID(0&E25,LARGE(ISNUMBER(-MID(E25,ROW($1:$88),1))*ROW($1:$88),ROW($1:$15)+15)+1,1)*10^ROW($1:$15)/10),REPT(0,MIN(MAX(COUNT(1/(MID(E25,ROW($1:$88),1)+1))-15,),15)))&TEXT(SUM(MID(0&E25,LARGE(ISNUMBER(-MID(E25,ROW($1:$88),1))*ROW($1:$88),ROW($1:$15))+1,1)*10^ROW($1:$15)/10),REPT(0,MIN(COUNT(1/(MID(E25,ROW($1:$88),1)+1)),15)))","v":{"$error":"#NUM!"}}]
[null,null,{"$f":"IFERROR(\"AVIS С А М О В Ы В О З \"&\"  \"&VLOOKUP((LEFT(B34,(LEN(B34)))),'ТАРИФЫ ТК'!J17:L268,1,0),\"НЕТ ДОСТАВКИ\")","v":"AVIS С А М О В Ы В О З   Алматы"},{"$f":"IFERROR(VLOOKUP((LEFT(B34,(LEN(B34)))),'ТАРИФЫ ТК'!J17:L268,3,0)+0.001,\"НЕТ ДОСТАВКИ\")","v":1550.001},{"$f":"IFERROR(F24+D26,\"НЕТ ДОСТАВКИ\")","v":11500.001},{"$f":"IFERROR(D26&\" + НПл\",\"НЕТ ДОСТАВКИ\")","v":"1550,001 + НПл"},{"$f":"IFERROR(CEILING((F24+D26)*(1+$D$25/100),50),0)","v":11750},null,null,null,null,null,null,null,null,{"$f":"N26","v":0},{"$f":"TEXT(SUM(MID(0&P26,LARGE(ISNUMBER(-MID(P26,ROW($1:$88),1))*ROW($1:$88),ROW($1:$15)+15)+1,1)*10^ROW($1:$15)/10),REPT(0,MIN(MAX(COUNT(1/(MID(P26,ROW($1:$88),1)+1))-15,),15)))&TEXT(SUM(MID(0&P26,LARGE(ISNUMBER(-MID(P26,ROW($1:$88),1))*ROW($1:$88),ROW($1:$15))+1,1)*10^ROW($1:$15)/10),REPT(0,MIN(COUNT(1/(MID(P26,ROW($1:$88),1)+1)),15)))","v":"0"}]
[null,null,{"$f":"IFERROR(\"AVIS Econom\"&\"  \"&VLOOKUP((LEFT(B34,(LEN(B34)))),'ТАРИФЫ ТК'!A4:A134,1,0),\"НЕТ ДОСТАВКИ\")","v":"AVIS Econom  Алматы"},{"$f":"IFERROR(VLOOKUP((LEFT(B34,(LEN(B34)))),'ТАРИФЫ ТК'!A4:C134,3,0),\"НЕТ ДОСТАВКИ\")","v":1300},{"$f":"IFERROR(F24+D27,\"НЕТ ДОСТАВКИ\")","v":11250},{"$f":"IFERROR(D27&\" + НПл\",\"НЕТ ДОСТАВКИ\")","v":"1300 + НПл"},{"$f":"IFERROR(CEILING((F24+D27)*(1+$D$25/100),50),0)","v":11500},null,null,null,null,null,null,null,null,0,{"$f":"TEXT(SUM(MID(0&P27,LARGE(ISNUMBER(-MID(P27,ROW($1:$88),1))*ROW($1:$88),ROW($1:$15)+15)+1,1)*10^ROW($1:$15)/10),REPT(0,MIN(MAX(COUNT(1/(MID(P27,ROW($1:$88),1)+1))-15,),15)))&TEXT(SUM(MID(0&P27,LARGE(ISNUMBER(-MID(P27,ROW($1:$88),1))*ROW($1:$88),ROW($1:$15))+1,1)*10^ROW($1:$15)/10),REPT(0,MIN(COUNT(1/(MID(P27,ROW($1:$88),1)+1)),15)))","v":"0"}]
[null,null,{"$f":"IFERROR(IF(A29<1,\"AVIS EXPRESS\"&\"  \"&VLOOKUP((LEFT(B34,(LEN(B34)))),'ТАРИФЫ ТК'!E4:G20,1,0),\"AV ВИМАНИЕ:   В Е С    П О С Ы Л К И    Б О Л Ь Ш Е   0,5 КГ   !!!\"),\"НЕТ ДОСТАВКИ\")","v":"AVIS EXPRESS  Алматы"},{"$f":"IFERROR(VLOOKUP((LEFT(B34,(LEN(B34)))),'ТАРИФЫ ТК'!E4:G20,3,0),\"НЕТ ДОСТАВКИ\")","v":1400},{"$f":"IFERROR(F24+D28,\"НЕТ ДОСТАВКИ\")","v":11350},{"$f":"D28&\" + НПл\"","v":"1400 + НПл"},{"$f":"IFERROR(CEILING((F24+D28)*(1+$D$25/100),50),\"НЕТ ДОСТАВКИ\")","v":11600},null,null,null,null,null,null,null,null,0,{"$f":"TEXT(SUM(MID(0&P28,LARGE(ISNUMBER(-MID(P28,ROW($1:$88),1))*ROW($1:$88),ROW($1:$15)+15)+1,1)*10^ROW($1:$15)/10),REPT(0,MIN(MAX(COUNT(1/(MID(P28,ROW($1:$88),1)+1))-15,),15)))&TEXT(SUM(MID(0&P28,LARGE(ISNUMBER(-MID(P28,ROW($1:$88),1))*ROW($1:$88),ROW($1:$15))+1,1)*10^ROW($1:$15)/10),REPT(0,MIN(COUNT(1/(MID(P28,ROW($1:$88),1)+1)),15)))","v":"0"}]
[{"$f":"IFERROR(A25*1.5,\"Количество ??\")","v":0},null,null,"К ОПЛАТЕ:",{"$f":"IFERROR(F24+E25,0)","v":11350},{"$f":"IF(E25=C29,\"Доставка БЕСПЛАТНО\",IF(E25=D26,E26,IF(E25=D27,E27,IF(E25=D28,E28,IF(E25=F27,G27,IF(E25=F28,G28,IF(E25=F26,G26,\"Укажите ТК\")))))))","v":11350},{"$f":"IFERROR(CEILING((F24+E25)*1.03,50),0)","v":11700},null,null,{"$f":"IFERROR(J25*1.5,\"Количество ??\")","v":0},null,null,null,null,null,0,{"$f":"TEXT(SUM(MID(0&P29,LARGE(ISNUMBER(-MID(P29,ROW($1:$88),1))*ROW($1:$88),ROW($1:$15)+15)+1,1)*10^ROW($1:$15)/10),REPT(0,MIN(MAX(COUNT(1/(MID(P29,ROW($1:$88),1)+1))-15,),15)))&TEXT(SUM(MID(0&P29,LARGE(ISNUMBER(-MID(P29,ROW($1:$88),1))*ROW($1:$88),ROW($1:$15))+1,1)*10^ROW($1:$15)/10),REPT(0,MIN(COUNT(1/(MID(P29,ROW($1:$88),1)+1)),15)))","v":"0"}]
["rc11091kz",null,{"$f":"IFERROR((P14&\"        \"&LEFT(P15,8)&\" = \"&TEXT(R15,\"### ### ###\")&\" т.\"),\"НЕТ ДОСТАВКИ\")","v":"        0 =  т."},null,{"$f":"IFERROR(\"QIWI = \"&CEILING((E26*1.02),10),0)","v":"QIWI = 11740"},{"$f":"IFERROR(F29-F24,\"УКАЖИТЕ ТК\")","v":1400},null,null,null,null,null,null,null,null,null,0,{"$f":"TEXT(SUM(MID(0&P30,LARGE(ISNUMBER(-MID(P30,ROW($1:$88),1))*ROW($1:$88),ROW($1:$15)+15)+1,1)*10^ROW($1:$15)/10),REPT(0,MIN(MAX(COUNT(1/(MID(P30,ROW($1:$88),1)+1))-15,),15)))&TEXT(SUM(MID(0&P30,LARGE(ISNUMBER(-MID(P30,ROW($1:$88),1))*ROW($1:$88),ROW($1:$15))+1,1)*10^ROW($1:$15)/10),REPT(0,MIN(COUNT(1/(MID(P30,ROW($1:$88),1)+1)),15)))","v":"0"}]
[{"$f":"A1","v":"+СЧЁТ Альфа-Банк+Сч1708++0"},"ПОЛУЧАТЕЛЬ:","rc11091kz",null,null,null,null,null,null,null,null,null,null,null,null,0,{"$f":"TEXT(SUM(MID(0&P31,LARGE(ISNUMBER(-MID(P31,ROW($1:$88),1))*ROW($1:$88),ROW($1:$15)+15)+1,1)*10^ROW($1:$15)/10),REPT(0,MIN(MAX(COUNT(1/(MID(P31,ROW($1:$88),1)+1))-15,),15)))&TEXT(SUM(MID(0&P31,LARGE(ISNUMBER(-MID(P31,ROW($1:$88),1))*ROW($1:$88),ROW($1:$15))+1,1)*10^ROW($1:$15)/10),REPT(0,MIN(COUNT(1/(MID(P31,ROW($1:$88),1)+1)),15)))","v":"0"}]
[{"$f":"UPPER((B3))","v":"РЕГРО «ХРИСТИАНСКИЙ ЦЕНТР СВИДЕТЕЛЕЙ ИЕГОВЫ»"},null,{"$f":"IFERROR(MID(НайтиСтрокуПоСлову(\"Комментарий: Имя :\",K1:K45),20,99),0)","v":0},null,null,null,null,null,null,null,null,null,null,null,null,0,{"$f":"TEXT(SUM(MID(0&P32,LARGE(ISNUMBER(-MID(P32,ROW($1:$88),1))*ROW($1:$88),ROW($1:$15)+15)+1,1)*10^ROW($1:$15)/10),REPT(0,MIN(MAX(COUNT(1/(MID(P32,ROW($1:$88),1)+1))-15,),15)))&TEXT(SUM(MID(0&P32,LARGE(ISNUMBER(-MID(P32,ROW($1:$88),1))*ROW($1:$88),ROW($1:$15))+1,1)*10^ROW($1:$15)/10),REPT(0,MIN(COUNT(1/(MID(P32,ROW($1:$88),1)+1)),15)))","v":"0"}]
["Область: ",{"$f":"UPPER((P18))","v":""},{"$f":"IFERROR(ПоискСНачала(C32,\"Телефон\"),0)","v":0},null,{"$f":"IFERROR(ПоискМежду(C32,\"Телефон :\",\"Примечание\"),0)","v":0},{"$f":"IFERROR(IF(LEFT(ПоискСКонца(C32,\"Примечание : \"),2)=\"г \",MID(ПоискСКонца(C32,\"Примечание : \"),3,99),IF(LEFT(ПоискСКонца(C32,\"Примечание : \"),3)=\"г. \",MID(ПоискСКонца(C32,\"Примечание : \"),4,99),IF(LEFT(ПоискСКонца(C32,\"Примечание : \"),3)=\"гор\",MID(ПоискСКонца(C32,\"Примечание : \"),6,99),0))),0)","v":0},null,null,null,null,null,null,null,null,null,0,{"$f":"TEXT(SUM(MID(0&P33,LARGE(ISNUMBER(-MID(P33,ROW($1:$88),1))*ROW($1:$88),ROW($1:$15)+15)+1,1)*10^ROW($1:$15)/10),REPT(0,MIN(MAX(COUNT(1/(MID(P33,ROW($1:$88),1)+1))-15,),15)))&TEXT(SUM(MID(0&P33,LARGE(ISNUMBER(-MID(P33,ROW($1:$88),1))*ROW($1:$88),ROW($1:$15))+1,1)*10^ROW($1:$15)/10),REPT(0,MIN(COUNT(1/(MID(P33,ROW($1:$88),1)+1)),15)))","v":"0"}]
["Город: ","Алматы",null,null,null,null,null,null,null,null,null,null,null,null,null,0,{"$f":"TEXT(SUM(MID(0&P34,LARGE(ISNUMBER(-MID(P34,ROW($1:$88),1))*ROW($1:$88),ROW($1:$15)+15)+1,1)*10^ROW($1:$15)/10),REPT(0,MIN(MAX(COUNT(1/(MID(P34,ROW($1:$88),1)+1))-15,),15)))&TEXT(SUM(MID(0&P34,LARGE(ISNUMBER(-MID(P34,ROW($1:$88),1))*ROW($1:$88),ROW($1:$15))+1,1)*10^ROW($1:$15)/10),REPT(0,MIN(COUNT(1/(MID(P34,ROW($1:$88),1)+1)),15)))","v":"0"}]
["Улица: ","мкр. «Калкаман-2», ул. Ашимова (бывш. Ауэзова), 187",null,null,null,null,null,null,null,null,null,null,null,null,null,0,{"$f":"TEXT(SUM(MID(0&P35,LARGE(ISNUMBER(-MID(P35,ROW($1:$88),1))*ROW($1:$88),ROW($1:$15)+15)+1,1)*10^ROW($1:$15)/10),REPT(0,MIN(MAX(COUNT(1/(MID(P35,ROW($1:$88),1)+1))-15,),15)))&TEXT(SUM(MID(0&P35,LARGE(ISNUMBER(-MID(P35,ROW($1:$88),1))*ROW($1:$88),ROW($1:$15))+1,1)*10^ROW($1:$15)/10),REPT(0,MIN(COUNT(1/(MID(P35,ROW($1:$88),1)+1)),15)))","v":"0"}]
["Здание: ",{"$f":"P21","v":""},null,null,null,null,null,null,null,null,null,null,null,null,null,0,{"$f":"TEXT(SUM(MID(0&P36,LARGE(ISNUMBER(-MID(P36,ROW($1:$88),1))*ROW($1:$88),ROW($1:$15)+15)+1,1)*10^ROW($1:$15)/10),REPT(0,MIN(MAX(COUNT(1/(MID(P36,ROW($1:$88),1)+1))-15,),15)))&TEXT(SUM(MID(0&P36,LARGE(ISNUMBER(-MID(P36,ROW($1:$88),1))*ROW($1:$88),ROW($1:$15))+1,1)*10^ROW($1:$15)/10),REPT(0,MIN(COUNT(1/(MID(P36,ROW($1:$88),1)+1)),15)))","v":"0"}]
["Квартира: ",{"$f":"P22","v":""},null,null,null,null,null,null,null,null,null,null,null,null,null,0,{"$f":"TEXT(SUM(MID(0&P37,LARGE(ISNUMBER(-MID(P37,ROW($1:$88),1))*ROW($1:$88),ROW($1:$15)+15)+1,1)*10^ROW($1:$15)/10),REPT(0,MIN(MAX(COUNT(1/(MID(P37,ROW($1:$88),1)+1))-15,),15)))&TEXT(SUM(MID(0&P37,LARGE(ISNUMBER(-MID(P37,ROW($1:$88),1))*ROW($1:$88),ROW($1:$15))+1,1)*10^ROW($1:$15)/10),REPT(0,MIN(COUNT(1/(MID(P37,ROW($1:$88),1)+1)),15)))","v":"0"}]
["Телефон: ",{"$f":"B4","v":"7-771-790-09-84   0----   ----"},null,null,null,null,null,null,null,null,null,null,null,null,null,0,{"$f":"TEXT(SUM(MID(0&P38,LARGE(ISNUMBER(-MID(P38,ROW($1:$88),1))*ROW($1:$88),ROW($1:$15)+15)+1,1)*10^ROW($1:$15)/10),REPT(0,MIN(MAX(COUNT(1/(MID(P38,ROW($1:$88),1)+1))-15,),15)))&TEXT(SUM(MID(0&P38,LARGE(ISNUMBER(-MID(P38,ROW($1:$88),1))*ROW($1:$88),ROW($1:$15))+1,1)*10^ROW($1:$15)/10),REPT(0,MIN(COUNT(1/(MID(P38,ROW($1:$88),1)+1)),15)))","v":"0"}]
["Индекс: ",{"$f":"P16","v":""},null,null,null,null,null,null,null,null,null,null,null,null,null,null,{"$f":"IF(LEFT(#REF!,4)=\"ваша\",VALUE(MID(#REF!,13,20))*100,0)","v":{"$error":"#REF!"}}]
["Компания:",null,null,null,null,null,null,null,null,null,null,null,null,null,null,null,{"$f":"IF(LEFT(#REF!,4)=\"ваша\",VALUE(MID(#REF!,13,20))*100,0)","v":{"$error":"#REF!"}}]
["ИИН:",{"$f":"F29","v":11350},null,null,null,null,null,null,null,null,null,null,null,null,null,null,{"$f":"IF(LEFT(#REF!,4)=\"ваша\",VALUE(MID(#REF!,13,20))*100,0)","v":{"$error":"#REF!"}}]
["------------------------","----------------------------------------------------","----------------------------------------------------","------------------------","------------------------","---------------------------","------------------------------","------------------------","------------------------",null,null,null,null,null,null,null,{"$f":"SUM(Q19:Q41)","v":{"$error":"#REF!"}}]

{"sheet":"170820_2","index":18,"n_rows":42,"n_cols":21,"rows_kept":42,"cut":false,"hidden":false,"merged":[[27,6,27,8],[31,0,31,1],[37,1,37,2],[0,4,0,7],[1,4,1,8],[2,1,2,2],[3,1,3,2],[25,6,25,8],[26,6,26,8]]}
[{"$f":"IF(LEFT(C29,2)=\"сп\",P1&\" ► СП\",IF(E25=D26,P1,IF(H6<>0,P1&\"++\"&\"0\",IF(E25=D27,P1&\"++\"&\"0\",IF(E25=D28,P1&\"++\"&\"0\",IF(E25=D27,P1&\"++\"&\"0\",IF(E25=D28,P1&\"++\"&\"0\",IF(LEFT(C25,2)=\"AV\",P1&\"++\"&F29,P1))))))))","v":"170820_2"},"2020-08-17",{"$f":"IF(E2>0,\"ОТПРАВЛЕНО\",IF(LEFT(C29,3)=\"ЗАК\",\"ЗАКАЗАНО в СПБ\",IF(G24>=0,\"ОПЛОЧЕНО\",\"ОЖИДАНИЕ ОПЛАТЫ\")))","v":"ОПЛОЧЕНО"},{"$f":"'СПИСОК ЗАКАЗОВ'!B1","v":21},null,null,null,null,{"$f":"A1","v":"170820_2"},null,"170820_2",null,null,null,null,{"$f":"IF(G24>0,\"+\"&H6&\"+\"&Q1,Q1)","v":"170820_2"},{"$f":"ПоискСКонца(K1,\"№\")","v":"170820_2"}]
["Логин",{"$f":"L3","v":"Логин"},"Номер накл-ой",null,null,null,null,null,null,null,"Примечание"]
["ФИО",{"$f":"IF(C32=0,UPPER((P9)),UPPER(C33))","v":"ФИО"},null,null,null,null,null,null,null,null,"Логин","Логин"]
["Телефон",{"$f":"R12","v":"0----   ----   ----"},null,null,{"$f":"IF(F4>0.5,\"оплачено\",IF(F4<0,\"ОПЛАТИТЬ= \"&G4,\"ОПЛАТИТЬ= \"&Q25))","v":"ОПЛАТИТЬ= 0"},0,1100,null,null,null,"Дата заказа","дата заказа"]
["e-mail:",{"$f":"L11","v":"мыло"}]
["Вес","ПРИМЕЧАНИЯ","Наименование","Кол-во","Цена","Всего",{"$f":"IF(MAX(G7:G25)>0,MAX(G7:G25),\"\")","v":""},{"$f":"IF(I7>0,\"НАЛ\",IF(I8>0,\"ПЕРЕВОД\",IF(I9>0,\"Beeline\",IF(I10>0,\"KASPI\",IF(I11>0,\"QIWI\",IF(I12>0,\"СЧЁТ Альфа-Банк\",0))))))","v":0},{"$f":"SUM(I7:I28)","v":0}]
[{"$f":"IF(L24>0,Q24*1/100,\"\")","v":""},null,"Неодимовый магнит D45x25mm(Аксиал)` (сила притяжения 80 кг)",1,7900,{"$f":"IF(D7<>\"\",E7*D7,\"\")","v":7900},{"$f":"IF(I7 >0,TODAY(),\"\")","v":""},"НАЛ",null,{"$f":"IFERROR(IFERROR(VLOOKUP(C7,#REF!,3,0)*D7,VLOOKUP(C7,#REF!,7,0)*D7),\"нет веса\")","v":"нет веса"},"Заказ №2080"]
[{"$f":"IF(L25>0,Q25*1/100,\"\")","v":""},null,{"$f":"IF(L27<>\"\",K27,\"\")","v":""},{"$f":"IF(L27>0,L27,\"\")","v":""},{"$f":"IF(M27=\"уточняйте\",0,IF(L27>0,M27,\"\"))","v":""},"","","ПЕРЕВОД",null,{"$f":"IFERROR(IFERROR(VLOOKUP(C8,#REF!,3,0)*D8,VLOOKUP(C8,#REF!,7,0)*D8),\"нет веса\")","v":"нет веса"}]
[{"$f":"IF(L26>0,Q26*1/100,\"\")","v":""},null,"","","","","","Beeline",null,{"$f":"IFERROR(IFERROR(VLOOKUP(C9,#REF!,3,0)*D9,VLOOKUP(C9,#REF!,7,0)*D9),\"нет веса\")","v":"нет веса"},"Здравствуйте, ФИО",null,null,null,null,{"$f":"MID(K9,15,70)","v":"ФИО"},{"$f":"TEXT(SUM(MID(0&L9,LARGE(ISNUMBER(-MID(L9,ROW($1:$96),1))*ROW($1:$96),ROW($1:$23)+15)+1,1)*10^ROW($1:$23)/10),REPT(0,MIN(MAX(COUNT(1/(MID(L9,ROW($1:$96),1)+1))-15,),15)))&TEXT(SUM(MID(0&L9,LARGE(ISNUMBER(-MID(L9,ROW($1:$96),1))*ROW($1:$96),ROW($1:$23))+1,1)*10^ROW($1:$23)/10),REPT(0,MIN(COUNT(1/(MID(L9,ROW($1:$96),1)+1)),15)))","v":""}]
["",null,"","","","","","KASPI",null,{"$f":"IFERROR(IFERROR(VLOOKUP(C10,#REF!,3,0)*D10,VLOOKUP(C10,#REF!,7,0)*D10),\"нет веса\")","v":"нет веса"},"Мы получили Ваш заказ номер, 2080"]
["",null,"","","","","","QIWI",null,{"$f":"IFERROR(IFERROR(VLOOKUP(C11,#REF!,3,0)*D11,VLOOKUP(C11,#REF!,7,0)*D11),\"нет веса\")","v":"нет веса"},"Электронная почта","мыло"]
["",null,"","","","","","СЧЁТ Альфа-Банк",null,{"$f":"IFERROR(IFERROR(VLOOKUP(C12,#REF!,3,0)*D12,VLOOKUP(C12,#REF!,7,0)*D12),\"нет веса\")","v":"нет веса"},"Контактный телефон",null,null,null,null,{"$f":"(L12&\"  \"&P13)","v":"  0"},{"$f":"TEXT(SUM(MID(0&P12,LARGE(ISNUMBER(-MID(P12,ROW($1:$99),1))*ROW($1:$99),ROW($1:$15)+30)+1,1)*10^ROW($1:$15)/10),REPT(0,MIN(MAX(COUNT(1/(MID(P12,ROW($1:$99),1)+1))-30,),15)))&TEXT(SUM(MID(0&P12,LARGE(ISNUMBER(-MID(P12,ROW($1:$99),1))*ROW($1:$99),ROW($1:$15)+15)+1,1)*10^ROW($1:$15)/10),REPT(0,MIN(MAX(COUNT(1/(MID(P12,ROW($1:$99),1)+1))-15,),15)))&TEXT(SUM(MID(0&P12,LARGE(ISNUMBER(-MID(P12,ROW($1:$99),1))*ROW($1:$99),ROW($1:$15))+1,1)*10^ROW($1:$15)/10),REPT(0,MIN(COUNT(1/(MID(P12,ROW($1:$99),1)+1)),15)))","v":"0"},{"$f":"(MID(Q12,1,1))&\"-\"&(MID(Q12,2,3))&\"-\"&(MID(Q12,5,3))&\"-\"&(MID(Q12,8,2))&\"-\"&(MID(Q12,10,2))&\"   \"&(MID(Q12,12,1))&\"-\"&(MID(Q12,13,3))&\"-\"&(MID(Q12,16,3))&\"-\"&(MID(Q12,19,2))&\"-\"&(MID(Q12,21,2))&\"   \"&(MID(Q12,23,1))&\"-\"&(MID(Q12,24,3))&\"-\"&(MID(Q12,27,3))&\"-\"&(MID(Q12,30,2))&\"-\"&(MID(Q12,32,2))","v":"0----   ----   ----"}]
["",null,"","","","","",null,null,{"$f":"IFERROR(IFERROR(VLOOKUP(C13,#REF!,3,0)*D13,VLOOKUP(C13,#REF!,7,0)*D13),\"нет веса\")","v":"нет веса"},null,null,null,null,null,{"$f":"IF(L13=\"-\",IFERROR(НайтиСтрокуПоСлову(\"Комментарий\",K27:K60),0),L13)","v":0}]
["",null,"","","","","",null,null,{"$f":"IFERROR(IFERROR(VLOOKUP(C14,#REF!,3,0)*D14,VLOOKUP(C14,#REF!,7,0)*D14),\"нет веса\")","v":"нет веса"},"Доставка:",null,null,null,null,{"$f":"MID(L14,23,70)","v":""}]
["",null,"","","","","",null,null,{"$f":"IFERROR(IFERROR(VLOOKUP(C15,#REF!,3,0)*D15,VLOOKUP(C15,#REF!,7,0)*D15),\"нет веса\")","v":"нет веса"},"Оплата:",null,null,null,null,{"$f":"IF(LEFT(P14,2)=\"EX\",MID(L15,11,70),L15)","v":0},{"$f":"TEXT(SUM(MID(0&P15,LARGE(ISNUMBER(-MID(P15,ROW($1:$88),1))*ROW($1:$88),ROW($1:$15)+15)+1,1)*10^ROW($1:$15)/10),REPT(0,MIN(MAX(COUNT(1/(MID(P15,ROW($1:$88),1)+1))-15,),15)))&TEXT(SUM(MID(0&P15,LARGE(ISNUMBER(-MID(P15,ROW($1:$88),1))*ROW($1:$88),ROW($1:$15))+1,1)*10^ROW($1:$15)/10),REPT(0,MIN(COUNT(1/(MID(P15,ROW($1:$88),1)+1)),15)))","v":"0"},{"$f":"SUMPRODUCT(--SUBSTITUTE(Q15:Q15,CHAR(160),))","v":0},{"$f":"LEN(Q15)","v":1},{"$f":"FLOOR(S15/3,1)","v":0}]
["",null,"","","","","",null,null,{"$f":"IFERROR(IFERROR(VLOOKUP(C16,#REF!,3,0)*D16,VLOOKUP(C16,#REF!,7,0)*D16),\"нет веса\")","v":"нет веса"},"Адрес доставки","Индекс: ",null,null,null,{"$f":"MID(L16,9,70)","v":""}]
["",null,"","","","","",null,null,{"$f":"IFERROR(IFERROR(VLOOKUP(C17,#REF!,3,0)*D17,VLOOKUP(C17,#REF!,7,0)*D17),\"нет веса\")","v":"нет веса"},null,"Страна: ",null,null,null,{"$f":"MID(L17,9,70)","v":""},{"$f":"IF(LEFT(K17,4)=\"ваша\",VALUE(MID(K17,13,20))*100,0)","v":0}]
["",null,"","","","","",null,null,{"$f":"IFERROR(IFERROR(VLOOKUP(C18,#REF!,3,0)*D18,VLOOKUP(C18,#REF!,7,0)*D18),\"нет веса\")","v":"нет веса"},null,"Область: ",null,null,null,{"$f":"MID(L18,10,70)","v":""}]
["",null,"","","","","",null,null,{"$f":"IFERROR(IFERROR(VLOOKUP(C19,#REF!,3,0)*D19,VLOOKUP(C19,#REF!,7,0)*D19),\"нет веса\")","v":"нет веса"},null,"Город: ",null,null,null,{"$f":"MID(L19,8,70)","v":""},{"$f":"IF(LEFT(K19,4)=\"ваша\",VALUE(MID(K19,13,20))*100,0)","v":0}]
["",null,"","","","","",null,null,{"$f":"IFERROR(IFERROR(VLOOKUP(C20,#REF!,3,0)*D20,VLOOKUP(C20,#REF!,7,0)*D20),\"нет веса\")","v":"нет веса"},null,"Улица: ",null,null,null,{"$f":"MID(L20,8,70)","v":""},{"$f":"IF(LEFT(K31,4)=\"ваша\",VALUE(MID(K31,13,20))*100,0)","v":0}]
["",null,"","","","","",null,null,{"$f":"IFERROR(IFERROR(VLOOKUP(C21,#REF!,3,0)*D21,VLOOKUP(C21,#REF!,7,0)*D21),\"нет веса\")","v":"нет веса"},null,"Здание: ",null,null,null,{"$f":"MID(L21,9,70)","v":""},{"$f":"IF(LEFT(K32,4)=\"ваша\",VALUE(MID(K32,13,20))*100,0)","v":0}]
["",null,"","","","","",null,null,{"$f":"IFERROR(IFERROR(VLOOKUP(C22,#REF!,3,0)*D22,VLOOKUP(C22,#REF!,7,0)*D22),\"нет веса\")","v":"нет веса"},null,"Квартира: ",null,null,null,{"$f":"MID(L22,11,70)","v":""},{"$f":"IF(LEFT(#REF!,4)=\"ваша\",VALUE(MID(#REF!,13,20))*100,0)","v":{"$error":"#REF!"}}]
["",null,null,null,"Итого:",{"$f":"SUM(F7:F22)","v":7900},"",null,null,{"$f":"IF(K40>0,M40,\"\")","v":""},"Наименование","Количество","Цена","Вес","Всего",null,{"$f":"IF(LEFT(K33,4)=\"ваша\",VALUE(MID(K33,13,20))*100,0)","v":0}]
[{"$f":"IF(L41>0,N41,\"\")","v":""},null,null,"скидка:",{"$f":"IF(F23>150000,10,IF(F23>100000,8,IF(F23>60000,5,IF(F23>30000,3,0))))","v":0},{"$f":"F23-(F23*E24/100)","v":7900},{"$f":"IFERROR(SUM(I7:I22)-F29+1,0)","v":0},null,null,null,null,null,null,null,null,{"$f":"N24","v":0},{"$f":"TEXT(SUM(MID(0&P24,LARGE(ISNUMBER(-MID(P24,ROW($1:$88),1))*ROW($1:$88),ROW($1:$15)+15)+1,1)*10^ROW($1:$15)/10),REPT(0,MIN(MAX(COUNT(1/(MID(P24,ROW($1:$88),1)+1))-15,),15)))&TEXT(SUM(MID(0&P24,LARGE(ISNUMBER(-MID(P24,ROW($1:$88),1))*ROW($1:$88),ROW($1:$15))+1,1)*10^ROW($1:$15)/10),REPT(0,MIN(COUNT(1/(MID(P24,ROW($1:$88),1)+1)),15)))","v":"0"}]
[{"$f":"SUM(A7:A23)/1000*1.3","v":0},null,{"$f":"IF(E25=F26,\"Доставка БЕСПЛАТНО\",IF(E25=D26,C26,IF(E25=D27,C27,IF(E25=D28,C28,IF(E25=F27,C27&\" + НПл\",IF(E25=F28,C28&\" + НПл\",\"Укажите ТК\"))))))","v":"Укажите ТК"},2,null,null,{"$f":"IF(I25 >0,TODAY(),\"\")","v":""},null,null,{"$f":"SUM(J7:J22)/1000","v":0},null,null,null,null,null,{"$f":"E25","v":0},{"$f":"TEXT(SUM(MID(0&P25,LARGE(ISNUMBER(-MID(P25,ROW($1:$88),1))*ROW($1:$88),ROW($1:$15)+15)+1,1)*10^ROW($1:$15)/10),REPT(0,MIN(MAX(COUNT(1/(MID(P25,ROW($1:$88),1)+1))-15,),15)))&TEXT(SUM(MID(0&P25,LARGE(ISNUMBER(-MID(P25,ROW($1:$88),1))*ROW($1:$88),ROW($1:$15))+1,1)*10^ROW($1:$15)/10),REPT(0,MIN(COUNT(1/(MID(P25,ROW($1:$88),1)+1)),15)))","v":"0"},{"$f":"E25","v":0},{"$f":"TEXT(SUM(MID(0&R25,LARGE(ISNUMBER(-MID(R25,ROW($1:$88),1))*ROW($1:$88),ROW($1:$15)+15)+1,1)*10^ROW($1:$15)/10),REPT(0,MIN(MAX(COUNT(1/(MID(R25,ROW($1:$88),1)+1))-15,),15)))&TEXT(SUM(MID(0&R25,LARGE(ISNUMBER(-MID(R25,ROW($1:$88),1))*ROW($1:$88),ROW($1:$15))+1,1)*10^ROW($1:$15)/10),REPT(0,MIN(COUNT(1/(MID(R25,ROW($1:$88),1)+1)),15)))","v":"0"},null,{"$f":"TEXT(SUM(MID(0&E25,LARGE(ISNUMBER(-MID(E25,ROW($1:$88),1))*ROW($1:$88),ROW($1:$15)+15)+1,1)*10^ROW($1:$15)/10),REPT(0,MIN(MAX(COUNT(1/(MID(E25,ROW($1:$88),1)+1))-15,),15)))&TEXT(SUM(MID(0&E25,LARGE(ISNUMBER(-MID(E25,ROW($1:$88),1))*ROW($1:$88),ROW($1:$15))+1,1)*10^ROW($1:$15)/10),REPT(0,MIN(COUNT(1/(MID(E25,ROW($1:$88),1)+1)),15)))","v":{"$error":"#NUM!"}}]
[null,null,{"$f":"IFERROR(\"AVIS С А М О В Ы В О З \"&\"  \"&VLOOKUP((LEFT(B34,(LEN(B34)))),'ТАРИФЫ ТК'!J17:L268,1,0),\"НЕТ ДОСТАВКИ\")","v":"AVIS С А М О В Ы В О З   Алматы"},{"$f":"IFERROR(VLOOKUP((LEFT(B34,(LEN(B34)))),'ТАРИФЫ ТК'!J17:L268,3,0)+0.001,\"НЕТ ДОСТАВКИ\")","v":1550.001},{"$f":"IFERROR(F24+D26,\"НЕТ ДОСТАВКИ\")","v":9450.0010000000002},{"$f":"IFERROR(D26&\" + НПл\",\"НЕТ ДОСТАВКИ\")","v":"1550,001 + НПл"},{"$f":"IFERROR(CEILING((F24+D26)*(1+$D$25/100),50),0)","v":9650},null,null,null,null,null,null,null,null,{"$f":"N26","v":0},{"$f":"TEXT(SUM(MID(0&P26,LARGE(ISNUMBER(-MID(P26,ROW($1:$88),1))*ROW($1:$88),ROW($1:$15)+15)+1,1)*10^ROW($1:$15)/10),REPT(0,MIN(MAX(COUNT(1/(MID(P26,ROW($1:$88),1)+1))-15,),15)))&TEXT(SUM(MID(0&P26,LARGE(ISNUMBER(-MID(P26,ROW($1:$88),1))*ROW($1:$88),ROW($1:$15))+1,1)*10^ROW($1:$15)/10),REPT(0,MIN(COUNT(1/(MID(P26,ROW($1:$88),1)+1)),15)))","v":"0"}]
[null,null,{"$f":"IFERROR(\"AVIS Econom\"&\"  \"&VLOOKUP((LEFT(B34,(LEN(B34)))),'ТАРИФЫ ТК'!A4:A134,1,0),\"НЕТ ДОСТАВКИ\")","v":"AVIS Econom  Алматы"},{"$f":"IFERROR(VLOOKUP((LEFT(B34,(LEN(B34)))),'ТАРИФЫ ТК'!A4:C134,3,0),\"НЕТ ДОСТАВКИ\")","v":1300},{"$f":"IFERROR(F24+D27,\"НЕТ ДОСТАВКИ\")","v":9200},{"$f":"IFERROR(D27&\" + НПл\",\"НЕТ ДОСТАВКИ\")","v":"1300 + НПл"},{"$f":"IFERROR(CEILING((F24+D27)*(1+$D$25/100),50),0)","v":9400},null,null,null,null,null,null,null,null,0,{"$f":"TEXT(SUM(MID(0&P27,LARGE(ISNUMBER(-MID(P27,ROW($1:$88),1))*ROW($1:$88),ROW($1:$15)+15)+1,1)*10^ROW($1:$15)/10),REPT(0,MIN(MAX(COUNT(1/(MID(P27,ROW($1:$88),1)+1))-15,),15)))&TEXT(SUM(MID(0&P27,LARGE(ISNUMBER(-MID(P27,ROW($1:$88),1))*ROW($1:$88),ROW($1:$15))+1,1)*10^ROW($1:$15)/10),REPT(0,MIN(COUNT(1/(MID(P27,ROW($1:$88),1)+1)),15)))","v":"0"}]
[null,null,{"$f":"IFERROR(IF(A29<1,\"AVIS EXPRESS\"&\"  \"&VLOOKUP((LEFT(B34,(LEN(B34)))),'ТАРИФЫ ТК'!E4:G20,1,0),\"AV ВИМАНИЕ:   В Е С    П О С Ы Л К И    Б О Л Ь Ш Е   0,5 КГ   !!!\"),\"НЕТ ДОСТАВКИ\")","v":"AVIS EXPRESS  Алматы"},{"$f":"IFERROR(VLOOKUP((LEFT(B34,(LEN(B34)))),'ТАРИФЫ ТК'!E4:G20,3,0),\"НЕТ ДОСТАВКИ\")","v":1400},{"$f":"IFERROR(F24+D28,\"НЕТ ДОСТАВКИ\")","v":9300},{"$f":"D28&\" + НПл\"","v":"1400 + НПл"},{"$f":"IFERROR(CEILING((F24+D28)*(1+$D$25/100),50),\"НЕТ ДОСТАВКИ\")","v":9500},null,null,null,null,null,null,null,null,0,{"$f":"TEXT(SUM(MID(0&P28,LARGE(ISNUMBER(-MID(P28,ROW($1:$88),1))*ROW($1:$88),ROW($1:$15)+15)+1,1)*10^ROW($1:$15)/10),REPT(0,MIN(MAX(COUNT(1/(MID(P28,ROW($1:$88),1)+1))-15,),15)))&TEXT(SUM(MID(0&P28,LARGE(ISNUMBER(-MID(P28,ROW($1:$88),1))*ROW($1:$88),ROW($1:$15))+1,1)*10^ROW($1:$15)/10),REPT(0,MIN(COUNT(1/(MID(P28,ROW($1:$88),1)+1)),15)))","v":"0"}]
[{"$f":"IFERROR(A25*1.5,\"Количество ??\")","v":0},null,null,"К ОПЛАТЕ:",{"$f":"IFERROR(F24+E25,0)","v":7900},{"$f":"IF(E25=C29,\"Доставка БЕСПЛАТНО\",IF(E25=D26,E26,IF(E25=D27,E27,IF(E25=D28,E28,IF(E25=F27,G27,IF(E25=F28,G28,IF(E25=F26,G26,\"Укажите ТК\")))))))","v":"Доставка БЕСПЛАТНО"},{"$f":"IFERROR(CEILING((F24+E25)*1.03,50),0)","v":8150},null,null,{"$f":"IFERROR(J25*1.5,\"Количество ??\")","v":0},null,null,null,null,null,0,{"$f":"TEXT(SUM(MID(0&P29,LARGE(ISNUMBER(-MID(P29,ROW($1:$88),1))*ROW($1:$88),ROW($1:$15)+15)+1,1)*10^ROW($1:$15)/10),REPT(0,MIN(MAX(COUNT(1/(MID(P29,ROW($1:$88),1)+1))-15,),15)))&TEXT(SUM(MID(0&P29,LARGE(ISNUMBER(-MID(P29,ROW($1:$88),1))*ROW($1:$88),ROW($1:$15))+1,1)*10^ROW($1:$15)/10),REPT(0,MIN(COUNT(1/(MID(P29,ROW($1:$88),1)+1)),15)))","v":"0"}]
["rc11091kz",null,{"$f":"IFERROR((P14&\"        \"&LEFT(P15,8)&\" = \"&TEXT(R15,\"### ### ###\")&\" т.\"),\"НЕТ ДОСТАВКИ\")","v":"        0 =  т."},null,{"$f":"IFERROR(\"QIWI = \"&CEILING((E26*1.02),10),0)","v":"QIWI = 9640"},{"$f":"IFERROR(F29-F24,\"УКАЖИТЕ ТК\")","v":"УКАЖИТЕ ТК"},null,null,null,null,null,null,null,null,null,0,{"$f":"TEXT(SUM(MID(0&P30,LARGE(ISNUMBER(-MID(P30,ROW($1:$88),1))*ROW($1:$88),ROW($1:$15)+15)+1,1)*10^ROW($1:$15)/10),REPT(0,MIN(MAX(COUNT(1/(MID(P30,ROW($1:$88),1)+1))-15,),15)))&TEXT(SUM(MID(0&P30,LARGE(ISNUMBER(-MID(P30,ROW($1:$88),1))*ROW($1:$88),ROW($1:$15))+1,1)*10^ROW($1:$15)/10),REPT(0,MIN(COUNT(1/(MID(P30,ROW($1:$88),1)+1)),15)))","v":"0"}]
[{"$f":"A1","v":"170820_2"},"ПОЛУЧАТЕЛЬ:","rc11091kz",null,null,null,null,null,null,null,null,null,null,null,null,0,{"$f":"TEXT(SUM(MID(0&P31,LARGE(ISNUMBER(-MID(P31,ROW($1:$88),1))*ROW($1:$88),ROW($1:$15)+15)+1,1)*10^ROW($1:$15)/10),REPT(0,MIN(MAX(COUNT(1/(MID(P31,ROW($1:$88),1)+1))-15,),15)))&TEXT(SUM(MID(0&P31,LARGE(ISNUMBER(-MID(P31,ROW($1:$88),1))*ROW($1:$88),ROW($1:$15))+1,1)*10^ROW($1:$15)/10),REPT(0,MIN(COUNT(1/(MID(P31,ROW($1:$88),1)+1)),15)))","v":"0"}]
[{"$f":"UPPER((B3))","v":"ФИО"},null,{"$f":"IFERROR(MID(НайтиСтрокуПоСлову(\"Комментарий: Имя :\",K1:K45),20,99),0)","v":0},null,null,null,null,null,null,null,null,null,null,null,null,0,{"$f":"TEXT(SUM(MID(0&P32,LARGE(ISNUMBER(-MID(P32,ROW($1:$88),1))*ROW($1:$88),ROW($1:$15)+15)+1,1)*10^ROW($1:$15)/10),REPT(0,MIN(MAX(COUNT(1/(MID(P32,ROW($1:$88),1)+1))-15,),15)))&TEXT(SUM(MID(0&P32,LARGE(ISNUMBER(-MID(P32,ROW($1:$88),1))*ROW($1:$88),ROW($1:$15))+1,1)*10^ROW($1:$15)/10),REPT(0,MIN(COUNT(1/(MID(P32,ROW($1:$88),1)+1)),15)))","v":"0"}]
["Область: ",{"$f":"UPPER((P18))","v":""},{"$f":"IFERROR(ПоискСНачала(C32,\"Телефон\"),0)","v":0},null,{"$f":"IFERROR(ПоискМежду(C32,\"Телефон :\",\"Примечание\"),0)","v":0},{"$f":"IFERROR(IF(LEFT(ПоискСКонца(C32,\"Примечание : \"),2)=\"г \",MID(ПоискСКонца(C32,\"Примечание : \"),3,99),IF(LEFT(ПоискСКонца(C32,\"Примечание : \"),3)=\"г. \",MID(ПоискСКонца(C32,\"Примечание : \"),4,99),IF(LEFT(ПоискСКонца(C32,\"Примечание : \"),3)=\"гор\",MID(ПоискСКонца(C32,\"Примечание : \"),6,99),0))),0)","v":0},null,null,null,null,null,null,null,null,null,0,{"$f":"TEXT(SUM(MID(0&P33,LARGE(ISNUMBER(-MID(P33,ROW($1:$88),1))*ROW($1:$88),ROW($1:$15)+15)+1,1)*10^ROW($1:$15)/10),REPT(0,MIN(MAX(COUNT(1/(MID(P33,ROW($1:$88),1)+1))-15,),15)))&TEXT(SUM(MID(0&P33,LARGE(ISNUMBER(-MID(P33,ROW($1:$88),1))*ROW($1:$88),ROW($1:$15))+1,1)*10^ROW($1:$15)/10),REPT(0,MIN(COUNT(1/(MID(P33,ROW($1:$88),1)+1)),15)))","v":"0"}]
["Город: ","Алматы",null,null,null,null,null,null,null,null,null,null,null,null,null,0,{"$f":"TEXT(SUM(MID(0&P34,LARGE(ISNUMBER(-MID(P34,ROW($1:$88),1))*ROW($1:$88),ROW($1:$15)+15)+1,1)*10^ROW($1:$15)/10),REPT(0,MIN(MAX(COUNT(1/(MID(P34,ROW($1:$88),1)+1))-15,),15)))&TEXT(SUM(MID(0&P34,LARGE(ISNUMBER(-MID(P34,ROW($1:$88),1))*ROW($1:$88),ROW($1:$15))+1,1)*10^ROW($1:$15)/10),REPT(0,MIN(COUNT(1/(MID(P34,ROW($1:$88),1)+1)),15)))","v":"0"}]
["Улица: ",{"$f":"UPPER((P20))","v":""},null,null,null,null,null,null,null,null,null,null,null,null,null,0,{"$f":"TEXT(SUM(MID(0&P35,LARGE(ISNUMBER(-MID(P35,ROW($1:$88),1))*ROW($1:$88),ROW($1:$15)+15)+1,1)*10^ROW($1:$15)/10),REPT(0,MIN(MAX(COUNT(1/(MID(P35,ROW($1:$88),1)+1))-15,),15)))&TEXT(SUM(MID(0&P35,LARGE(ISNUMBER(-MID(P35,ROW($1:$88),1))*ROW($1:$88),ROW($1:$15))+1,1)*10^ROW($1:$15)/10),REPT(0,MIN(COUNT(1/(MID(P35,ROW($1:$88),1)+1)),15)))","v":"0"}]
["Здание: ",{"$f":"P21","v":""},null,null,null,null,null,null,null,null,null,null,null,null,null,0,{"$f":"TEXT(SUM(MID(0&P36,LARGE(ISNUMBER(-MID(P36,ROW($1:$88),1))*ROW($1:$88),ROW($1:$15)+15)+1,1)*10^ROW($1:$15)/10),REPT(0,MIN(MAX(COUNT(1/(MID(P36,ROW($1:$88),1)+1))-15,),15)))&TEXT(SUM(MID(0&P36,LARGE(ISNUMBER(-MID(P36,ROW($1:$88),1))*ROW($1:$88),ROW($1:$15))+1,1)*10^ROW($1:$15)/10),REPT(0,MIN(COUNT(1/(MID(P36,ROW($1:$88),1)+1)),15)))","v":"0"}]
["Квартира: ",{"$f":"P22","v":""},null,null,null,null,null,null,null,null,null,null,null,null,null,0,{"$f":"TEXT(SUM(MID(0&P37,LARGE(ISNUMBER(-MID(P37,ROW($1:$88),1))*ROW($1:$88),ROW($1:$15)+15)+1,1)*10^ROW($1:$15)/10),REPT(0,MIN(MAX(COUNT(1/(MID(P37,ROW($1:$88),1)+1))-15,),15)))&TEXT(SUM(MID(0&P37,LARGE(ISNUMBER(-MID(P37,ROW($1:$88),1))*ROW($1:$88),ROW($1:$15))+1,1)*10^ROW($1:$15)/10),REPT(0,MIN(COUNT(1/(MID(P37,ROW($1:$88),1)+1)),15)))","v":"0"}]
["Телефон: ",{"$f":"B4","v":"0----   ----   ----"},null,null,null,null,null,null,null,null,null,null,null,null,null,0,{"$f":"TEXT(SUM(MID(0&P38,LARGE(ISNUMBER(-MID(P38,ROW($1:$88),1))*ROW($1:$88),ROW($1:$15)+15)+1,1)*10^ROW($1:$15)/10),REPT(0,MIN(MAX(COUNT(1/(MID(P38,ROW($1:$88),1)+1))-15,),15)))&TEXT(SUM(MID(0&P38,LARGE(ISNUMBER(-MID(P38,ROW($1:$88),1))*ROW($1:$88),ROW($1:$15))+1,1)*10^ROW($1:$15)/10),REPT(0,MIN(COUNT(1/(MID(P38,ROW($1:$88),1)+1)),15)))","v":"0"}]
["Индекс: ",{"$f":"P16","v":""},null,null,null,null,null,null,null,null,null,null,null,null,null,null,{"$f":"IF(LEFT(#REF!,4)=\"ваша\",VALUE(MID(#REF!,13,20))*100,0)","v":{"$error":"#REF!"}}]
["Компания:",null,null,null,null,null,null,null,null,null,null,null,null,null,null,null,{"$f":"IF(LEFT(#REF!,4)=\"ваша\",VALUE(MID(#REF!,13,20))*100,0)","v":{"$error":"#REF!"}}]
["ИИН:",{"$f":"F29","v":"Доставка БЕСПЛАТНО"},null,null,null,null,null,null,null,null,null,null,null,null,null,null,{"$f":"IF(LEFT(#REF!,4)=\"ваша\",VALUE(MID(#REF!,13,20))*100,0)","v":{"$error":"#REF!"}}]
["------------------------","----------------------------------------------------","----------------------------------------------------","------------------------","------------------------","---------------------------","------------------------------","------------------------","------------------------",null,null,null,null,null,null,null,{"$f":"SUM(Q19:Q41)","v":{"$error":"#REF!"}}]

{"sheet":"+KASPI+ 9651++0","index":19,"n_rows":42,"n_cols":21,"rows_kept":42,"cut":false,"hidden":false,"merged":[[27,6,27,8],[31,0,31,1],[37,1,37,2],[0,4,0,7],[1,4,1,8],[2,1,2,2],[3,1,3,2],[25,6,25,8],[26,6,26,8]]}
[{"$f":"IF(LEFT(C29,2)=\"сп\",P1&\" ► СП\",IF(E25=D26,P1,IF(H6<>0,P1&\"++\"&\"0\",IF(E25=D27,P1&\"++\"&\"0\",IF(E25=D28,P1&\"++\"&\"0\",IF(E25=D27,P1&\"++\"&\"0\",IF(E25=D28,P1&\"++\"&\"0\",IF(LEFT(C25,2)=\"AV\",P1&\"++\"&F29,P1))))))))","v":"+KASPI+ 9651++0"},{"$f":"L4","v":"2020-08-19T13:08:48"},{"$f":"IF(E2>0,\"ОТПРАВЛЕНО\",IF(LEFT(C29,3)=\"ЗАК\",\"ЗАКАЗАНО в СПБ\",IF(G24>=0,\"ОПЛОЧЕНО\",\"ОЖИДАНИЕ ОПЛАТЫ\")))","v":"ОПЛОЧЕНО"},{"$f":"'СПИСОК ЗАКАЗОВ'!B1","v":21},null,null,null,null,{"$f":"A1","v":"+KASPI+ 9651++0"},null,"Заказ № 9651",null,null,null,null,{"$f":"IF(G24>0,\"+\"&H6&\"+\"&Q1,Q1)","v":"+KASPI+ 9651"},{"$f":"ПоискСКонца(K1,\"№\")","v":" 9651"}]
["Логин",{"$f":"L3","v":0},"Номер накл-ой",null,null,null,null,null,null,null,"Примечание"]
["ФИО",{"$f":"IF(C32=0,UPPER((P9)),UPPER(C33))","v":"САВОРОВСКИЙ ДМИТРИЙ"},null,null,null,null,null,null,null,null,"Логин"]
["Телефон",{"$f":"R12","v":"7-778-500-02-25   0----   ----"},null,null,{"$f":"IF(F4>0.5,\"оплачено\",IF(F4<0,\"ОПЛАТИТЬ= \"&G4,\"ОПЛАТИТЬ= \"&Q25))","v":"ОПЛАТИТЬ= 1400"},0,1100,null,null,null,"Дата заказа","2020-08-19T13:08:48"]
["e-mail:",{"$f":"L11","v":"-"}]
["Вес","ПРИМЕЧАНИЯ","Наименование","Кол-во","Цена","Всего",{"$f":"IF(MAX(G7:G25)>0,MAX(G7:G25),\"\")","v":"2020-08-21"},{"$f":"IF(I7>0,\"НАЛ\",IF(I8>0,\"ПЕРЕВОД\",IF(I9>0,\"Beeline\",IF(I10>0,\"KASPI\",IF(I11>0,\"QIWI\",IF(I12>0,\"СЧЁТ Альфа-Банк\",0))))))","v":"KASPI"},{"$f":"SUM(I7:I28)","v":3350}]
[{"$f":"IF(L24>0,Q24*1/100,\"\")","v":""},null,{"$f":"IF(L26<>\"\",K26,\"\")","v":"Неодимовый магнит 20x5x5mm `"},null,{"$f":"IF(M26=\"уточняйте\",0,IF(L26>0,M26,\"\"))","v":330},{"$f":"IF(D7<>\"\",E7*D7,\"\")","v":""},{"$f":"IF(I7 >0,TODAY(),\"\")","v":""},"НАЛ",null,{"$f":"IFERROR(IFERROR(VLOOKUP(C7,#REF!,3,0)*D7,VLOOKUP(C7,#REF!,7,0)*D7),\"нет веса\")","v":"нет веса"},"Заказ №9651"]
[{"$f":"IF(L25>0,Q25*1/100,\"\")","v":14},null,{"$f":"IF(L27<>\"\",K27,\"\")","v":"Неодимовый магнит 25x10x6mm `35М"},null,{"$f":"IF(M27=\"уточняйте\",0,IF(L27>0,M27,\"\"))","v":1100},"","","ПЕРЕВОД",null,{"$f":"IFERROR(IFERROR(VLOOKUP(C8,#REF!,3,0)*D8,VLOOKUP(C8,#REF!,7,0)*D8),\"нет веса\")","v":"нет веса"}]
[{"$f":"IF(L26>0,Q26*1/100,\"\")","v":0.04},null,"Неодимовый магнит 30x5x5mm `",null,650,"","","Beeline",null,{"$f":"IFERROR(IFERROR(VLOOKUP(C9,#REF!,3,0)*D9,VLOOKUP(C9,#REF!,7,0)*D9),\"нет веса\")","v":"нет веса"},"Здравствуйте, Саворовский Дмитрий",null,null,null,null,{"$f":"MID(K9,15,70)","v":"Саворовский Дмитрий"},{"$f":"TEXT(SUM(MID(0&L9,LARGE(ISNUMBER(-MID(L9,ROW($1:$96),1))*ROW($1:$96),ROW($1:$23)+15)+1,1)*10^ROW($1:$23)/10),REPT(0,MIN(MAX(COUNT(1/(MID(L9,ROW($1:$96),1)+1))-15,),15)))&TEXT(SUM(MID(0&L9,LARGE(ISNUMBER(-MID(L9,ROW($1:$96),1))*ROW($1:$96),ROW($1:$23))+1,1)*10^ROW($1:$23)/10),REPT(0,MIN(COUNT(1/(MID(L9,ROW($1:$96),1)+1)),15)))","v":""}]
[0.11,null,"Неодимовый магнит 25x9x9mm `42",3,650,1950,"2020-08-21","KASPI",{"$f":"F29","v":3350},{"$f":"IFERROR(IFERROR(VLOOKUP(C10,#REF!,3,0)*D10,VLOOKUP(C10,#REF!,7,0)*D10),\"нет веса\")","v":"нет веса"},"Мы получили Ваш заказ номер, 9651"]
[0.06,null,"",{"$f":"IF(L30>0,L30,\"\")","v":""},"","","","QIWI",null,{"$f":"IFERROR(IFERROR(VLOOKUP(C11,#REF!,3,0)*D11,VLOOKUP(C11,#REF!,7,0)*D11),\"нет веса\")","v":"нет веса"},"Электронная почта:","-"]
["",null,"","","","","","СЧЁТ Альфа-Банк",null,{"$f":"IFERROR(IFERROR(VLOOKUP(C12,#REF!,3,0)*D12,VLOOKUP(C12,#REF!,7,0)*D12),\"нет веса\")","v":"нет веса"},"Контактный телефон:","+7 (778) 500-02-25",null,null,null,{"$f":"(L12&\"  \"&P13)","v":"+7 (778) 500-02-25  0"},{"$f":"TEXT(SUM(MID(0&P12,LARGE(ISNUMBER(-MID(P12,ROW($1:$99),1))*ROW($1:$99),ROW($1:$15)+30)+1,1)*10^ROW($1:$15)/10),REPT(0,MIN(MAX(COUNT(1/(MID(P12,ROW($1:$99),1)+1))-30,),15)))&TEXT(SUM(MID(0&P12,LARGE(ISNUMBER(-MID(P12,ROW($1:$99),1))*ROW($1:$99),ROW($1:$15)+15)+1,1)*10^ROW($1:$15)/10),REPT(0,MIN(MAX(COUNT(1/(MID(P12,ROW($1:$99),1)+1))-15,),15)))&TEXT(SUM(MID(0&P12,LARGE(ISNUMBER(-MID(P12,ROW($1:$99),1))*ROW($1:$99),ROW($1:$15))+1,1)*10^ROW($1:$15)/10),REPT(0,MIN(COUNT(1/(MID(P12,ROW($1:$99),1)+1)),15)))","v":"777850002250"},{"$f":"(MID(Q12,1,1))&\"-\"&(MID(Q12,2,3))&\"-\"&(MID(Q12,5,3))&\"-\"&(MID(Q12,8,2))&\"-\"&(MID(Q12,10,2))&\"   \"&(MID(Q12,12,1))&\"-\"&(MID(Q12,13,3))&\"-\"&(MID(Q12,16,3))&\"-\"&(MID(Q12,19,2))&\"-\"&(MID(Q12,21,2))&\"   \"&(MID(Q12,23,1))&\"-\"&(MID(Q12,24,3))&\"-\"&(MID(Q12,27,3))&\"-\"&(MID(Q12,30,2))&\"-\"&(MID(Q12,32,2))","v":"7-778-500-02-25   0----   ----"}]
["",null,"","","","","",null,null,{"$f":"IFERROR(IFERROR(VLOOKUP(C13,#REF!,3,0)*D13,VLOOKUP(C13,#REF!,7,0)*D13),\"нет веса\")","v":"нет веса"},"Доставка:","-",null,null,null,{"$f":"IF(L13=\"-\",IFERROR(НайтиСтрокуПоСлову(\"Комментарий\",K27:K60),0),L13)","v":0}]
["",null,"","","","","",null,null,{"$f":"IFERROR(IFERROR(VLOOKUP(C14,#REF!,3,0)*D14,VLOOKUP(C14,#REF!,7,0)*D14),\"нет веса\")","v":"нет веса"},"Оплата:","-",null,null,null,{"$f":"MID(L14,23,70)","v":""}]
["",null,"","","","","",null,null,{"$f":"IFERROR(IFERROR(VLOOKUP(C15,#REF!,3,0)*D15,VLOOKUP(C15,#REF!,7,0)*D15),\"нет веса\")","v":"нет веса"},null,null,null,null,null,{"$f":"IF(LEFT(P14,2)=\"EX\",MID(L15,11,70),L15)","v":0},{"$f":"TEXT(SUM(MID(0&P15,LARGE(ISNUMBER(-MID(P15,ROW($1:$88),1))*ROW($1:$88),ROW($1:$15)+15)+1,1)*10^ROW($1:$15)/10),REPT(0,MIN(MAX(COUNT(1/(MID(P15,ROW($1:$88),1)+1))-15,),15)))&TEXT(SUM(MID(0&P15,LARGE(ISNUMBER(-MID(P15,ROW($1:$88),1))*ROW($1:$88),ROW($1:$15))+1,1)*10^ROW($1:$15)/10),REPT(0,MIN(COUNT(1/(MID(P15,ROW($1:$88),1)+1)),15)))","v":"0"},{"$f":"SUMPRODUCT(--SUBSTITUTE(Q15:Q15,CHAR(160),))","v":0},{"$f":"LEN(Q15)","v":1},{"$f":"FLOOR(S15/3,1)","v":0}]
["",null,"","","","","",null,null,{"$f":"IFERROR(IFERROR(VLOOKUP(C16,#REF!,3,0)*D16,VLOOKUP(C16,#REF!,7,0)*D16),\"нет веса\")","v":"нет веса"},"Адрес доставки:","Индекс:",null,null,null,{"$f":"MID(L16,9,70)","v":""}]
["",null,"","","","","",null,null,{"$f":"IFERROR(IFERROR(VLOOKUP(C17,#REF!,3,0)*D17,VLOOKUP(C17,#REF!,7,0)*D17),\"нет веса\")","v":"нет веса"},null,"Страна:",null,null,null,{"$f":"MID(L17,9,70)","v":""},{"$f":"IF(LEFT(K17,4)=\"ваша\",VALUE(MID(K17,13,20))*100,0)","v":0}]
["",null,"","","","","",null,null,{"$f":"IFERROR(IFERROR(VLOOKUP(C18,#REF!,3,0)*D18,VLOOKUP(C18,#REF!,7,0)*D18),\"нет веса\")","v":"нет веса"},null,"Область:",null,null,null,{"$f":"MID(L18,10,70)","v":""}]
["",null,"","","","","",null,null,{"$f":"IFERROR(IFERROR(VLOOKUP(C19,#REF!,3,0)*D19,VLOOKUP(C19,#REF!,7,0)*D19),\"нет веса\")","v":"нет веса"},null,"Город: Павлодар",null,null,null,{"$f":"MID(L19,8,70)","v":"Павлодар"},{"$f":"IF(LEFT(K19,4)=\"ваша\",VALUE(MID(K19,13,20))*100,0)","v":0}]
["",null,"","","","","",null,null,{"$f":"IFERROR(IFERROR(VLOOKUP(C20,#REF!,3,0)*D20,VLOOKUP(C20,#REF!,7,0)*D20),\"нет веса\")","v":"нет веса"},null,"Улица: Кирова",null,null,null,{"$f":"MID(L20,8,70)","v":"Кирова"},{"$f":"IF(LEFT(K31,4)=\"ваша\",VALUE(MID(K31,13,20))*100,0)","v":0}]
["",null,"","","","","",null,null,{"$f":"IFERROR(IFERROR(VLOOKUP(C21,#REF!,3,0)*D21,VLOOKUP(C21,#REF!,7,0)*D21),\"нет веса\")","v":"нет веса"},null,"Здание: 38",null,null,null,{"$f":"MID(L21,9,70)","v":"38"},{"$f":"IF(LEFT(K32,4)=\"ваша\",VALUE(MID(K32,13,20))*100,0)","v":0}]
["",null,"","","","","",null,null,{"$f":"IFERROR(IFERROR(VLOOKUP(C22,#REF!,3,0)*D22,VLOOKUP(C22,#REF!,7,0)*D22),\"нет веса\")","v":"нет веса"},null,"Квартира: 13",null,null,null,{"$f":"MID(L22,11,70)","v":"13"},{"$f":"IF(LEFT(#REF!,4)=\"ваша\",VALUE(MID(#REF!,13,20))*100,0)","v":{"$error":"#REF!"}}]
["",null,null,null,"Итого:",{"$f":"SUM(F7:F22)","v":1950},"",null,null,{"$f":"IF(K40>0,M40,\"\")","v":""},"Комментарий :",null,null,null,null,null,{"$f":"IF(LEFT(K33,4)=\"ваша\",VALUE(MID(K33,13,20))*100,0)","v":0}]
[{"$f":"IF(L41>0,N41,\"\")","v":""},null,null,"скидка:",{"$f":"IF(F23>150000,10,IF(F23>100000,8,IF(F23>60000,5,IF(F23>30000,3,0))))","v":0},{"$f":"F23-(F23*E24/100)","v":1950},{"$f":"IFERROR(SUM(I7:I22)-F29+1,0)","v":1},null,null,null,null,null,null,null,null,{"$f":"N24","v":0},{"$f":"TEXT(SUM(MID(0&P24,LARGE(ISNUMBER(-MID(P24,ROW($1:$88),1))*ROW($1:$88),ROW($1:$15)+15)+1,1)*10^ROW($1:$15)/10),REPT(0,MIN(MAX(COUNT(1/(MID(P24,ROW($1:$88),1)+1))-15,),15)))&TEXT(SUM(MID(0&P24,LARGE(ISNUMBER(-MID(P24,ROW($1:$88),1))*ROW($1:$88),ROW($1:$15))+1,1)*10^ROW($1:$15)/10),REPT(0,MIN(COUNT(1/(MID(P24,ROW($1:$88),1)+1)),15)))","v":"0"}]
[{"$f":"SUM(A7:A23)/1000*1.3","v":1.8473E-2},null,{"$f":"IF(E25=F26,\"Доставка БЕСПЛАТНО\",IF(E25=D26,C26,IF(E25=D27,C27,IF(E25=D28,C28,IF(E25=F27,C27&\" + НПл\",IF(E25=F28,C28&\" + НПл\",\"Укажите ТК\"))))))","v":"AVIS EXPRESS  Павлодар"},2,{"$f":"D28","v":1400},null,{"$f":"IF(I25 >0,TODAY(),\"\")","v":""},null,null,{"$f":"SUM(J7:J22)/1000","v":0},"Наименование","Количество","Цена","Вес","Всего",{"$f":"E25","v":1400},{"$f":"TEXT(SUM(MID(0&P25,LARGE(ISNUMBER(-MID(P25,ROW($1:$88),1))*ROW($1:$88),ROW($1:$15)+15)+1,1)*10^ROW($1:$15)/10),REPT(0,MIN(MAX(COUNT(1/(MID(P25,ROW($1:$88),1)+1))-15,),15)))&TEXT(SUM(MID(0&P25,LARGE(ISNUMBER(-MID(P25,ROW($1:$88),1))*ROW($1:$88),ROW($1:$15))+1,1)*10^ROW($1:$15)/10),REPT(0,MIN(COUNT(1/(MID(P25,ROW($1:$88),1)+1)),15)))","v":"1400"},{"$f":"E25","v":1400},{"$f":"TEXT(SUM(MID(0&R25,LARGE(ISNUMBER(-MID(R25,ROW($1:$88),1))*ROW($1:$88),ROW($1:$15)+15)+1,1)*10^ROW($1:$15)/10),REPT(0,MIN(MAX(COUNT(1/(MID(R25,ROW($1:$88),1)+1))-15,),15)))&TEXT(SUM(MID(0&R25,LARGE(ISNUMBER(-MID(R25,ROW($1:$88),1))*ROW($1:$88),ROW($1:$15))+1,1)*10^ROW($1:$15)/10),REPT(0,MIN(COUNT(1/(MID(R25,ROW($1:$88),1)+1)),15)))","v":"1400"},null,{"$f":"TEXT(SUM(MID(0&E25,LARGE(ISNUMBER(-MID(E25,ROW($1:$88),1))*ROW($1:$88),ROW($1:$15)+15)+1,1)*10^ROW($1:$15)/10),REPT(0,MIN(MAX(COUNT(1/(MID(E25,ROW($1:$88),1)+1))-15,),15)))&TEXT(SUM(MID(0&E25,LARGE(ISNUMBER(-MID(E25,ROW($1:$88),1))*ROW($1:$88),ROW($1:$15))+1,1)*10^ROW($1:$15)/10),REPT(0,MIN(COUNT(1/(MID(E25,ROW($1:$88),1)+1)),15)))","v":{"$error":"#NUM!"}}]
[null,null,{"$f":"IFERROR(\"AVIS С А М О В Ы В О З \"&\"  \"&VLOOKUP((LEFT(B34,(LEN(B34)))),'ТАРИФЫ ТК'!J17:L268,1,0),\"НЕТ ДОСТАВКИ\")","v":"AVIS С А М О В Ы В О З   Павлодар"},{"$f":"IFERROR(VLOOKUP((LEFT(B34,(LEN(B34)))),'ТАРИФЫ ТК'!J17:L268,3,0)+0.001,\"НЕТ ДОСТАВКИ\")","v":1550.001},{"$f":"IFERROR(F24+D26,\"НЕТ ДОСТАВКИ\")","v":3500.0010000000002},{"$f":"IFERROR(D26&\" + НПл\",\"НЕТ ДОСТАВКИ\")","v":"1550,001 + НПл"},{"$f":"IFERROR(CEILING((F24+D26)*(1+$D$25/100),50),0)","v":3600},null,null,null,"Неодимовый магнит 20x5x5mm `",1,330,4,330,{"$f":"N26","v":4},{"$f":"TEXT(SUM(MID(0&P26,LARGE(ISNUMBER(-MID(P26,ROW($1:$88),1))*ROW($1:$88),ROW($1:$15)+15)+1,1)*10^ROW($1:$15)/10),REPT(0,MIN(MAX(COUNT(1/(MID(P26,ROW($1:$88),1)+1))-15,),15)))&TEXT(SUM(MID(0&P26,LARGE(ISNUMBER(-MID(P26,ROW($1:$88),1))*ROW($1:$88),ROW($1:$15))+1,1)*10^ROW($1:$15)/10),REPT(0,MIN(COUNT(1/(MID(P26,ROW($1:$88),1)+1)),15)))","v":"4"}]
[null,null,{"$f":"IFERROR(\"AVIS Econom\"&\"  \"&VLOOKUP((LEFT(B34,(LEN(B34)))),'ТАРИФЫ ТК'!A4:A134,1,0),\"НЕТ ДОСТАВКИ\")","v":"AVIS Econom  Павлодар"},{"$f":"IFERROR(VLOOKUP((LEFT(B34,(LEN(B34)))),'ТАРИФЫ ТК'!A4:C134,3,0),\"НЕТ ДОСТАВКИ\")","v":1200},{"$f":"IFERROR(F24+D27,\"НЕТ ДОСТАВКИ\")","v":3150},{"$f":"IFERROR(D27&\" + НПл\",\"НЕТ ДОСТАВКИ\")","v":"1200 + НПл"},{"$f":"IFERROR(CEILING((F24+D27)*(1+$D$25/100),50),0)","v":3250},null,null,null,"Неодимовый магнит 25x10x6mm `35М",1,1100,11,1100,11,{"$f":"TEXT(SUM(MID(0&P27,LARGE(ISNUMBER(-MID(P27,ROW($1:$88),1))*ROW($1:$88),ROW($1:$15)+15)+1,1)*10^ROW($1:$15)/10),REPT(0,MIN(MAX(COUNT(1/(MID(P27,ROW($1:$88),1)+1))-15,),15)))&TEXT(SUM(MID(0&P27,LARGE(ISNUMBER(-MID(P27,ROW($1:$88),1))*ROW($1:$88),ROW($1:$15))+1,1)*10^ROW($1:$15)/10),REPT(0,MIN(COUNT(1/(MID(P27,ROW($1:$88),1)+1)),15)))","v":"11"}]
[null,null,{"$f":"IFERROR(IF(A29<1,\"AVIS EXPRESS\"&\"  \"&VLOOKUP((LEFT(B34,(LEN(B34)))),'ТАРИФЫ ТК'!E4:G20,1,0),\"AV ВИМАНИЕ:   В Е С    П О С Ы Л К И    Б О Л Ь Ш Е   0,5 КГ   !!!\"),\"НЕТ ДОСТАВКИ\")","v":"AVIS EXPRESS  Павлодар"},{"$f":"IFERROR(VLOOKUP((LEFT(B34,(LEN(B34)))),'ТАРИФЫ ТК'!E4:G20,3,0),\"НЕТ ДОСТАВКИ\")","v":1400},{"$f":"IFERROR(F24+D28,\"НЕТ ДОСТАВКИ\")","v":3350},{"$f":"D28&\" + НПл\"","v":"1400 + НПл"},{"$f":"IFERROR(CEILING((F24+D28)*(1+$D$25/100),50),\"НЕТ ДОСТАВКИ\")","v":3450},null,null,null,"Неодимовый магнит 30x5x5mm `",1,650,6,650,6,{"$f":"TEXT(SUM(MID(0&P28,LARGE(ISNUMBER(-MID(P28,ROW($1:$88),1))*ROW($1:$88),ROW($1:$15)+15)+1,1)*10^ROW($1:$15)/10),REPT(0,MIN(MAX(COUNT(1/(MID(P28,ROW($1:$88),1)+1))-15,),15)))&TEXT(SUM(MID(0&P28,LARGE(ISNUMBER(-MID(P28,ROW($1:$88),1))*ROW($1:$88),ROW($1:$15))+1,1)*10^ROW($1:$15)/10),REPT(0,MIN(COUNT(1/(MID(P28,ROW($1:$88),1)+1)),15)))","v":"6"}]
[{"$f":"IFERROR(A25*1.5,\"Количество ??\")","v":2.7709499999999998E-2},null,null,"К ОПЛАТЕ:",{"$f":"IFERROR(F24+E25,0)","v":3350},{"$f":"IF(E25=C29,\"Доставка БЕСПЛАТНО\",IF(E25=D26,E26,IF(E25=D27,E27,IF(E25=D28,E28,IF(E25=F27,G27,IF(E25=F28,G28,IF(E25=F26,G26,\"Укажите ТК\")))))))","v":3350},{"$f":"IFERROR(CEILING((F24+E25)*1.03,50),0)","v":3500},null,null,{"$f":"IFERROR(J25*1.5,\"Количество ??\")","v":0},"Общий вес:21",null,null,null,null,0,{"$f":"TEXT(SUM(MID(0&P29,LARGE(ISNUMBER(-MID(P29,ROW($1:$88),1))*ROW($1:$88),ROW($1:$15)+15)+1,1)*10^ROW($1:$15)/10),REPT(0,MIN(MAX(COUNT(1/(MID(P29,ROW($1:$88),1)+1))-15,),15)))&TEXT(SUM(MID(0&P29,LARGE(ISNUMBER(-MID(P29,ROW($1:$88),1))*ROW($1:$88),ROW($1:$15))+1,1)*10^ROW($1:$15)/10),REPT(0,MIN(COUNT(1/(MID(P29,ROW($1:$88),1)+1)),15)))","v":"0"}]
["rc11091kz",null,{"$f":"IFERROR((P14&\"        \"&LEFT(P15,8)&\" = \"&TEXT(R15,\"### ### ###\")&\" т.\"),\"НЕТ ДОСТАВКИ\")","v":"        0 =  т."},null,{"$f":"IFERROR(\"QIWI = \"&CEILING((E26*1.02),10),0)","v":"QIWI = 3580"},{"$f":"IFERROR(F29-F24,\"УКАЖИТЕ ТК\")","v":1400},null,null,null,null,"Итого:2100",null,null,null,null,0,{"$f":"TEXT(SUM(MID(0&P30,LARGE(ISNUMBER(-MID(P30,ROW($1:$88),1))*ROW($1:$88),ROW($1:$15)+15)+1,1)*10^ROW($1:$15)/10),REPT(0,MIN(MAX(COUNT(1/(MID(P30,ROW($1:$88),1)+1))-15,),15)))&TEXT(SUM(MID(0&P30,LARGE(ISNUMBER(-MID(P30,ROW($1:$88),1))*ROW($1:$88),ROW($1:$15))+1,1)*10^ROW($1:$15)/10),REPT(0,MIN(COUNT(1/(MID(P30,ROW($1:$88),1)+1)),15)))","v":"0"}]
[{"$f":"A1","v":"+KASPI+ 9651++0"},"ПОЛУЧАТЕЛЬ:","rc11091kz",null,null,null,null,null,null,null,null,null,null,null,null,0,{"$f":"TEXT(SUM(MID(0&P31,LARGE(ISNUMBER(-MID(P31,ROW($1:$88),1))*ROW($1:$88),ROW($1:$15)+15)+1,1)*10^ROW($1:$15)/10),REPT(0,MIN(MAX(COUNT(1/(MID(P31,ROW($1:$88),1)+1))-15,),15)))&TEXT(SUM(MID(0&P31,LARGE(ISNUMBER(-MID(P31,ROW($1:$88),1))*ROW($1:$88),ROW($1:$15))+1,1)*10^ROW($1:$15)/10),REPT(0,MIN(COUNT(1/(MID(P31,ROW($1:$88),1)+1)),15)))","v":"0"}]
[{"$f":"UPPER((B3))","v":"САВОРОВСКИЙ ДМИТРИЙ"},null,{"$f":"IFERROR(MID(НайтиСтрокуПоСлову(\"Комментарий: Имя :\",K1:K45),20,99),0)","v":0},null,null,null,null,null,null,null,null,null,null,null,null,0,{"$f":"TEXT(SUM(MID(0&P32,LARGE(ISNUMBER(-MID(P32,ROW($1:$88),1))*ROW($1:$88),ROW($1:$15)+15)+1,1)*10^ROW($1:$15)/10),REPT(0,MIN(MAX(COUNT(1/(MID(P32,ROW($1:$88),1)+1))-15,),15)))&TEXT(SUM(MID(0&P32,LARGE(ISNUMBER(-MID(P32,ROW($1:$88),1))*ROW($1:$88),ROW($1:$15))+1,1)*10^ROW($1:$15)/10),REPT(0,MIN(COUNT(1/(MID(P32,ROW($1:$88),1)+1)),15)))","v":"0"}]
["Область: ",{"$f":"UPPER((P18))","v":""},{"$f":"IFERROR(ПоискСНачала(C32,\"Телефон\"),0)","v":0},null,{"$f":"IFERROR(ПоискМежду(C32,\"Телефон :\",\"Примечание\"),0)","v":0},{"$f":"IFERROR(IF(LEFT(ПоискСКонца(C32,\"Примечание : \"),2)=\"г \",MID(ПоискСКонца(C32,\"Примечание : \"),3,99),IF(LEFT(ПоискСКонца(C32,\"Примечание : \"),3)=\"г. \",MID(ПоискСКонца(C32,\"Примечание : \"),4,99),IF(LEFT(ПоискСКонца(C32,\"Примечание : \"),3)=\"гор\",MID(ПоискСКонца(C32,\"Примечание : \"),6,99),0))),0)","v":0},null,null,null,null,null,null,null,null,null,0,{"$f":"TEXT(SUM(MID(0&P33,LARGE(ISNUMBER(-MID(P33,ROW($1:$88),1))*ROW($1:$88),ROW($1:$15)+15)+1,1)*10^ROW($1:$15)/10),REPT(0,MIN(MAX(COUNT(1/(MID(P33,ROW($1:$88),1)+1))-15,),15)))&TEXT(SUM(MID(0&P33,LARGE(ISNUMBER(-MID(P33,ROW($1:$88),1))*ROW($1:$88),ROW($1:$15))+1,1)*10^ROW($1:$15)/10),REPT(0,MIN(COUNT(1/(MID(P33,ROW($1:$88),1)+1)),15)))","v":"0"}]
["Город: ",{"$f":"UPPER((P19))","v":"ПАВЛОДАР"},null,null,null,null,null,null,null,null,"Назад",null,null,null,null,0,{"$f":"TEXT(SUM(MID(0&P34,LARGE(ISNUMBER(-MID(P34,ROW($1:$88),1))*ROW($1:$88),ROW($1:$15)+15)+1,1)*10^ROW($1:$15)/10),REPT(0,MIN(MAX(COUNT(1/(MID(P34,ROW($1:$88),1)+1))-15,),15)))&TEXT(SUM(MID(0&P34,LARGE(ISNUMBER(-MID(P34,ROW($1:$88),1))*ROW($1:$88),ROW($1:$15))+1,1)*10^ROW($1:$15)/10),REPT(0,MIN(COUNT(1/(MID(P34,ROW($1:$88),1)+1)),15)))","v":"0"}]
["Улица: ",{"$f":"UPPER((P20))","v":"КИРОВА"},null,null,null,null,null,null,null,null,null,null,null,null,null,0,{"$f":"TEXT(SUM(MID(0&P35,LARGE(ISNUMBER(-MID(P35,ROW($1:$88),1))*ROW($1:$88),ROW($1:$15)+15)+1,1)*10^ROW($1:$15)/10),REPT(0,MIN(MAX(COUNT(1/(MID(P35,ROW($1:$88),1)+1))-15,),15)))&TEXT(SUM(MID(0&P35,LARGE(ISNUMBER(-MID(P35,ROW($1:$88),1))*ROW($1:$88),ROW($1:$15))+1,1)*10^ROW($1:$15)/10),REPT(0,MIN(COUNT(1/(MID(P35,ROW($1:$88),1)+1)),15)))","v":"0"}]
["Здание: ",{"$f":"P21","v":"38"},null,null,null,null,null,null,null,null,null,null,null,null,null,0,{"$f":"TEXT(SUM(MID(0&P36,LARGE(ISNUMBER(-MID(P36,ROW($1:$88),1))*ROW($1:$88),ROW($1:$15)+15)+1,1)*10^ROW($1:$15)/10),REPT(0,MIN(MAX(COUNT(1/(MID(P36,ROW($1:$88),1)+1))-15,),15)))&TEXT(SUM(MID(0&P36,LARGE(ISNUMBER(-MID(P36,ROW($1:$88),1))*ROW($1:$88),ROW($1:$15))+1,1)*10^ROW($1:$15)/10),REPT(0,MIN(COUNT(1/(MID(P36,ROW($1:$88),1)+1)),15)))","v":"0"}]
["Квартира: ",{"$f":"P22","v":"13"},null,null,null,null,null,null,null,null,null,null,null,null,null,0,{"$f":"TEXT(SUM(MID(0&P37,LARGE(ISNUMBER(-MID(P37,ROW($1:$88),1))*ROW($1:$88),ROW($1:$15)+15)+1,1)*10^ROW($1:$15)/10),REPT(0,MIN(MAX(COUNT(1/(MID(P37,ROW($1:$88),1)+1))-15,),15)))&TEXT(SUM(MID(0&P37,LARGE(ISNUMBER(-MID(P37,ROW($1:$88),1))*ROW($1:$88),ROW($1:$15))+1,1)*10^ROW($1:$15)/10),REPT(0,MIN(COUNT(1/(MID(P37,ROW($1:$88),1)+1)),15)))","v":"0"}]
["Телефон: ",{"$f":"B4","v":"7-778-500-02-25   0----   ----"},null,null,null,null,null,null,null,null,null,null,null,null,null,0,{"$f":"TEXT(SUM(MID(0&P38,LARGE(ISNUMBER(-MID(P38,ROW($1:$88),1))*ROW($1:$88),ROW($1:$15)+15)+1,1)*10^ROW($1:$15)/10),REPT(0,MIN(MAX(COUNT(1/(MID(P38,ROW($1:$88),1)+1))-15,),15)))&TEXT(SUM(MID(0&P38,LARGE(ISNUMBER(-MID(P38,ROW($1:$88),1))*ROW($1:$88),ROW($1:$15))+1,1)*10^ROW($1:$15)/10),REPT(0,MIN(COUNT(1/(MID(P38,ROW($1:$88),1)+1)),15)))","v":"0"}]
["Индекс: ",{"$f":"P16","v":""},null,null,null,null,null,null,null,null,null,null,null,null,null,null,{"$f":"IF(LEFT(#REF!,4)=\"ваша\",VALUE(MID(#REF!,13,20))*100,0)","v":{"$error":"#REF!"}}]
["Компания:",null,null,null,null,null,null,null,null,null,null,null,null,null,null,null,{"$f":"IF(LEFT(#REF!,4)=\"ваша\",VALUE(MID(#REF!,13,20))*100,0)","v":{"$error":"#REF!"}}]
["ИИН:",{"$f":"F29","v":3350},null,null,null,null,null,null,null,null,null,null,null,null,null,null,{"$f":"IF(LEFT(#REF!,4)=\"ваша\",VALUE(MID(#REF!,13,20))*100,0)","v":{"$error":"#REF!"}}]
["------------------------","----------------------------------------------------","----------------------------------------------------","------------------------","------------------------","---------------------------","------------------------------","------------------------","------------------------",null,null,null,null,null,null,null,{"$f":"SUM(Q19:Q41)","v":{"$error":"#REF!"}}]

{"sheet":"Лист10","index":20,"n_rows":42,"n_cols":21,"rows_kept":42,"cut":false,"hidden":false,"merged":[[27,6,27,8],[31,0,31,1],[37,1,37,2],[0,4,0,7],[1,4,1,8],[2,1,2,2],[3,1,3,2],[25,6,25,8],[26,6,26,8]]}
[{"$f":"IF(LEFT(C29,2)=\"сп\",P1&\" ► СП\",IF(E25=D26,P1,IF(H6<>0,P1&\"++\"&\"0\",IF(E25=D27,P1&\"++\"&\"0\",IF(E25=D28,P1&\"++\"&\"0\",IF(E25=D27,P1&\"++\"&\"0\",IF(E25=D28,P1&\"++\"&\"0\",IF(LEFT(C25,2)=\"AV\",P1&\"++\"&F29,P1))))))))","v":" +"},{"$f":"L4","v":"дата заказа"},{"$f":"IF(E2>0,\"ОТПРАВЛЕНО\",IF(LEFT(C29,3)=\"ЗАК\",\"ЗАКАЗАНО в СПБ\",IF(G24>=0,\"ОПЛОЧЕНО\",\"ОЖИДАНИЕ ОПЛАТЫ\")))","v":"ОПЛОЧЕНО"},{"$f":"'СПИСОК ЗАКАЗОВ'!B1","v":21},null,null,null,null,{"$f":"A1","v":" +"},null,"Заказ № +",null,null,null,null,{"$f":"IF(G24>0,\"+\"&H6&\"+\"&Q1,Q1)","v":" +"},{"$f":"ПоискСКонца(K1,\"№\")","v":" +"}]
["Логин",{"$f":"L3","v":"Логин"},"Номер накл-ой",null,null,null,null,null,null,null,"Примечание"]
["ФИО",{"$f":"IF(C32=0,UPPER((P9)),UPPER(C33))","v":"ФИО"},null,null,null,null,null,null,null,null,"Логин","Логин"]
["Телефон",{"$f":"R12","v":"0----   ----   ----"},null,null,{"$f":"IF(F4>0.5,\"оплачено\",IF(F4<0,\"ОПЛАТИТЬ= \"&G4,\"ОПЛАТИТЬ= \"&Q25))","v":"ОПЛАТИТЬ= 0"},0,1100,null,null,null,"Дата заказа","дата заказа"]
["e-mail:",{"$f":"L11","v":"мыло"}]
["Вес","ПРИМЕЧАНИЯ","Наименование","Кол-во","Цена","Всего",{"$f":"IF(MAX(G7:G25)>0,MAX(G7:G25),\"\")","v":""},{"$f":"IF(I7>0,\"НАЛ\",IF(I8>0,\"ПЕРЕВОД\",IF(I9>0,\"Beeline\",IF(I10>0,\"KASPI\",IF(I11>0,\"QIWI\",IF(I12>0,\"СЧЁТ Альфа-Банк\",0))))))","v":0},{"$f":"SUM(I7:I28)","v":0}]
[{"$f":"IF(L24>0,Q24*1/100,\"\")","v":""},null,{"$f":"IF(L26<>\"\",K26,\"\")","v":""},{"$f":"IF(L26>0,L26,\"\")","v":""},{"$f":"IF(M26=\"уточняйте\",0,IF(L26>0,M26,\"\"))","v":""},{"$f":"IF(D7<>\"\",E7*D7,\"\")","v":""},{"$f":"IF(I7 >0,TODAY(),\"\")","v":""},"НАЛ",null,{"$f":"IFERROR(IFERROR(VLOOKUP(C7,#REF!,3,0)*D7,VLOOKUP(C7,#REF!,7,0)*D7),\"нет веса\")","v":"нет веса"},"Заказ №2080"]
[{"$f":"IF(L25>0,Q25*1/100,\"\")","v":""},null,{"$f":"IF(L27<>\"\",K27,\"\")","v":""},{"$f":"IF(L27>0,L27,\"\")","v":""},{"$f":"IF(M27=\"уточняйте\",0,IF(L27>0,M27,\"\"))","v":""},"","","ПЕРЕВОД",null,{"$f":"IFERROR(IFERROR(VLOOKUP(C8,#REF!,3,0)*D8,VLOOKUP(C8,#REF!,7,0)*D8),\"нет веса\")","v":"нет веса"}]
[{"$f":"IF(L26>0,Q26*1/100,\"\")","v":""},null,"","","","","","Beeline",null,{"$f":"IFERROR(IFERROR(VLOOKUP(C9,#REF!,3,0)*D9,VLOOKUP(C9,#REF!,7,0)*D9),\"нет веса\")","v":"нет веса"},"Здравствуйте, ФИО",null,null,null,null,{"$f":"MID(K9,15,70)","v":"ФИО"},{"$f":"TEXT(SUM(MID(0&L9,LARGE(ISNUMBER(-MID(L9,ROW($1:$96),1))*ROW($1:$96),ROW($1:$23)+15)+1,1)*10^ROW($1:$23)/10),REPT(0,MIN(MAX(COUNT(1/(MID(L9,ROW($1:$96),1)+1))-15,),15)))&TEXT(SUM(MID(0&L9,LARGE(ISNUMBER(-MID(L9,ROW($1:$96),1))*ROW($1:$96),ROW($1:$23))+1,1)*10^ROW($1:$23)/10),REPT(0,MIN(COUNT(1/(MID(L9,ROW($1:$96),1)+1)),15)))","v":""}]
["",null,"","","","","","KASPI",null,{"$f":"IFERROR(IFERROR(VLOOKUP(C10,#REF!,3,0)*D10,VLOOKUP(C10,#REF!,7,0)*D10),\"нет веса\")","v":"нет веса"},"Мы получили Ваш заказ номер, 2080"]
["",null,"","","","","","QIWI",null,{"$f":"IFERROR(IFERROR(VLOOKUP(C11,#REF!,3,0)*D11,VLOOKUP(C11,#REF!,7,0)*D11),\"нет веса\")","v":"нет веса"},"Электронная почта","мыло"]
["",null,"","","","","","СЧЁТ Альфа-Банк",null,{"$f":"IFERROR(IFERROR(VLOOKUP(C12,#REF!,3,0)*D12,VLOOKUP(C12,#REF!,7,0)*D12),\"нет веса\")","v":"нет веса"},"Контактный телефон",null,null,null,null,{"$f":"(L12&\"  \"&P13)","v":"  0"},{"$f":"TEXT(SUM(MID(0&P12,LARGE(ISNUMBER(-MID(P12,ROW($1:$99),1))*ROW($1:$99),ROW($1:$15)+30)+1,1)*10^ROW($1:$15)/10),REPT(0,MIN(MAX(COUNT(1/(MID(P12,ROW($1:$99),1)+1))-30,),15)))&TEXT(SUM(MID(0&P12,LARGE(ISNUMBER(-MID(P12,ROW($1:$99),1))*ROW($1:$99),ROW($1:$15)+15)+1,1)*10^ROW($1:$15)/10),REPT(0,MIN(MAX(COUNT(1/(MID(P12,ROW($1:$99),1)+1))-15,),15)))&TEXT(SUM(MID(0&P12,LARGE(ISNUMBER(-MID(P12,ROW($1:$99),1))*ROW($1:$99),ROW($1:$15))+1,1)*10^ROW($1:$15)/10),REPT(0,MIN(COUNT(1/(MID(P12,ROW($1:$99),1)+1)),15)))","v":"0"},{"$f":"(MID(Q12,1,1))&\"-\"&(MID(Q12,2,3))&\"-\"&(MID(Q12,5,3))&\"-\"&(MID(Q12,8,2))&\"-\"&(MID(Q12,10,2))&\"   \"&(MID(Q12,12,1))&\"-\"&(MID(Q12,13,3))&\"-\"&(MID(Q12,16,3))&\"-\"&(MID(Q12,19,2))&\"-\"&(MID(Q12,21,2))&\"   \"&(MID(Q12,23,1))&\"-\"&(MID(Q12,24,3))&\"-\"&(MID(Q12,27,3))&\"-\"&(MID(Q12,30,2))&\"-\"&(MID(Q12,32,2))","v":"0----   ----   ----"}]
["",null,"","","","","",null,null,{"$f":"IFERROR(IFERROR(VLOOKUP(C13,#REF!,3,0)*D13,VLOOKUP(C13,#REF!,7,0)*D13),\"нет веса\")","v":"нет веса"},null,null,null,null,null,{"$f":"IF(L13=\"-\",IFERROR(НайтиСтрокуПоСлову(\"Комментарий\",K27:K60),0),L13)","v":0}]
["",null,"","","","","",null,null,{"$f":"IFERROR(IFERROR(VLOOKUP(C14,#REF!,3,0)*D14,VLOOKUP(C14,#REF!,7,0)*D14),\"нет веса\")","v":"нет веса"},"Доставка:",null,null,null,null,{"$f":"MID(L14,23,70)","v":""}]
["",null,"","","","","",null,null,{"$f":"IFERROR(IFERROR(VLOOKUP(C15,#REF!,3,0)*D15,VLOOKUP(C15,#REF!,7,0)*D15),\"нет веса\")","v":"нет веса"},"Оплата:",null,null,null,null,{"$f":"IF(LEFT(P14,2)=\"EX\",MID(L15,11,70),L15)","v":0},{"$f":"TEXT(SUM(MID(0&P15,LARGE(ISNUMBER(-MID(P15,ROW($1:$88),1))*ROW($1:$88),ROW($1:$15)+15)+1,1)*10^ROW($1:$15)/10),REPT(0,MIN(MAX(COUNT(1/(MID(P15,ROW($1:$88),1)+1))-15,),15)))&TEXT(SUM(MID(0&P15,LARGE(ISNUMBER(-MID(P15,ROW($1:$88),1))*ROW($1:$88),ROW($1:$15))+1,1)*10^ROW($1:$15)/10),REPT(0,MIN(COUNT(1/(MID(P15,ROW($1:$88),1)+1)),15)))","v":"0"},{"$f":"SUMPRODUCT(--SUBSTITUTE(Q15:Q15,CHAR(160),))","v":0},{"$f":"LEN(Q15)","v":1},{"$f":"FLOOR(S15/3,1)","v":0}]
["",null,"","","","","",null,null,{"$f":"IFERROR(IFERROR(VLOOKUP(C16,#REF!,3,0)*D16,VLOOKUP(C16,#REF!,7,0)*D16),\"нет веса\")","v":"нет веса"},"Адрес доставки","Индекс: ",null,null,null,{"$f":"MID(L16,9,70)","v":""}]
["",null,"","","","","",null,null,{"$f":"IFERROR(IFERROR(VLOOKUP(C17,#REF!,3,0)*D17,VLOOKUP(C17,#REF!,7,0)*D17),\"нет веса\")","v":"нет веса"},null,"Страна: ",null,null,null,{"$f":"MID(L17,9,70)","v":""},{"$f":"IF(LEFT(K17,4)=\"ваша\",VALUE(MID(K17,13,20))*100,0)","v":0}]
["",null,"","","","","",null,null,{"$f":"IFERROR(IFERROR(VLOOKUP(C18,#REF!,3,0)*D18,VLOOKUP(C18,#REF!,7,0)*D18),\"нет веса\")","v":"нет веса"},null,"Область: ",null,null,null,{"$f":"MID(L18,10,70)","v":""}]
["",null,"","","","","",null,null,{"$f":"IFERROR(IFERROR(VLOOKUP(C19,#REF!,3,0)*D19,VLOOKUP(C19,#REF!,7,0)*D19),\"нет веса\")","v":"нет веса"},null,"Город: ",null,null,null,{"$f":"MID(L19,8,70)","v":""},{"$f":"IF(LEFT(K19,4)=\"ваша\",VALUE(MID(K19,13,20))*100,0)","v":0}]
["",null,"","","","","",null,null,{"$f":"IFERROR(IFERROR(VLOOKUP(C20,#REF!,3,0)*D20,VLOOKUP(C20,#REF!,7,0)*D20),\"нет веса\")","v":"нет веса"},null,"Улица: ",null,null,null,{"$f":"MID(L20,8,70)","v":""},{"$f":"IF(LEFT(K31,4)=\"ваша\",VALUE(MID(K31,13,20))*100,0)","v":0}]
["",null,"","","","","",null,null,{"$f":"IFERROR(IFERROR(VLOOKUP(C21,#REF!,3,0)*D21,VLOOKUP(C21,#REF!,7,0)*D21),\"нет веса\")","v":"нет веса"},null,"Здание: ",null,null,null,{"$f":"MID(L21,9,70)","v":""},{"$f":"IF(LEFT(K32,4)=\"ваша\",VALUE(MID(K32,13,20))*100,0)","v":0}]
["",null,"","","","","",null,null,{"$f":"IFERROR(IFERROR(VLOOKUP(C22,#REF!,3,0)*D22,VLOOKUP(C22,#REF!,7,0)*D22),\"нет веса\")","v":"нет веса"},null,"Квартира: ",null,null,null,{"$f":"MID(L22,11,70)","v":""},{"$f":"IF(LEFT(#REF!,4)=\"ваша\",VALUE(MID(#REF!,13,20))*100,0)","v":{"$error":"#REF!"}}]
["",null,null,null,"Итого:",{"$f":"SUM(F7:F22)","v":0},"",null,null,{"$f":"IF(K40>0,M40,\"\")","v":""},"Наименование","Количество","Цена","Вес","Всего",null,{"$f":"IF(LEFT(K33,4)=\"ваша\",VALUE(MID(K33,13,20))*100,0)","v":0}]
[{"$f":"IF(L41>0,N41,\"\")","v":""},null,null,"скидка:",{"$f":"IF(F23>150000,10,IF(F23>100000,8,IF(F23>60000,5,IF(F23>30000,3,0))))","v":0},{"$f":"F23-(F23*E24/100)","v":0},{"$f":"IFERROR(SUM(I7:I22)-F29+1,0)","v":0},null,null,null,null,null,null,null,null,{"$f":"N24","v":0},{"$f":"TEXT(SUM(MID(0&P24,LARGE(ISNUMBER(-MID(P24,ROW($1:$88),1))*ROW($1:$88),ROW($1:$15)+15)+1,1)*10^ROW($1:$15)/10),REPT(0,MIN(MAX(COUNT(1/(MID(P24,ROW($1:$88),1)+1))-15,),15)))&TEXT(SUM(MID(0&P24,LARGE(ISNUMBER(-MID(P24,ROW($1:$88),1))*ROW($1:$88),ROW($1:$15))+1,1)*10^ROW($1:$15)/10),REPT(0,MIN(COUNT(1/(MID(P24,ROW($1:$88),1)+1)),15)))","v":"0"}]
[{"$f":"SUM(A7:A23)/1000*1.3","v":0},null,{"$f":"IF(E25=F26,\"Доставка БЕСПЛАТНО\",IF(E25=D26,C26,IF(E25=D27,C27,IF(E25=D28,C28,IF(E25=F27,C27&\" + НПл\",IF(E25=F28,C28&\" + НПл\",\"Укажите ТК\"))))))","v":"Укажите ТК"},2,null,null,{"$f":"IF(I25 >0,TODAY(),\"\")","v":""},null,null,{"$f":"SUM(J7:J22)/1000","v":0},null,null,null,null,null,{"$f":"E25","v":0},{"$f":"TEXT(SUM(MID(0&P25,LARGE(ISNUMBER(-MID(P25,ROW($1:$88),1))*ROW($1:$88),ROW($1:$15)+15)+1,1)*10^ROW($1:$15)/10),REPT(0,MIN(MAX(COUNT(1/(MID(P25,ROW($1:$88),1)+1))-15,),15)))&TEXT(SUM(MID(0&P25,LARGE(ISNUMBER(-MID(P25,ROW($1:$88),1))*ROW($1:$88),ROW($1:$15))+1,1)*10^ROW($1:$15)/10),REPT(0,MIN(COUNT(1/(MID(P25,ROW($1:$88),1)+1)),15)))","v":"0"},{"$f":"E25","v":0},{"$f":"TEXT(SUM(MID(0&R25,LARGE(ISNUMBER(-MID(R25,ROW($1:$88),1))*ROW($1:$88),ROW($1:$15)+15)+1,1)*10^ROW($1:$15)/10),REPT(0,MIN(MAX(COUNT(1/(MID(R25,ROW($1:$88),1)+1))-15,),15)))&TEXT(SUM(MID(0&R25,LARGE(ISNUMBER(-MID(R25,ROW($1:$88),1))*ROW($1:$88),ROW($1:$15))+1,1)*10^ROW($1:$15)/10),REPT(0,MIN(COUNT(1/(MID(R25,ROW($1:$88),1)+1)),15)))","v":"0"},null,{"$f":"TEXT(SUM(MID(0&E25,LARGE(ISNUMBER(-MID(E25,ROW($1:$88),1))*ROW($1:$88),ROW($1:$15)+15)+1,1)*10^ROW($1:$15)/10),REPT(0,MIN(MAX(COUNT(1/(MID(E25,ROW($1:$88),1)+1))-15,),15)))&TEXT(SUM(MID(0&E25,LARGE(ISNUMBER(-MID(E25,ROW($1:$88),1))*ROW($1:$88),ROW($1:$15))+1,1)*10^ROW($1:$15)/10),REPT(0,MIN(COUNT(1/(MID(E25,ROW($1:$88),1)+1)),15)))","v":{"$error":"#NUM!"}}]
[null,null,{"$f":"IFERROR(\"AVIS С А М О В Ы В О З \"&\"  \"&VLOOKUP((LEFT(B34,(LEN(B34)))),'ТАРИФЫ ТК'!J17:L268,1,0),\"НЕТ ДОСТАВКИ\")","v":"НЕТ ДОСТАВКИ"},{"$f":"IFERROR(VLOOKUP((LEFT(B34,(LEN(B34)))),'ТАРИФЫ ТК'!J17:L268,3,0)+0.001,\"НЕТ ДОСТАВКИ\")","v":"НЕТ ДОСТАВКИ"},{"$f":"IFERROR(F24+D26,\"НЕТ ДОСТАВКИ\")","v":"НЕТ ДОСТАВКИ"},{"$f":"IFERROR(D26&\" + НПл\",\"НЕТ ДОСТАВКИ\")","v":"НЕТ ДОСТАВКИ + НПл"},{"$f":"IFERROR(CEILING((F24+D26)*(1+$D$25/100),50),0)","v":0},null,null,null,null,null,null,null,null,{"$f":"N26","v":0},{"$f":"TEXT(SUM(MID(0&P26,LARGE(ISNUMBER(-MID(P26,ROW($1:$88),1))*ROW($1:$88),ROW($1:$15)+15)+1,1)*10^ROW($1:$15)/10),REPT(0,MIN(MAX(COUNT(1/(MID(P26,ROW($1:$88),1)+1))-15,),15)))&TEXT(SUM(MID(0&P26,LARGE(ISNUMBER(-MID(P26,ROW($1:$88),1))*ROW($1:$88),ROW($1:$15))+1,1)*10^ROW($1:$15)/10),REPT(0,MIN(COUNT(1/(MID(P26,ROW($1:$88),1)+1)),15)))","v":"0"}]
[null,null,{"$f":"IFERROR(\"AVIS Econom\"&\"  \"&VLOOKUP((LEFT(B34,(LEN(B34)))),'ТАРИФЫ ТК'!A4:A134,1,0),\"НЕТ ДОСТАВКИ\")","v":"НЕТ ДОСТАВКИ"},{"$f":"IFERROR(VLOOKUP((LEFT(B34,(LEN(B34)))),'ТАРИФЫ ТК'!A4:C134,3,0),\"НЕТ ДОСТАВКИ\")","v":"НЕТ ДОСТАВКИ"},{"$f":"IFERROR(F24+D27,\"НЕТ ДОСТАВКИ\")","v":"НЕТ ДОСТАВКИ"},{"$f":"IFERROR(D27&\" + НПл\",\"НЕТ ДОСТАВКИ\")","v":"НЕТ ДОСТАВКИ + НПл"},{"$f":"IFERROR(CEILING((F24+D27)*(1+$D$25/100),50),0)","v":0},null,null,null,null,null,null,null,null,0,{"$f":"TEXT(SUM(MID(0&P27,LARGE(ISNUMBER(-MID(P27,ROW($1:$88),1))*ROW($1:$88),ROW($1:$15)+15)+1,1)*10^ROW($1:$15)/10),REPT(0,MIN(MAX(COUNT(1/(MID(P27,ROW($1:$88),1)+1))-15,),15)))&TEXT(SUM(MID(0&P27,LARGE(ISNUMBER(-MID(P27,ROW($1:$88),1))*ROW($1:$88),ROW($1:$15))+1,1)*10^ROW($1:$15)/10),REPT(0,MIN(COUNT(1/(MID(P27,ROW($1:$88),1)+1)),15)))","v":"0"}]
[null,null,{"$f":"IFERROR(IF(A29<1,\"AVIS EXPRESS\"&\"  \"&VLOOKUP((LEFT(B34,(LEN(B34)))),'ТАРИФЫ ТК'!E4:G20,1,0),\"AV ВИМАНИЕ:   В Е С    П О С Ы Л К И    Б О Л Ь Ш Е   0,5 КГ   !!!\"),\"НЕТ ДОСТАВКИ\")","v":"НЕТ ДОСТАВКИ"},{"$f":"IFERROR(VLOOKUP((LEFT(B34,(LEN(B34)))),'ТАРИФЫ ТК'!E4:G20,3,0),\"НЕТ ДОСТАВКИ\")","v":"НЕТ ДОСТАВКИ"},{"$f":"IFERROR(F24+D28,\"НЕТ ДОСТАВКИ\")","v":"НЕТ ДОСТАВКИ"},{"$f":"D28&\" + НПл\"","v":"НЕТ ДОСТАВКИ + НПл"},{"$f":"IFERROR(CEILING((F24+D28)*(1+$D$25/100),50),\"НЕТ ДОСТАВКИ\")","v":"НЕТ ДОСТАВКИ"},null,null,null,null,null,null,null,null,0,{"$f":"TEXT(SUM(MID(0&P28,LARGE(ISNUMBER(-MID(P28,ROW($1:$88),1))*ROW($1:$88),ROW($1:$15)+15)+1,1)*10^ROW($1:$15)/10),REPT(0,MIN(MAX(COUNT(1/(MID(P28,ROW($1:$88),1)+1))-15,),15)))&TEXT(SUM(MID(0&P28,LARGE(ISNUMBER(-MID(P28,ROW($1:$88),1))*ROW($1:$88),ROW($1:$15))+1,1)*10^ROW($1:$15)/10),REPT(0,MIN(COUNT(1/(MID(P28,ROW($1:$88),1)+1)),15)))","v":"0"}]
[{"$f":"IFERROR(A25*1.5,\"Количество ??\")","v":0},null,null,"К ОПЛАТЕ:",{"$f":"IFERROR(F24+E25,0)","v":0},{"$f":"IF(E25=C29,\"Доставка БЕСПЛАТНО\",IF(E25=D26,E26,IF(E25=D27,E27,IF(E25=D28,E28,IF(E25=F27,G27,IF(E25=F28,G28,IF(E25=F26,G26,\"Укажите ТК\")))))))","v":"Доставка БЕСПЛАТНО"},{"$f":"IFERROR(CEILING((F24+E25)*1.03,50),0)","v":0},null,null,{"$f":"IFERROR(J25*1.5,\"Количество ??\")","v":0},null,null,null,null,null,0,{"$f":"TEXT(SUM(MID(0&P29,LARGE(ISNUMBER(-MID(P29,ROW($1:$88),1))*ROW($1:$88),ROW($1:$15)+15)+1,1)*10^ROW($1:$15)/10),REPT(0,MIN(MAX(COUNT(1/(MID(P29,ROW($1:$88),1)+1))-15,),15)))&TEXT(SUM(MID(0&P29,LARGE(ISNUMBER(-MID(P29,ROW($1:$88),1))*ROW($1:$88),ROW($1:$15))+1,1)*10^ROW($1:$15)/10),REPT(0,MIN(COUNT(1/(MID(P29,ROW($1:$88),1)+1)),15)))","v":"0"}]
["rc11091kz",null,{"$f":"IFERROR((P14&\"        \"&LEFT(P15,8)&\" = \"&TEXT(R15,\"### ### ###\")&\" т.\"),\"НЕТ ДОСТАВКИ\")","v":"        0 =  т."},null,{"$f":"IFERROR(\"QIWI = \"&CEILING((E26*1.02),10),0)","v":0},{"$f":"IFERROR(F29-F24,\"УКАЖИТЕ ТК\")","v":"УКАЖИТЕ ТК"},null,null,null,null,null,null,null,null,null,0,{"$f":"TEXT(SUM(MID(0&P30,LARGE(ISNUMBER(-MID(P30,ROW($1:$88),1))*ROW($1:$88),ROW($1:$15)+15)+1,1)*10^ROW($1:$15)/10),REPT(0,MIN(MAX(COUNT(1/(MID(P30,ROW($1:$88),1)+1))-15,),15)))&TEXT(SUM(MID(0&P30,LARGE(ISNUMBER(-MID(P30,ROW($1:$88),1))*ROW($1:$88),ROW($1:$15))+1,1)*10^ROW($1:$15)/10),REPT(0,MIN(COUNT(1/(MID(P30,ROW($1:$88),1)+1)),15)))","v":"0"}]
[{"$f":"A1","v":" +"},"ПОЛУЧАТЕЛЬ:","rc11091kz",null,null,null,null,null,null,null,null,null,null,null,null,0,{"$f":"TEXT(SUM(MID(0&P31,LARGE(ISNUMBER(-MID(P31,ROW($1:$88),1))*ROW($1:$88),ROW($1:$15)+15)+1,1)*10^ROW($1:$15)/10),REPT(0,MIN(MAX(COUNT(1/(MID(P31,ROW($1:$88),1)+1))-15,),15)))&TEXT(SUM(MID(0&P31,LARGE(ISNUMBER(-MID(P31,ROW($1:$88),1))*ROW($1:$88),ROW($1:$15))+1,1)*10^ROW($1:$15)/10),REPT(0,MIN(COUNT(1/(MID(P31,ROW($1:$88),1)+1)),15)))","v":"0"}]
[{"$f":"UPPER((B3))","v":"ФИО"},null,{"$f":"IFERROR(MID(НайтиСтрокуПоСлову(\"Комментарий: Имя :\",K1:K45),20,99),0)","v":0},null,null,null,null,null,null,null,null,null,null,null,null,0,{"$f":"TEXT(SUM(MID(0&P32,LARGE(ISNUMBER(-MID(P32,ROW($1:$88),1))*ROW($1:$88),ROW($1:$15)+15)+1,1)*10^ROW($1:$15)/10),REPT(0,MIN(MAX(COUNT(1/(MID(P32,ROW($1:$88),1)+1))-15,),15)))&TEXT(SUM(MID(0&P32,LARGE(ISNUMBER(-MID(P32,ROW($1:$88),1))*ROW($1:$88),ROW($1:$15))+1,1)*10^ROW($1:$15)/10),REPT(0,MIN(COUNT(1/(MID(P32,ROW($1:$88),1)+1)),15)))","v":"0"}]
["Область: ",{"$f":"UPPER((P18))","v":""},{"$f":"IFERROR(ПоискСНачала(C32,\"Телефон\"),0)","v":0},null,{"$f":"IFERROR(ПоискМежду(C32,\"Телефон :\",\"Примечание\"),0)","v":0},{"$f":"IFERROR(IF(LEFT(ПоискСКонца(C32,\"Примечание : \"),2)=\"г \",MID(ПоискСКонца(C32,\"Примечание : \"),3,99),IF(LEFT(ПоискСКонца(C32,\"Примечание : \"),3)=\"г. \",MID(ПоискСКонца(C32,\"Примечание : \"),4,99),IF(LEFT(ПоискСКонца(C32,\"Примечание : \"),3)=\"гор\",MID(ПоискСКонца(C32,\"Примечание : \"),6,99),0))),0)","v":0},null,null,null,null,null,null,null,null,null,0,{"$f":"TEXT(SUM(MID(0&P33,LARGE(ISNUMBER(-MID(P33,ROW($1:$88),1))*ROW($1:$88),ROW($1:$15)+15)+1,1)*10^ROW($1:$15)/10),REPT(0,MIN(MAX(COUNT(1/(MID(P33,ROW($1:$88),1)+1))-15,),15)))&TEXT(SUM(MID(0&P33,LARGE(ISNUMBER(-MID(P33,ROW($1:$88),1))*ROW($1:$88),ROW($1:$15))+1,1)*10^ROW($1:$15)/10),REPT(0,MIN(COUNT(1/(MID(P33,ROW($1:$88),1)+1)),15)))","v":"0"}]
["Город: ",{"$f":"UPPER((P19))","v":""},null,null,null,null,null,null,null,null,null,null,null,null,null,0,{"$f":"TEXT(SUM(MID(0&P34,LARGE(ISNUMBER(-MID(P34,ROW($1:$88),1))*ROW($1:$88),ROW($1:$15)+15)+1,1)*10^ROW($1:$15)/10),REPT(0,MIN(MAX(COUNT(1/(MID(P34,ROW($1:$88),1)+1))-15,),15)))&TEXT(SUM(MID(0&P34,LARGE(ISNUMBER(-MID(P34,ROW($1:$88),1))*ROW($1:$88),ROW($1:$15))+1,1)*10^ROW($1:$15)/10),REPT(0,MIN(COUNT(1/(MID(P34,ROW($1:$88),1)+1)),15)))","v":"0"}]
["Улица: ",{"$f":"UPPER((P20))","v":""},null,null,null,null,null,null,null,null,null,null,null,null,null,0,{"$f":"TEXT(SUM(MID(0&P35,LARGE(ISNUMBER(-MID(P35,ROW($1:$88),1))*ROW($1:$88),ROW($1:$15)+15)+1,1)*10^ROW($1:$15)/10),REPT(0,MIN(MAX(COUNT(1/(MID(P35,ROW($1:$88),1)+1))-15,),15)))&TEXT(SUM(MID(0&P35,LARGE(ISNUMBER(-MID(P35,ROW($1:$88),1))*ROW($1:$88),ROW($1:$15))+1,1)*10^ROW($1:$15)/10),REPT(0,MIN(COUNT(1/(MID(P35,ROW($1:$88),1)+1)),15)))","v":"0"}]
["Здание: ",{"$f":"P21","v":""},null,null,null,null,null,null,null,null,null,null,null,null,null,0,{"$f":"TEXT(SUM(MID(0&P36,LARGE(ISNUMBER(-MID(P36,ROW($1:$88),1))*ROW($1:$88),ROW($1:$15)+15)+1,1)*10^ROW($1:$15)/10),REPT(0,MIN(MAX(COUNT(1/(MID(P36,ROW($1:$88),1)+1))-15,),15)))&TEXT(SUM(MID(0&P36,LARGE(ISNUMBER(-MID(P36,ROW($1:$88),1))*ROW($1:$88),ROW($1:$15))+1,1)*10^ROW($1:$15)/10),REPT(0,MIN(COUNT(1/(MID(P36,ROW($1:$88),1)+1)),15)))","v":"0"}]
["Квартира: ",{"$f":"P22","v":""},null,null,null,null,null,null,null,null,null,null,null,null,null,0,{"$f":"TEXT(SUM(MID(0&P37,LARGE(ISNUMBER(-MID(P37,ROW($1:$88),1))*ROW($1:$88),ROW($1:$15)+15)+1,1)*10^ROW($1:$15)/10),REPT(0,MIN(MAX(COUNT(1/(MID(P37,ROW($1:$88),1)+1))-15,),15)))&TEXT(SUM(MID(0&P37,LARGE(ISNUMBER(-MID(P37,ROW($1:$88),1))*ROW($1:$88),ROW($1:$15))+1,1)*10^ROW($1:$15)/10),REPT(0,MIN(COUNT(1/(MID(P37,ROW($1:$88),1)+1)),15)))","v":"0"}]
["Телефон: ",{"$f":"B4","v":"0----   ----   ----"},null,null,null,null,null,null,null,null,null,null,null,null,null,0,{"$f":"TEXT(SUM(MID(0&P38,LARGE(ISNUMBER(-MID(P38,ROW($1:$88),1))*ROW($1:$88),ROW($1:$15)+15)+1,1)*10^ROW($1:$15)/10),REPT(0,MIN(MAX(COUNT(1/(MID(P38,ROW($1:$88),1)+1))-15,),15)))&TEXT(SUM(MID(0&P38,LARGE(ISNUMBER(-MID(P38,ROW($1:$88),1))*ROW($1:$88),ROW($1:$15))+1,1)*10^ROW($1:$15)/10),REPT(0,MIN(COUNT(1/(MID(P38,ROW($1:$88),1)+1)),15)))","v":"0"}]
["Индекс: ",{"$f":"P16","v":""},null,null,null,null,null,null,null,null,null,null,null,null,null,null,{"$f":"IF(LEFT(#REF!,4)=\"ваша\",VALUE(MID(#REF!,13,20))*100,0)","v":{"$error":"#REF!"}}]
["Компания:",null,null,null,null,null,null,null,null,null,null,null,null,null,null,null,{"$f":"IF(LEFT(#REF!,4)=\"ваша\",VALUE(MID(#REF!,13,20))*100,0)","v":{"$error":"#REF!"}}]
["ИИН:",{"$f":"F29","v":"Доставка БЕСПЛАТНО"},null,null,null,null,null,null,null,null,null,null,null,null,null,null,{"$f":"IF(LEFT(#REF!,4)=\"ваша\",VALUE(MID(#REF!,13,20))*100,0)","v":{"$error":"#REF!"}}]
["------------------------","----------------------------------------------------","----------------------------------------------------","------------------------","------------------------","---------------------------","------------------------------","------------------------","------------------------",null,null,null,null,null,null,null,{"$f":"SUM(Q19:Q41)","v":{"$error":"#REF!"}}]

{"sheet":"Образец","index":21,"n_rows":42,"n_cols":21,"rows_kept":42,"cut":false,"hidden":false,"merged":[[31,0,31,1],[37,1,37,2],[25,6,25,8],[0,4,0,7],[1,4,1,8],[2,1,2,2],[3,1,3,2],[26,6,26,8],[27,6,27,8]]}
[{"$f":"IF(LEFT(C29,2)=\"сп\",P1&\" ► СП\",IF(E25=D26,P1,IF(H6<>0,P1&\"++\"&\"0\",IF(E25=D27,P1&\"++\"&\"0\",IF(E25=D28,P1&\"++\"&\"0\",IF(E25=D27,P1&\"++\"&\"0\",IF(E25=D28,P1&\"++\"&\"0\",IF(LEFT(C25,2)=\"AV\",P1&\"++\"&F29,P1))))))))","v":" +"},{"$f":"L4","v":"дата заказа"},{"$f":"IF(E2>0,\"ОТПРАВЛЕНО\",IF(LEFT(C29,3)=\"ЗАК\",\"ЗАКАЗАНО в СПБ\",IF(G24>=0,\"ОПЛОЧЕНО\",\"ОЖИДАНИЕ ОПЛАТЫ\")))","v":"ОПЛОЧЕНО"},{"$f":"'СПИСОК ЗАКАЗОВ'!B1","v":21},null,null,null,null,{"$f":"A1","v":" +"},null,"Заказ № +",null,null,null,null,{"$f":"IF(G24>0,\"+\"&H6&\"+\"&Q1,Q1)","v":" +"},{"$f":"ПоискСКонца(K1,\"№\")","v":" +"}]
["Логин",{"$f":"L3","v":"Логин"},"Номер накл-ой",null,null,null,null,null,null,null,"Примечание"]
["ФИО",{"$f":"IF(C32=0,UPPER((P9)),UPPER(C33))","v":"ФИО"},null,null,null,null,null,null,null,null,"Логин","Логин"]
["Телефон",{"$f":"R12","v":"0----   ----   ----"},null,null,{"$f":"IF(F4>0.5,\"оплачено\",IF(F4<0,\"ОПЛАТИТЬ= \"&G4,\"ОПЛАТИТЬ= \"&Q25))","v":"ОПЛАТИТЬ= 0"},0,1100,null,null,null,"Дата заказа","дата заказа"]
["e-mail:",{"$f":"L11","v":"мыло"}]
["Вес","ПРИМЕЧАНИЯ","Наименование","Кол-во","Цена","Всего",{"$f":"IF(MAX(G7:G25)>0,MAX(G7:G25),\"\")","v":""},{"$f":"IF(I7>0,\"НАЛ\",IF(I8>0,\"ПЕРЕВОД\",IF(I9>0,\"Beeline\",IF(I10>0,\"KASPI\",IF(I11>0,\"QIWI\",IF(I12>0,\"СЧЁТ Альфа-Банк\",0))))))","v":0},{"$f":"SUM(I7:I28)","v":0}]
[{"$f":"IF(L24>0,Q24*1/100,\"\")","v":""},null,{"$f":"IF(L26<>\"\",K26,\"\")","v":""},{"$f":"IF(L26>0,L26,\"\")","v":""},{"$f":"IF(M26=\"уточняйте\",0,IF(L26>0,M26,\"\"))","v":""},{"$f":"IF(D7<>\"\",E7*D7,\"\")","v":""},{"$f":"IF(I7 >0,TODAY(),\"\")","v":""},"НАЛ",null,{"$f":"IFERROR(IFERROR(VLOOKUP(C7,#REF!,3,0)*D7,VLOOKUP(C7,#REF!,7,0)*D7),\"нет веса\")","v":"нет веса"},"Заказ №2080"]
[{"$f":"IF(L25>0,Q25*1/100,\"\")","v":""},null,{"$f":"IF(L27<>\"\",K27,\"\")","v":""},{"$f":"IF(L27>0,L27,\"\")","v":""},{"$f":"IF(M27=\"уточняйте\",0,IF(L27>0,M27,\"\"))","v":""},"","","ПЕРЕВОД",null,{"$f":"IFERROR(IFERROR(VLOOKUP(C8,#REF!,3,0)*D8,VLOOKUP(C8,#REF!,7,0)*D8),\"нет веса\")","v":"нет веса"}]
[{"$f":"IF(L26>0,Q26*1/100,\"\")","v":""},null,"","","","","","Beeline",null,{"$f":"IFERROR(IFERROR(VLOOKUP(C9,#REF!,3,0)*D9,VLOOKUP(C9,#REF!,7,0)*D9),\"нет веса\")","v":"нет веса"},"Здравствуйте, ФИО",null,null,null,null,{"$f":"MID(K9,15,70)","v":"ФИО"},{"$f":"TEXT(SUM(MID(0&L9,LARGE(ISNUMBER(-MID(L9,ROW($1:$96),1))*ROW($1:$96),ROW($1:$23)+15)+1,1)*10^ROW($1:$23)/10),REPT(0,MIN(MAX(COUNT(1/(MID(L9,ROW($1:$96),1)+1))-15,),15)))&TEXT(SUM(MID(0&L9,LARGE(ISNUMBER(-MID(L9,ROW($1:$96),1))*ROW($1:$96),ROW($1:$23))+1,1)*10^ROW($1:$23)/10),REPT(0,MIN(COUNT(1/(MID(L9,ROW($1:$96),1)+1)),15)))","v":""}]
["",null,"","","","","","KASPI",null,{"$f":"IFERROR(IFERROR(VLOOKUP(C10,#REF!,3,0)*D10,VLOOKUP(C10,#REF!,7,0)*D10),\"нет веса\")","v":"нет веса"},"Мы получили Ваш заказ номер, 2080"]
["",null,"","","","","","QIWI",null,{"$f":"IFERROR(IFERROR(VLOOKUP(C11,#REF!,3,0)*D11,VLOOKUP(C11,#REF!,7,0)*D11),\"нет веса\")","v":"нет веса"},"Электронная почта","мыло"]
["",null,"","","","","","СЧЁТ Альфа-Банк",null,{"$f":"IFERROR(IFERROR(VLOOKUP(C12,#REF!,3,0)*D12,VLOOKUP(C12,#REF!,7,0)*D12),\"нет веса\")","v":"нет веса"},"Контактный телефон",null,null,null,null,{"$f":"(L12&\"  \"&P13)","v":"  0"},{"$f":"TEXT(SUM(MID(0&P12,LARGE(ISNUMBER(-MID(P12,ROW($1:$99),1))*ROW($1:$99),ROW($1:$15)+30)+1,1)*10^ROW($1:$15)/10),REPT(0,MIN(MAX(COUNT(1/(MID(P12,ROW($1:$99),1)+1))-30,),15)))&TEXT(SUM(MID(0&P12,LARGE(ISNUMBER(-MID(P12,ROW($1:$99),1))*ROW($1:$99),ROW($1:$15)+15)+1,1)*10^ROW($1:$15)/10),REPT(0,MIN(MAX(COUNT(1/(MID(P12,ROW($1:$99),1)+1))-15,),15)))&TEXT(SUM(MID(0&P12,LARGE(ISNUMBER(-MID(P12,ROW($1:$99),1))*ROW($1:$99),ROW($1:$15))+1,1)*10^ROW($1:$15)/10),REPT(0,MIN(COUNT(1/(MID(P12,ROW($1:$99),1)+1)),15)))","v":"0"},{"$f":"(MID(Q12,1,1))&\"-\"&(MID(Q12,2,3))&\"-\"&(MID(Q12,5,3))&\"-\"&(MID(Q12,8,2))&\"-\"&(MID(Q12,10,2))&\"   \"&(MID(Q12,12,1))&\"-\"&(MID(Q12,13,3))&\"-\"&(MID(Q12,16,3))&\"-\"&(MID(Q12,19,2))&\"-\"&(MID(Q12,21,2))&\"   \"&(MID(Q12,23,1))&\"-\"&(MID(Q12,24,3))&\"-\"&(MID(Q12,27,3))&\"-\"&(MID(Q12,30,2))&\"-\"&(MID(Q12,32,2))","v":"0----   ----   ----"}]
["",null,"","","","","",null,null,{"$f":"IFERROR(IFERROR(VLOOKUP(C13,#REF!,3,0)*D13,VLOOKUP(C13,#REF!,7,0)*D13),\"нет веса\")","v":"нет веса"},null,null,null,null,null,{"$f":"IF(L13=\"-\",IFERROR(НайтиСтрокуПоСлову(\"Комментарий\",K27:K60),0),L13)","v":0}]
["",null,"","","","","",null,null,{"$f":"IFERROR(IFERROR(VLOOKUP(C14,#REF!,3,0)*D14,VLOOKUP(C14,#REF!,7,0)*D14),\"нет веса\")","v":"нет веса"},"Доставка:",null,null,null,null,{"$f":"MID(L14,23,70)","v":""}]
["",null,"","","","","",null,null,{"$f":"IFERROR(IFERROR(VLOOKUP(C15,#REF!,3,0)*D15,VLOOKUP(C15,#REF!,7,0)*D15),\"нет веса\")","v":"нет веса"},"Оплата:",null,null,null,null,{"$f":"IF(LEFT(P14,2)=\"EX\",MID(L15,11,70),L15)","v":0},{"$f":"TEXT(SUM(MID(0&P15,LARGE(ISNUMBER(-MID(P15,ROW($1:$88),1))*ROW($1:$88),ROW($1:$15)+15)+1,1)*10^ROW($1:$15)/10),REPT(0,MIN(MAX(COUNT(1/(MID(P15,ROW($1:$88),1)+1))-15,),15)))&TEXT(SUM(MID(0&P15,LARGE(ISNUMBER(-MID(P15,ROW($1:$88),1))*ROW($1:$88),ROW($1:$15))+1,1)*10^ROW($1:$15)/10),REPT(0,MIN(COUNT(1/(MID(P15,ROW($1:$88),1)+1)),15)))","v":"0"},{"$f":"SUMPRODUCT(--SUBSTITUTE(Q15:Q15,CHAR(160),))","v":0},{"$f":"LEN(Q15)","v":1},{"$f":"FLOOR(S15/3,1)","v":0}]
["",null,"","","","","",null,null,{"$f":"IFERROR(IFERROR(VLOOKUP(C16,#REF!,3,0)*D16,VLOOKUP(C16,#REF!,7,0)*D16),\"нет веса\")","v":"нет веса"},"Адрес доставки","Индекс: ",null,null,null,{"$f":"MID(L16,9,70)","v":""}]
["",null,"","","","","",null,null,{"$f":"IFERROR(IFERROR(VLOOKUP(C17,#REF!,3,0)*D17,VLOOKUP(C17,#REF!,7,0)*D17),\"нет веса\")","v":"нет веса"},null,"Страна: ",null,null,null,{"$f":"MID(L17,9,70)","v":""},{"$f":"IF(LEFT(K17,4)=\"ваша\",VALUE(MID(K17,13,20))*100,0)","v":0}]
["",null,"","","","","",null,null,{"$f":"IFERROR(IFERROR(VLOOKUP(C18,#REF!,3,0)*D18,VLOOKUP(C18,#REF!,7,0)*D18),\"нет веса\")","v":"нет веса"},null,"Область: ",null,null,null,{"$f":"MID(L18,10,70)","v":""}]
["",null,"","","","","",null,null,{"$f":"IFERROR(IFERROR(VLOOKUP(C19,#REF!,3,0)*D19,VLOOKUP(C19,#REF!,7,0)*D19),\"нет веса\")","v":"нет веса"},null,"Город: ",null,null,null,{"$f":"MID(L19,8,70)","v":""},{"$f":"IF(LEFT(K19,4)=\"ваша\",VALUE(MID(K19,13,20))*100,0)","v":0}]
["",null,"","","","","",null,null,{"$f":"IFERROR(IFERROR(VLOOKUP(C20,#REF!,3,0)*D20,VLOOKUP(C20,#REF!,7,0)*D20),\"нет веса\")","v":"нет веса"},null,"Улица: ",null,null,null,{"$f":"MID(L20,8,70)","v":""},{"$f":"IF(LEFT(K31,4)=\"ваша\",VALUE(MID(K31,13,20))*100,0)","v":0}]
["",null,"","","","","",null,null,{"$f":"IFERROR(IFERROR(VLOOKUP(C21,#REF!,3,0)*D21,VLOOKUP(C21,#REF!,7,0)*D21),\"нет веса\")","v":"нет веса"},null,"Здание: ",null,null,null,{"$f":"MID(L21,9,70)","v":""},{"$f":"IF(LEFT(K32,4)=\"ваша\",VALUE(MID(K32,13,20))*100,0)","v":0}]
["",null,"","","","","",null,null,{"$f":"IFERROR(IFERROR(VLOOKUP(C22,#REF!,3,0)*D22,VLOOKUP(C22,#REF!,7,0)*D22),\"нет веса\")","v":"нет веса"},null,"Квартира: ",null,null,null,{"$f":"MID(L22,11,70)","v":""},{"$f":"IF(LEFT(#REF!,4)=\"ваша\",VALUE(MID(#REF!,13,20))*100,0)","v":{"$error":"#REF!"}}]
["",null,null,null,"Итого:",{"$f":"SUM(F7:F22)","v":0},"",null,null,{"$f":"IF(K40>0,M40,\"\")","v":""},"Наименование","Количество","Цена","Вес","Всего",null,{"$f":"IF(LEFT(K33,4)=\"ваша\",VALUE(MID(K33,13,20))*100,0)","v":0}]
[{"$f":"IF(L41>0,N41,\"\")","v":""},null,null,"скидка:",{"$f":"IF(F23>150000,10,IF(F23>100000,8,IF(F23>60000,5,IF(F23>30000,3,0))))","v":0},{"$f":"F23-(F23*E24/100)","v":0},{"$f":"IFERROR(SUM(I7:I22)-F29+1,0)","v":0},null,null,null,null,null,null,null,null,{"$f":"N24","v":0},{"$f":"TEXT(SUM(MID(0&P24,LARGE(ISNUMBER(-MID(P24,ROW($1:$88),1))*ROW($1:$88),ROW($1:$15)+15)+1,1)*10^ROW($1:$15)/10),REPT(0,MIN(MAX(COUNT(1/(MID(P24,ROW($1:$88),1)+1))-15,),15)))&TEXT(SUM(MID(0&P24,LARGE(ISNUMBER(-MID(P24,ROW($1:$88),1))*ROW($1:$88),ROW($1:$15))+1,1)*10^ROW($1:$15)/10),REPT(0,MIN(COUNT(1/(MID(P24,ROW($1:$88),1)+1)),15)))","v":"0"}]
[{"$f":"SUM(A7:A23)/1000*1.3","v":0},null,{"$f":"IF(E25=F26,\"Доставка БЕСПЛАТНО\",IF(E25=D26,C26,IF(E25=D27,C27,IF(E25=D28,C28,IF(E25=F27,C27&\" + НПл\",IF(E25=F28,C28&\" + НПл\",\"Укажите ТК\"))))))","v":"Укажите ТК"},2,null,null,{"$f":"IF(I25 >0,TODAY(),\"\")","v":""},null,null,{"$f":"SUM(J7:J22)/1000","v":0},null,null,null,null,null,{"$f":"E25","v":0},{"$f":"TEXT(SUM(MID(0&P25,LARGE(ISNUMBER(-MID(P25,ROW($1:$88),1))*ROW($1:$88),ROW($1:$15)+15)+1,1)*10^ROW($1:$15)/10),REPT(0,MIN(MAX(COUNT(1/(MID(P25,ROW($1:$88),1)+1))-15,),15)))&TEXT(SUM(MID(0&P25,LARGE(ISNUMBER(-MID(P25,ROW($1:$88),1))*ROW($1:$88),ROW($1:$15))+1,1)*10^ROW($1:$15)/10),REPT(0,MIN(COUNT(1/(MID(P25,ROW($1:$88),1)+1)),15)))","v":"0"},{"$f":"E25","v":0},{"$f":"TEXT(SUM(MID(0&R25,LARGE(ISNUMBER(-MID(R25,ROW($1:$88),1))*ROW($1:$88),ROW($1:$15)+15)+1,1)*10^ROW($1:$15)/10),REPT(0,MIN(MAX(COUNT(1/(MID(R25,ROW($1:$88),1)+1))-15,),15)))&TEXT(SUM(MID(0&R25,LARGE(ISNUMBER(-MID(R25,ROW($1:$88),1))*ROW($1:$88),ROW($1:$15))+1,1)*10^ROW($1:$15)/10),REPT(0,MIN(COUNT(1/(MID(R25,ROW($1:$88),1)+1)),15)))","v":"0"},null,{"$f":"TEXT(SUM(MID(0&E25,LARGE(ISNUMBER(-MID(E25,ROW($1:$88),1))*ROW($1:$88),ROW($1:$15)+15)+1,1)*10^ROW($1:$15)/10),REPT(0,MIN(MAX(COUNT(1/(MID(E25,ROW($1:$88),1)+1))-15,),15)))&TEXT(SUM(MID(0&E25,LARGE(ISNUMBER(-MID(E25,ROW($1:$88),1))*ROW($1:$88),ROW($1:$15))+1,1)*10^ROW($1:$15)/10),REPT(0,MIN(COUNT(1/(MID(E25,ROW($1:$88),1)+1)),15)))","v":{"$error":"#NUM!"}}]
[null,null,{"$f":"IFERROR(\"AVIS С А М О В Ы В О З \"&\"  \"&VLOOKUP((LEFT(B34,(LEN(B34)))),'ТАРИФЫ ТК'!J17:L268,1,0),\"НЕТ ДОСТАВКИ\")","v":"НЕТ ДОСТАВКИ"},{"$f":"IFERROR(VLOOKUP((LEFT(B34,(LEN(B34)))),'ТАРИФЫ ТК'!J17:L268,3,0)+0.001,\"НЕТ ДОСТАВКИ\")","v":"НЕТ ДОСТАВКИ"},{"$f":"IFERROR(F24+D26,\"НЕТ ДОСТАВКИ\")","v":"НЕТ ДОСТАВКИ"},{"$f":"IFERROR(D26&\" + НПл\",\"НЕТ ДОСТАВКИ\")","v":"НЕТ ДОСТАВКИ + НПл"},{"$f":"IFERROR(CEILING((F24+D26)*(1+$D$25/100),50),0)","v":0},null,null,null,null,null,null,null,null,{"$f":"N26","v":0},{"$f":"TEXT(SUM(MID(0&P26,LARGE(ISNUMBER(-MID(P26,ROW($1:$88),1))*ROW($1:$88),ROW($1:$15)+15)+1,1)*10^ROW($1:$15)/10),REPT(0,MIN(MAX(COUNT(1/(MID(P26,ROW($1:$88),1)+1))-15,),15)))&TEXT(SUM(MID(0&P26,LARGE(ISNUMBER(-MID(P26,ROW($1:$88),1))*ROW($1:$88),ROW($1:$15))+1,1)*10^ROW($1:$15)/10),REPT(0,MIN(COUNT(1/(MID(P26,ROW($1:$88),1)+1)),15)))","v":"0"}]
[null,null,{"$f":"IFERROR(\"AVIS Econom\"&\"  \"&VLOOKUP((LEFT(B34,(LEN(B34)))),'ТАРИФЫ ТК'!A4:A134,1,0),\"НЕТ ДОСТАВКИ\")","v":"НЕТ ДОСТАВКИ"},{"$f":"IFERROR(VLOOKUP((LEFT(B34,(LEN(B34)))),'ТАРИФЫ ТК'!A4:C134,3,0),\"НЕТ ДОСТАВКИ\")","v":"НЕТ ДОСТАВКИ"},{"$f":"IFERROR(F24+D27,\"НЕТ ДОСТАВКИ\")","v":"НЕТ ДОСТАВКИ"},{"$f":"IFERROR(D27&\" + НПл\",\"НЕТ ДОСТАВКИ\")","v":"НЕТ ДОСТАВКИ + НПл"},{"$f":"IFERROR(CEILING((F24+D27)*(1+$D$25/100),50),0)","v":0},null,null,null,null,null,null,null,null,0,{"$f":"TEXT(SUM(MID(0&P27,LARGE(ISNUMBER(-MID(P27,ROW($1:$88),1))*ROW($1:$88),ROW($1:$15)+15)+1,1)*10^ROW($1:$15)/10),REPT(0,MIN(MAX(COUNT(1/(MID(P27,ROW($1:$88),1)+1))-15,),15)))&TEXT(SUM(MID(0&P27,LARGE(ISNUMBER(-MID(P27,ROW($1:$88),1))*ROW($1:$88),ROW($1:$15))+1,1)*10^ROW($1:$15)/10),REPT(0,MIN(COUNT(1/(MID(P27,ROW($1:$88),1)+1)),15)))","v":"0"}]
[null,null,{"$f":"IFERROR(IF(A29<1,\"AVIS EXPRESS\"&\"  \"&VLOOKUP((LEFT(B34,(LEN(B34)))),'ТАРИФЫ ТК'!E4:G20,1,0),\"AV ВИМАНИЕ:   В Е С    П О С Ы Л К И    Б О Л Ь Ш Е   0,5 КГ   !!!\"),\"НЕТ ДОСТАВКИ\")","v":"НЕТ ДОСТАВКИ"},{"$f":"IFERROR(VLOOKUP((LEFT(B34,(LEN(B34)))),'ТАРИФЫ ТК'!E4:G20,3,0),\"НЕТ ДОСТАВКИ\")","v":"НЕТ ДОСТАВКИ"},{"$f":"IFERROR(F24+D28,\"НЕТ ДОСТАВКИ\")","v":"НЕТ ДОСТАВКИ"},{"$f":"D28&\" + НПл\"","v":"НЕТ ДОСТАВКИ + НПл"},{"$f":"IFERROR(CEILING((F24+D28)*(1+$D$25/100),50),\"НЕТ ДОСТАВКИ\")","v":"НЕТ ДОСТАВКИ"},null,null,null,null,null,null,null,null,0,{"$f":"TEXT(SUM(MID(0&P28,LARGE(ISNUMBER(-MID(P28,ROW($1:$88),1))*ROW($1:$88),ROW($1:$15)+15)+1,1)*10^ROW($1:$15)/10),REPT(0,MIN(MAX(COUNT(1/(MID(P28,ROW($1:$88),1)+1))-15,),15)))&TEXT(SUM(MID(0&P28,LARGE(ISNUMBER(-MID(P28,ROW($1:$88),1))*ROW($1:$88),ROW($1:$15))+1,1)*10^ROW($1:$15)/10),REPT(0,MIN(COUNT(1/(MID(P28,ROW($1:$88),1)+1)),15)))","v":"0"}]
[{"$f":"IFERROR(A25*1.5,\"Количество ??\")","v":0},null,null,"К ОПЛАТЕ:",{"$f":"IFERROR(F24+E25,0)","v":0},{"$f":"IF(E25=C29,\"Доставка БЕСПЛАТНО\",IF(E25=D26,E26,IF(E25=D27,E27,IF(E25=D28,E28,IF(E25=F27,G27,IF(E25=F28,G28,IF(E25=F26,G26,\"Укажите ТК\")))))))","v":"Доставка БЕСПЛАТНО"},{"$f":"IFERROR(CEILING((F24+E25)*1.03,50),0)","v":0},null,null,{"$f":"IFERROR(J25*1.5,\"Количество ??\")","v":0},null,null,null,null,null,0,{"$f":"TEXT(SUM(MID(0&P29,LARGE(ISNUMBER(-MID(P29,ROW($1:$88),1))*ROW($1:$88),ROW($1:$15)+15)+1,1)*10^ROW($1:$15)/10),REPT(0,MIN(MAX(COUNT(1/(MID(P29,ROW($1:$88),1)+1))-15,),15)))&TEXT(SUM(MID(0&P29,LARGE(ISNUMBER(-MID(P29,ROW($1:$88),1))*ROW($1:$88),ROW($1:$15))+1,1)*10^ROW($1:$15)/10),REPT(0,MIN(COUNT(1/(MID(P29,ROW($1:$88),1)+1)),15)))","v":"0"}]
["rc11091kz",null,{"$f":"IFERROR((P14&\"        \"&LEFT(P15,8)&\" = \"&TEXT(R15,\"### ### ###\")&\" т.\"),\"НЕТ ДОСТАВКИ\")","v":"        0 =  т."},null,{"$f":"IFERROR(\"QIWI = \"&CEILING((E26*1.02),10),0)","v":0},{"$f":"IFERROR(F29-F24,\"УКАЖИТЕ ТК\")","v":"УКАЖИТЕ ТК"},null,null,null,null,null,null,null,null,null,0,{"$f":"TEXT(SUM(MID(0&P30,LARGE(ISNUMBER(-MID(P30,ROW($1:$88),1))*ROW($1:$88),ROW($1:$15)+15)+1,1)*10^ROW($1:$15)/10),REPT(0,MIN(MAX(COUNT(1/(MID(P30,ROW($1:$88),1)+1))-15,),15)))&TEXT(SUM(MID(0&P30,LARGE(ISNUMBER(-MID(P30,ROW($1:$88),1))*ROW($1:$88),ROW($1:$15))+1,1)*10^ROW($1:$15)/10),REPT(0,MIN(COUNT(1/(MID(P30,ROW($1:$88),1)+1)),15)))","v":"0"}]
[{"$f":"A1","v":" +"},"ПОЛУЧАТЕЛЬ:","rc11091kz",null,null,null,null,null,null,null,null,null,null,null,null,0,{"$f":"TEXT(SUM(MID(0&P31,LARGE(ISNUMBER(-MID(P31,ROW($1:$88),1))*ROW($1:$88),ROW($1:$15)+15)+1,1)*10^ROW($1:$15)/10),REPT(0,MIN(MAX(COUNT(1/(MID(P31,ROW($1:$88),1)+1))-15,),15)))&TEXT(SUM(MID(0&P31,LARGE(ISNUMBER(-MID(P31,ROW($1:$88),1))*ROW($1:$88),ROW($1:$15))+1,1)*10^ROW($1:$15)/10),REPT(0,MIN(COUNT(1/(MID(P31,ROW($1:$88),1)+1)),15)))","v":"0"}]
[{"$f":"UPPER((B3))","v":"ФИО"},null,{"$f":"IFERROR(MID(НайтиСтрокуПоСлову(\"Комментарий: Имя :\",K1:K45),20,99),0)","v":0},null,null,null,null,null,null,null,null,null,null,null,null,0,{"$f":"TEXT(SUM(MID(0&P32,LARGE(ISNUMBER(-MID(P32,ROW($1:$88),1))*ROW($1:$88),ROW($1:$15)+15)+1,1)*10^ROW($1:$15)/10),REPT(0,MIN(MAX(COUNT(1/(MID(P32,ROW($1:$88),1)+1))-15,),15)))&TEXT(SUM(MID(0&P32,LARGE(ISNUMBER(-MID(P32,ROW($1:$88),1))*ROW($1:$88),ROW($1:$15))+1,1)*10^ROW($1:$15)/10),REPT(0,MIN(COUNT(1/(MID(P32,ROW($1:$88),1)+1)),15)))","v":"0"}]
["Область: ",{"$f":"UPPER((P18))","v":""},{"$f":"IFERROR(ПоискСНачала(C32,\"Телефон\"),0)","v":0},null,{"$f":"IFERROR(ПоискМежду(C32,\"Телефон :\",\"Примечание\"),0)","v":0},{"$f":"IFERROR(IF(LEFT(ПоискСКонца(C32,\"Примечание : \"),2)=\"г \",MID(ПоискСКонца(C32,\"Примечание : \"),3,99),IF(LEFT(ПоискСКонца(C32,\"Примечание : \"),3)=\"г. \",MID(ПоискСКонца(C32,\"Примечание : \"),4,99),IF(LEFT(ПоискСКонца(C32,\"Примечание : \"),3)=\"гор\",MID(ПоискСКонца(C32,\"Примечание : \"),6,99),0))),0)","v":0},null,null,null,null,null,null,null,null,null,0,{"$f":"TEXT(SUM(MID(0&P33,LARGE(ISNUMBER(-MID(P33,ROW($1:$88),1))*ROW($1:$88),ROW($1:$15)+15)+1,1)*10^ROW($1:$15)/10),REPT(0,MIN(MAX(COUNT(1/(MID(P33,ROW($1:$88),1)+1))-15,),15)))&TEXT(SUM(MID(0&P33,LARGE(ISNUMBER(-MID(P33,ROW($1:$88),1))*ROW($1:$88),ROW($1:$15))+1,1)*10^ROW($1:$15)/10),REPT(0,MIN(COUNT(1/(MID(P33,ROW($1:$88),1)+1)),15)))","v":"0"}]
["Город: ",{"$f":"UPPER((P19))","v":""},null,null,null,null,null,null,null,null,null,null,null,null,null,0,{"$f":"TEXT(SUM(MID(0&P34,LARGE(ISNUMBER(-MID(P34,ROW($1:$88),1))*ROW($1:$88),ROW($1:$15)+15)+1,1)*10^ROW($1:$15)/10),REPT(0,MIN(MAX(COUNT(1/(MID(P34,ROW($1:$88),1)+1))-15,),15)))&TEXT(SUM(MID(0&P34,LARGE(ISNUMBER(-MID(P34,ROW($1:$88),1))*ROW($1:$88),ROW($1:$15))+1,1)*10^ROW($1:$15)/10),REPT(0,MIN(COUNT(1/(MID(P34,ROW($1:$88),1)+1)),15)))","v":"0"}]
["Улица: ",{"$f":"UPPER((P20))","v":""},null,null,null,null,null,null,null,null,null,null,null,null,null,0,{"$f":"TEXT(SUM(MID(0&P35,LARGE(ISNUMBER(-MID(P35,ROW($1:$88),1))*ROW($1:$88),ROW($1:$15)+15)+1,1)*10^ROW($1:$15)/10),REPT(0,MIN(MAX(COUNT(1/(MID(P35,ROW($1:$88),1)+1))-15,),15)))&TEXT(SUM(MID(0&P35,LARGE(ISNUMBER(-MID(P35,ROW($1:$88),1))*ROW($1:$88),ROW($1:$15))+1,1)*10^ROW($1:$15)/10),REPT(0,MIN(COUNT(1/(MID(P35,ROW($1:$88),1)+1)),15)))","v":"0"}]
["Здание: ",{"$f":"P21","v":""},null,null,null,null,null,null,null,null,null,null,null,null,null,0,{"$f":"TEXT(SUM(MID(0&P36,LARGE(ISNUMBER(-MID(P36,ROW($1:$88),1))*ROW($1:$88),ROW($1:$15)+15)+1,1)*10^ROW($1:$15)/10),REPT(0,MIN(MAX(COUNT(1/(MID(P36,ROW($1:$88),1)+1))-15,),15)))&TEXT(SUM(MID(0&P36,LARGE(ISNUMBER(-MID(P36,ROW($1:$88),1))*ROW($1:$88),ROW($1:$15))+1,1)*10^ROW($1:$15)/10),REPT(0,MIN(COUNT(1/(MID(P36,ROW($1:$88),1)+1)),15)))","v":"0"}]
["Квартира: ",{"$f":"P22","v":""},null,null,null,null,null,null,null,null,null,null,null,null,null,0,{"$f":"TEXT(SUM(MID(0&P37,LARGE(ISNUMBER(-MID(P37,ROW($1:$88),1))*ROW($1:$88),ROW($1:$15)+15)+1,1)*10^ROW($1:$15)/10),REPT(0,MIN(MAX(COUNT(1/(MID(P37,ROW($1:$88),1)+1))-15,),15)))&TEXT(SUM(MID(0&P37,LARGE(ISNUMBER(-MID(P37,ROW($1:$88),1))*ROW($1:$88),ROW($1:$15))+1,1)*10^ROW($1:$15)/10),REPT(0,MIN(COUNT(1/(MID(P37,ROW($1:$88),1)+1)),15)))","v":"0"}]
["Телефон: ",{"$f":"B4","v":"0----   ----   ----"},null,null,null,null,null,null,null,null,null,null,null,null,null,0,{"$f":"TEXT(SUM(MID(0&P38,LARGE(ISNUMBER(-MID(P38,ROW($1:$88),1))*ROW($1:$88),ROW($1:$15)+15)+1,1)*10^ROW($1:$15)/10),REPT(0,MIN(MAX(COUNT(1/(MID(P38,ROW($1:$88),1)+1))-15,),15)))&TEXT(SUM(MID(0&P38,LARGE(ISNUMBER(-MID(P38,ROW($1:$88),1))*ROW($1:$88),ROW($1:$15))+1,1)*10^ROW($1:$15)/10),REPT(0,MIN(COUNT(1/(MID(P38,ROW($1:$88),1)+1)),15)))","v":"0"}]
["Индекс: ",{"$f":"P16","v":""},null,null,null,null,null,null,null,null,null,null,null,null,null,null,{"$f":"IF(LEFT(#REF!,4)=\"ваша\",VALUE(MID(#REF!,13,20))*100,0)","v":{"$error":"#REF!"}}]
["Компания:",null,null,null,null,null,null,null,null,null,null,null,null,null,null,null,{"$f":"IF(LEFT(#REF!,4)=\"ваша\",VALUE(MID(#REF!,13,20))*100,0)","v":{"$error":"#REF!"}}]
["ИИН:",{"$f":"F29","v":"Доставка БЕСПЛАТНО"},null,null,null,null,null,null,null,null,null,null,null,null,null,null,{"$f":"IF(LEFT(#REF!,4)=\"ваша\",VALUE(MID(#REF!,13,20))*100,0)","v":{"$error":"#REF!"}}]
["------------------------","----------------------------------------------------","----------------------------------------------------","------------------------","------------------------","---------------------------","------------------------------","------------------------","------------------------",null,null,null,null,null,null,null,{"$f":"SUM(Q19:Q41)","v":{"$error":"#REF!"}}]