{"text_format":"1","workbook":"xlsx","n_sheets":3,"sheets":["POB","Database","Access Reg"],"not_rendered":{"charts":0,"images":0,"macros":1,"external_links":0,"defined_names":3,"comments":0,"pivot_tables":0},"unopened":[],"bounds":{"document_bytes":16777216,"sheet_cells":100000,"rows_first":2000,"rows_last":500,"rows_between":2000,"halvings":0,"cell_chars":16384,"cell_head_chars":4096},"cells_cut":0,"cells_raw":0,"read":"whole","date_system":"1900"}

{"sheet":"POB","index":0,"n_rows":49,"n_cols":21,"rows_kept":49,"cut":false,"hidden":false,"merged":[]}
["Last name","First name","Badge Number","Organization","Card number","Entrance Time",{"$f":"SUMPRODUCT(--(LEN(TRIM(E:E))>0))-1","v":5},"Current Time",{"$f":"NOW()","v":"2020-08-29T07:54:47.410"}]
[{"$f":"IFERROR(_xlfn.SINGLE(INDEX('Access Reg'!A$1:A$49,_xlfn.AGGREGATE(15,6,ROW($A$1:$A$49)/ISNUMBER('Access Reg'!$I$1:$I$49),ROW(H1)))),\"\")","v":"Михайлов"},{"$f":"IFERROR(INDEX('Access Reg'!B$1:B$49,_xlfn.AGGREGATE(15,6,ROW($A$1:$A$49)/ISNUMBER('Access Reg'!$I$1:$I$49),ROW(I1))),\"\")","v":"Дмитрий"},{"$f":"IFERROR(INDEX('Access Reg'!C$1:C$49,_xlfn.AGGREGATE(15,6,ROW($A$1:$A$49)/ISNUMBER('Access Reg'!$I$1:$I$49),ROW(J1))),\"\")","v":11118},{"$f":"IFERROR(INDEX('Access Reg'!D$1:D$49,_xlfn.AGGREGATE(15,6,ROW($A$1:$A$49)/ISNUMBER('Access Reg'!$I$1:$I$49),ROW(K1))),\"\")","v":"COMP"},{"$f":"IFERROR(INDEX('Access Reg'!F$1:F$49,_xlfn.AGGREGATE(15,6,ROW($A$1:$A$49)/ISNUMBER('Access Reg'!$I$1:$I$49),ROW(K1))),\"\")","v":10379363},{"$f":"MAX(IF('Access Reg'!$F$1:$F$49=POB!E2,'Access Reg'!$G$1:$G$49))","v":"2020-08-29T07:35:13.530"},null,null,null,null,null,null,{"$f":"'Access Reg'!F14","v":10414889},null,null,null,null,{"$f":"IFERROR(INDEX('Access Reg'!T$1:T$49,_xlfn.AGGREGATE(15,6,ROW($A$1:$A$49)/ISNUMBER('Access Reg'!$I$1:$I$49),ROW(#REF!))),\"\")","v":""}]
[{"$f":"IFERROR(INDEX('Access Reg'!A$1:A$49,_xlfn.AGGREGATE(15,6,ROW($A$1:$A$49)/ISNUMBER('Access Reg'!$I$1:$I$49),ROW(H2))),\"\")","v":"Соколов"},{"$f":"IFERROR(INDEX('Access Reg'!B$1:B$49,_xlfn.AGGREGATE(15,6,ROW($A$1:$A$49)/ISNUMBER('Access Reg'!$I$1:$I$49),ROW(I2))),\"\")","v":"Денис"},{"$f":"IFERROR(INDEX('Access Reg'!C$1:C$49,_xlfn.AGGREGATE(15,6,ROW($A$1:$A$49)/ISNUMBER('Access Reg'!$I$1:$I$49),ROW(J2))),\"\")","v":11117},{"$f":"IFERROR(INDEX('Access Reg'!D$1:D$49,_xlfn.AGGREGATE(15,6,ROW($A$1:$A$49)/ISNUMBER('Access Reg'!$I$1:$I$49),ROW(K2))),\"\")","v":"COMP"},{"$f":"IFERROR(INDEX('Access Reg'!F$1:F$49,_xlfn.AGGREGATE(15,6,ROW($A$1:$A$49)/ISNUMBER('Access Reg'!$I$1:$I$49),ROW(K2))),\"\")","v":10389621},{"$f":"MAX(IF('Access Reg'!$F$1:$F$49=POB!E3,'Access Reg'!$G$1:$G$49))","v":"2020-08-29T07:35:52.850"},null,null,null,null,null,null,{"$f":"'Access Reg'!F15","v":0}]
[{"$f":"IFERROR(INDEX('Access Reg'!A$1:A$49,_xlfn.AGGREGATE(15,6,ROW($A$1:$A$49)/ISNUMBER('Access Reg'!$I$1:$I$49),ROW(H3))),\"\")","v":""},{"$f":"IFERROR(INDEX('Access Reg'!B$1:B$49,_xlfn.AGGREGATE(15,6,ROW($A$1:$A$49)/ISNUMBER('Access Reg'!$I$1:$I$49),ROW(I3))),\"\")","v":""},{"$f":"IFERROR(INDEX('Access Reg'!C$1:C$49,_xlfn.AGGREGATE(15,6,ROW($A$1:$A$49)/ISNUMBER('Access Reg'!$I$1:$I$49),ROW(J3))),\"\")","v":""},{"$f":"IFERROR(INDEX('Access Reg'!D$1:D$49,_xlfn.AGGREGATE(15,6,ROW($A$1:$A$49)/ISNUMBER('Access Reg'!$I$1:$I$49),ROW(K3))),\"\")","v":""},{"$f":"IFERROR(INDEX('Access Reg'!F$1:F$49,_xlfn.AGGREGATE(15,6,ROW($A$1:$A$49)/ISNUMBER('Access Reg'!$I$1:$I$49),ROW(K3))),\"\")","v":1100346948930350},{"$f":"MAX(IF('Access Reg'!$F$1:$F$49=POB!E4,'Access Reg'!$G$1:$G$49))","v":"2020-08-29T07:46:45.830"},null,null,null,null,null,null,{"$f":"'Access Reg'!F16","v":0}]
[{"$f":"IFERROR(INDEX('Access Reg'!A$1:A$49,_xlfn.AGGREGATE(15,6,ROW($A$1:$A$49)/ISNUMBER('Access Reg'!$I$1:$I$49),ROW(H4))),\"\")","v":""},{"$f":"IFERROR(INDEX('Access Reg'!B$1:B$49,_xlfn.AGGREGATE(15,6,ROW($A$1:$A$49)/ISNUMBER('Access Reg'!$I$1:$I$49),ROW(I4))),\"\")","v":""},{"$f":"IFERROR(INDEX('Access Reg'!C$1:C$49,_xlfn.AGGREGATE(15,6,ROW($A$1:$A$49)/ISNUMBER('Access Reg'!$I$1:$I$49),ROW(J4))),\"\")","v":""},{"$f":"IFERROR(INDEX('Access Reg'!D$1:D$49,_xlfn.AGGREGATE(15,6,ROW($A$1:$A$49)/ISNUMBER('Access Reg'!$I$1:$I$49),ROW(K4))),\"\")","v":""},{"$f":"IFERROR(INDEX('Access Reg'!F$1:F$49,_xlfn.AGGREGATE(15,6,ROW($A$1:$A$49)/ISNUMBER('Access Reg'!$I$1:$I$49),ROW(K4))),\"\")","v":104983341},{"$f":"MAX(IF('Access Reg'!$F$1:$F$49=POB!E5,'Access Reg'!$G$1:$G$49))","v":"2020-08-29T07:47:12.660"},null,null,null,null,null,null,{"$f":"'Access Reg'!F17","v":0}]
[{"$f":"IFERROR(INDEX('Access Reg'!A$1:A$49,_xlfn.AGGREGATE(15,6,ROW($A$1:$A$49)/ISNUMBER('Access Reg'!$I$1:$I$49),ROW(H5))),\"\")","v":""},{"$f":"IFERROR(INDEX('Access Reg'!B$1:B$49,_xlfn.AGGREGATE(15,6,ROW($A$1:$A$49)/ISNUMBER('Access Reg'!$I$1:$I$49),ROW(I5))),\"\")","v":""},{"$f":"IFERROR(INDEX('Access Reg'!C$1:C$49,_xlfn.AGGREGATE(15,6,ROW($A$1:$A$49)/ISNUMBER('Access Reg'!$I$1:$I$49),ROW(J5))),\"\")","v":""},{"$f":"IFERROR(INDEX('Access Reg'!D$1:D$49,_xlfn.AGGREGATE(15,6,ROW($A$1:$A$49)/ISNUMBER('Access Reg'!$I$1:$I$49),ROW(K5))),\"\")","v":""},{"$f":"IFERROR(INDEX('Access Reg'!F$1:F$49,_xlfn.AGGREGATE(15,6,ROW($A$1:$A$49)/ISNUMBER('Access Reg'!$I$1:$I$49),ROW(K5))),\"\")","v":364905},{"$f":"MAX(IF('Access Reg'!$F$1:$F$49=POB!E6,'Access Reg'!$G$1:$G$49))","v":"2020-08-29T07:47:12.660"},null,null,null,null,null,null,{"$f":"'Access Reg'!F18","v":0}]
[{"$f":"IFERROR(INDEX('Access Reg'!A$1:A$49,_xlfn.AGGREGATE(15,6,ROW($A$1:$A$49)/ISNUMBER('Access Reg'!$I$1:$I$49),ROW(H6))),\"\")","v":""},{"$f":"IFERROR(INDEX('Access Reg'!B$1:B$49,_xlfn.AGGREGATE(15,6,ROW($A$1:$A$49)/ISNUMBER('Access Reg'!$I$1:$I$49),ROW(I6))),\"\")","v":""},{"$f":"IFERROR(INDEX('Access Reg'!C$1:C$49,_xlfn.AGGREGATE(15,6,ROW($A$1:$A$49)/ISNUMBER('Access Reg'!$I$1:$I$49),ROW(J6))),\"\")","v":""},{"$f":"IFERROR(INDEX('Access Reg'!D$1:D$49,_xlfn.AGGREGATE(15,6,ROW($A$1:$A$49)/ISNUMBER('Access Reg'!$I$1:$I$49),ROW(K6))),\"\")","v":""},{"$f":"IFERROR(INDEX('Access Reg'!F$1:F$49,_xlfn.AGGREGATE(15,6,ROW($A$1:$A$49)/ISNUMBER('Access Reg'!$I$1:$I$49),ROW(K6))),\"\")","v":""},{"$f":"MAX(IF('Access Reg'!$F$1:$F$49=POB!E7,'Access Reg'!$G$1:$G$49))","v":"00:00:00"},null,null,null,null,null,null,{"$f":"'Access Reg'!F19","v":0},null,null,null,{"$f":"IFERROR(INDEX('Access Reg'!S$1:S$49,_xlfn.AGGREGATE(15,6,ROW($A$1:$A$49)/ISNUMBER('Access Reg'!$I$1:$I$49),ROW(W6))),\"\")","v":""}]
[{"$f":"IFERROR(INDEX('Access Reg'!A$1:A$49,_xlfn.AGGREGATE(15,6,ROW($A$1:$A$49)/ISNUMBER('Access Reg'!$I$1:$I$49),ROW(H7))),\"\")","v":""},{"$f":"IFERROR(INDEX('Access Reg'!B$1:B$49,_xlfn.AGGREGATE(15,6,ROW($A$1:$A$49)/ISNUMBER('Access Reg'!$I$1:$I$49),ROW(I7))),\"\")","v":""},{"$f":"IFERROR(INDEX('Access Reg'!C$1:C$49,_xlfn.AGGREGATE(15,6,ROW($A$1:$A$49)/ISNUMBER('Access Reg'!$I$1:$I$49),ROW(J7))),\"\")","v":""},{"$f":"IFERROR(INDEX('Access Reg'!D$1:D$49,_xlfn.AGGREGATE(15,6,ROW($A$1:$A$49)/ISNUMBER('Access Reg'!$I$1:$I$49),ROW(K7))),\"\")","v":""},{"$f":"IFERROR(INDEX('Access Reg'!F$1:F$49,_xlfn.AGGREGATE(15,6,ROW($A$1:$A$49)/ISNUMBER('Access Reg'!$I$1:$I$49),ROW(K7))),\"\")","v":""},{"$f":"MAX(IF('Access Reg'!$F$1:$F$49=POB!E8,'Access Reg'!$G$1:$G$49))","v":"00:00:00"},null,null,null,null,null,null,{"$f":"'Access Reg'!F20","v":0}]
[{"$f":"IFERROR(INDEX('Access Reg'!A$1:A$49,_xlfn.AGGREGATE(15,6,ROW($A$1:$A$49)/ISNUMBER('Access Reg'!$I$1:$I$49),ROW(H8))),\"\")","v":""},{"$f":"IFERROR(INDEX('Access Reg'!B$1:B$49,_xlfn.AGGREGATE(15,6,ROW($A$1:$A$49)/ISNUMBER('Access Reg'!$I$1:$I$49),ROW(I8))),\"\")","v":""},{"$f":"IFERROR(INDEX('Access Reg'!C$1:C$49,_xlfn.AGGREGATE(15,6,ROW($A$1:$A$49)/ISNUMBER('Access Reg'!$I$1:$I$49),ROW(J8))),\"\")","v":""},{"$f":"IFERROR(INDEX('Access Reg'!D$1:D$49,_xlfn.AGGREGATE(15,6,ROW($A$1:$A$49)/ISNUMBER('Access Reg'!$I$1:$I$49),ROW(K8))),\"\")","v":""},{"$f":"IFERROR(INDEX('Access Reg'!F$1:F$49,_xlfn.AGGREGATE(15,6,ROW($A$1:$A$49)/ISNUMBER('Access Reg'!$I$1:$I$49),ROW(K8))),\"\")","v":""},{"$f":"MAX(IF('Access Reg'!$F$1:$F$49=POB!E9,'Access Reg'!$G$1:$G$49))","v":"00:00:00"},null,null,null,null,null,null,{"$f":"'Access Reg'!F21","v":0}]
[{"$f":"IFERROR(INDEX('Access Reg'!A$1:A$49,_xlfn.AGGREGATE(15,6,ROW($A$1:$A$49)/ISNUMBER('Access Reg'!$I$1:$I$49),ROW(H9))),\"\")","v":""},{"$f":"IFERROR(INDEX('Access Reg'!B$1:B$49,_xlfn.AGGREGATE(15,6,ROW($A$1:$A$49)/ISNUMBER('Access Reg'!$I$1:$I$49),ROW(I9))),\"\")","v":""},{"$f":"IFERROR(INDEX('Access Reg'!C$1:C$49,_xlfn.AGGREGATE(15,6,ROW($A$1:$A$49)/ISNUMBER('Access Reg'!$I$1:$I$49),ROW(J9))),\"\")","v":""},{"$f":"IFERROR(INDEX('Access Reg'!D$1:D$49,_xlfn.AGGREGATE(15,6,ROW($A$1:$A$49)/ISNUMBER('Access Reg'!$I$1:$I$49),ROW(K9))),\"\")","v":""},{"$f":"IFERROR(INDEX('Access Reg'!F$1:F$49,_xlfn.AGGREGATE(15,6,ROW($A$1:$A$49)/ISNUMBER('Access Reg'!$I$1:$I$49),ROW(K9))),\"\")","v":""},{"$f":"MAX(IF('Access Reg'!$F$1:$F$49=POB!E10,'Access Reg'!$G$1:$G$49))","v":"00:00:00"},null,null,null,null,null,null,{"$f":"'Access Reg'!F22","v":0}]
[{"$f":"IFERROR(INDEX('Access Reg'!A$1:A$49,_xlfn.AGGREGATE(15,6,ROW($A$1:$A$49)/ISNUMBER('Access Reg'!$I$1:$I$49),ROW(H10))),\"\")","v":""},{"$f":"IFERROR(INDEX('Access Reg'!B$1:B$49,_xlfn.AGGREGATE(15,6,ROW($A$1:$A$49)/ISNUMBER('Access Reg'!$I$1:$I$49),ROW(I10))),\"\")","v":""},{"$f":"IFERROR(INDEX('Access Reg'!C$1:C$49,_xlfn.AGGREGATE(15,6,ROW($A$1:$A$49)/ISNUMBER('Access Reg'!$I$1:$I$49),ROW(J10))),\"\")","v":""},{"$f":"IFERROR(INDEX('Access Reg'!D$1:D$49,_xlfn.AGGREGATE(15,6,ROW($A$1:$A$49)/ISNUMBER('Access Reg'!$I$1:$I$49),ROW(K10))),\"\")","v":""},{"$f":"IFERROR(INDEX('Access Reg'!F$1:F$49,_xlfn.AGGREGATE(15,6,ROW($A$1:$A$49)/ISNUMBER('Access Reg'!$I$1:$I$49),ROW(K10))),\"\")","v":""},{"$f":"MAX(IF('Access Reg'!$F$1:$F$49=POB!E11,'Access Reg'!$G$1:$G$49))","v":"00:00:00"},null,null,null,null,null,null,{"$f":"'Access Reg'!F23","v":0}]
[{"$f":"IFERROR(INDEX('Access Reg'!A$1:A$49,_xlfn.AGGREGATE(15,6,ROW($A$1:$A$49)/ISNUMBER('Access Reg'!$I$1:$I$49),ROW(H11))),\"\")","v":""},{"$f":"IFERROR(INDEX('Access Reg'!B$1:B$49,_xlfn.AGGREGATE(15,6,ROW($A$1:$A$49)/ISNUMBER('Access Reg'!$I$1:$I$49),ROW(I11))),\"\")","v":""},{"$f":"IFERROR(INDEX('Access Reg'!C$1:C$49,_xlfn.AGGREGATE(15,6,ROW($A$1:$A$49)/ISNUMBER('Access Reg'!$I$1:$I$49),ROW(J11))),\"\")","v":""},{"$f":"IFERROR(INDEX('Access Reg'!D$1:D$49,_xlfn.AGGREGATE(15,6,ROW($A$1:$A$49)/ISNUMBER('Access Reg'!$I$1:$I$49),ROW(K11))),\"\")","v":""},{"$f":"IFERROR(INDEX('Access Reg'!F$1:F$49,_xlfn.AGGREGATE(15,6,ROW($A$1:$A$49)/ISNUMBER('Access Reg'!$I$1:$I$49),ROW(K11))),\"\")","v":""},{"$f":"MAX(IF('Access Reg'!$F$1:$F$49=POB!E12,'Access Reg'!$G$1:$G$49))","v":"00:00:00"},null,null,null,null,null,null,{"$f":"'Access Reg'!F24","v":0}]
[{"$f":"IFERROR(INDEX('Access Reg'!A$1:A$49,_xlfn.AGGREGATE(15,6,ROW($A$1:$A$49)/ISNUMBER('Access Reg'!$I$1:$I$49),ROW(H12))),\"\")","v":""},{"$f":"IFERROR(INDEX('Access Reg'!B$1:B$49,_xlfn.AGGREGATE(15,6,ROW($A$1:$A$49)/ISNUMBER('Access Reg'!$I$1:$I$49),ROW(I12))),\"\")","v":""},{"$f":"IFERROR(INDEX('Access Reg'!C$1:C$49,_xlfn.AGGREGATE(15,6,ROW($A$1:$A$49)/ISNUMBER('Access Reg'!$I$1:$I$49),ROW(J12))),\"\")","v":""},{"$f":"IFERROR(INDEX('Access Reg'!D$1:D$49,_xlfn.AGGREGATE(15,6,ROW($A$1:$A$49)/ISNUMBER('Access Reg'!$I$1:$I$49),ROW(K12))),\"\")","v":""},{"$f":"IFERROR(INDEX('Access Reg'!F$1:F$49,_xlfn.AGGREGATE(15,6,ROW($A$1:$A$49)/ISNUMBER('Access Reg'!$I$1:$I$49),ROW(K12))),\"\")","v":""},{"$f":"MAX(IF('Access Reg'!$F$1:$F$49=POB!E13,'Access Reg'!$G$1:$G$49))","v":"00:00:00"},null,null,null,null,null,null,{"$f":"'Access Reg'!F25","v":0}]
[{"$f":"IFERROR(INDEX('Access Reg'!A$1:A$49,_xlfn.AGGREGATE(15,6,ROW($A$1:$A$49)/ISNUMBER('Access Reg'!$I$1:$I$49),ROW(H13))),\"\")","v":""},{"$f":"IFERROR(INDEX('Access Reg'!B$1:B$49,_xlfn.AGGREGATE(15,6,ROW($A$1:$A$49)/ISNUMBER('Access Reg'!$I$1:$I$49),ROW(I13))),\"\")","v":""},{"$f":"IFERROR(INDEX('Access Reg'!C$1:C$49,_xlfn.AGGREGATE(15,6,ROW($A$1:$A$49)/ISNUMBER('Access Reg'!$I$1:$I$49),ROW(J13))),\"\")","v":""},{"$f":"IFERROR(INDEX('Access Reg'!D$1:D$49,_xlfn.AGGREGATE(15,6,ROW($A$1:$A$49)/ISNUMBER('Access Reg'!$I$1:$I$49),ROW(K13))),\"\")","v":""},{"$f":"IFERROR(INDEX('Access Reg'!F$1:F$49,_xlfn.AGGREGATE(15,6,ROW($A$1:$A$49)/ISNUMBER('Access Reg'!$I$1:$I$49),ROW(K13))),\"\")","v":""},{"$f":"MAX(IF('Access Reg'!$F$1:$F$49=POB!E14,'Access Reg'!$G$1:$G$49))","v":"00:00:00"},null,null,null,null,null,null,{"$f":"'Access Reg'!F26","v":0}]
[{"$f":"IFERROR(INDEX('Access Reg'!A$1:A$49,_xlfn.AGGREGATE(15,6,ROW($A$1:$A$49)/ISNUMBER('Access Reg'!$I$1:$I$49),ROW(H14))),\"\")","v":""},{"$f":"IFERROR(INDEX('Access Reg'!B$1:B$49,_xlfn.AGGREGATE(15,6,ROW($A$1:$A$49)/ISNUMBER('Access Reg'!$I$1:$I$49),ROW(I14))),\"\")","v":""},{"$f":"IFERROR(INDEX('Access Reg'!C$1:C$49,_xlfn.AGGREGATE(15,6,ROW($A$1:$A$49)/ISNUMBER('Access Reg'!$I$1:$I$49),ROW(J14))),\"\")","v":""},{"$f":"IFERROR(INDEX('Access Reg'!D$1:D$49,_xlfn.AGGREGATE(15,6,ROW($A$1:$A$49)/ISNUMBER('Access Reg'!$I$1:$I$49),ROW(K14))),\"\")","v":""},{"$f":"IFERROR(INDEX('Access Reg'!F$1:F$49,_xlfn.AGGREGATE(15,6,ROW($A$1:$A$49)/ISNUMBER('Access Reg'!$I$1:$I$49),ROW(K14))),\"\")","v":""},{"$f":"MAX(IF('Access Reg'!$F$1:$F$49=POB!E15,'Access Reg'!$G$1:$G$49))","v":"00:00:00"},null,null,null,null,null,null,{"$f":"'Access Reg'!F27","v":0}]
[{"$f":"IFERROR(INDEX('Access Reg'!A$1:A$49,_xlfn.AGGREGATE(15,6,ROW($A$1:$A$49)/ISNUMBER('Access Reg'!$I$1:$I$49),ROW(H15))),\"\")","v":""},{"$f":"IFERROR(INDEX('Access Reg'!B$1:B$49,_xlfn.AGGREGATE(15,6,ROW($A$1:$A$49)/ISNUMBER('Access Reg'!$I$1:$I$49),ROW(I15))),\"\")","v":""},{"$f":"IFERROR(INDEX('Access Reg'!C$1:C$49,_xlfn.AGGREGATE(15,6,ROW($A$1:$A$49)/ISNUMBER('Access Reg'!$I$1:$I$49),ROW(J15))),\"\")","v":""},{"$f":"IFERROR(INDEX('Access Reg'!D$1:D$49,_xlfn.AGGREGATE(15,6,ROW($A$1:$A$49)/ISNUMBER('Access Reg'!$I$1:$I$49),ROW(K15))),\"\")","v":""},{"$f":"IFERROR(INDEX('Access Reg'!F$1:F$49,_xlfn.AGGREGATE(15,6,ROW($A$1:$A$49)/ISNUMBER('Access Reg'!$I$1:$I$49),ROW(K15))),\"\")","v":""},{"$f":"MAX(IF('Access Reg'!$F$1:$F$49=POB!E16,'Access Reg'!$G$1:$G$49))","v":"00:00:00"},null,null,null,null,null,null,{"$f":"'Access Reg'!F28","v":0}]
[{"$f":"IFERROR(INDEX('Access Reg'!A$1:A$49,_xlfn.AGGREGATE(15,6,ROW($A$1:$A$49)/ISNUMBER('Access Reg'!$I$1:$I$49),ROW(H16))),\"\")","v":""},{"$f":"IFERROR(INDEX('Access Reg'!B$1:B$49,_xlfn.AGGREGATE(15,6,ROW($A$1:$A$49)/ISNUMBER('Access Reg'!$I$1:$I$49),ROW(I16))),\"\")","v":""},{"$f":"IFERROR(INDEX('Access Reg'!C$1:C$49,_xlfn.AGGREGATE(15,6,ROW($A$1:$A$49)/ISNUMBER('Access Reg'!$I$1:$I$49),ROW(J16))),\"\")","v":""},{"$f":"IFERROR(INDEX('Access Reg'!D$1:D$49,_xlfn.AGGREGATE(15,6,ROW($A$1:$A$49)/ISNUMBER('Access Reg'!$I$1:$I$49),ROW(K16))),\"\")","v":""},{"$f":"IFERROR(INDEX('Access Reg'!F$1:F$49,_xlfn.AGGREGATE(15,6,ROW($A$1:$A$49)/ISNUMBER('Access Reg'!$I$1:$I$49),ROW(K16))),\"\")","v":""},{"$f":"MAX(IF('Access Reg'!$F$1:$F$49=POB!E17,'Access Reg'!$G$1:$G$49))","v":"00:00:00"},null,null,null,null,null,null,{"$f":"'Access Reg'!F29","v":0}]
[{"$f":"IFERROR(INDEX('Access Reg'!A$1:A$49,_xlfn.AGGREGATE(15,6,ROW($A$1:$A$49)/ISNUMBER('Access Reg'!$I$1:$I$49),ROW(H17))),\"\")","v":""},{"$f":"IFERROR(INDEX('Access Reg'!B$1:B$49,_xlfn.AGGREGATE(15,6,ROW($A$1:$A$49)/ISNUMBER('Access Reg'!$I$1:$I$49),ROW(I17))),\"\")","v":""},{"$f":"IFERROR(INDEX('Access Reg'!C$1:C$49,_xlfn.AGGREGATE(15,6,ROW($A$1:$A$49)/ISNUMBER('Access Reg'!$I$1:$I$49),ROW(J17))),\"\")","v":""},{"$f":"IFERROR(INDEX('Access Reg'!D$1:D$49,_xlfn.AGGREGATE(15,6,ROW($A$1:$A$49)/ISNUMBER('Access Reg'!$I$1:$I$49),ROW(K17))),\"\")","v":""},{"$f":"IFERROR(INDEX('Access Reg'!F$1:F$49,_xlfn.AGGREGATE(15,6,ROW($A$1:$A$49)/ISNUMBER('Access Reg'!$I$1:$I$49),ROW(K17))),\"\")","v":""},{"$f":"MAX(IF('Access Reg'!$F$1:$F$49=POB!E18,'Access Reg'!$G$1:$G$49))","v":"00:00:00"},null,null,null,null,null,null,{"$f":"'Access Reg'!F30","v":0}]
[{"$f":"IFERROR(INDEX('Access Reg'!A$1:A$49,_xlfn.AGGREGATE(15,6,ROW($A$1:$A$49)/ISNUMBER('Access Reg'!$I$1:$I$49),ROW(H18))),\"\")","v":""},{"$f":"IFERROR(INDEX('Access Reg'!B$1:B$49,_xlfn.AGGREGATE(15,6,ROW($A$1:$A$49)/ISNUMBER('Access Reg'!$I$1:$I$49),ROW(I18))),\"\")","v":""},{"$f":"IFERROR(INDEX('Access Reg'!C$1:C$49,_xlfn.AGGREGATE(15,6,ROW($A$1:$A$49)/ISNUMBER('Access Reg'!$I$1:$I$49),ROW(J18))),\"\")","v":""},{"$f":"IFERROR(INDEX('Access Reg'!D$1:D$49,_xlfn.AGGREGATE(15,6,ROW($A$1:$A$49)/ISNUMBER('Access Reg'!$I$1:$I$49),ROW(K18))),\"\")","v":""},{"$f":"IFERROR(INDEX('Access Reg'!F$1:F$49,_xlfn.AGGREGATE(15,6,ROW($A$1:$A$49)/ISNUMBER('Access Reg'!$I$1:$I$49),ROW(K18))),\"\")","v":""},{"$f":"MAX(IF('Access Reg'!$F$1:$F$49=POB!E19,'Access Reg'!$G$1:$G$49))","v":"00:00:00"},null,null,null,null,null,null,{"$f":"'Access Reg'!F31","v":0}]
[{"$f":"IFERROR(INDEX('Access Reg'!A$1:A$49,_xlfn.AGGREGATE(15,6,ROW($A$1:$A$49)/ISNUMBER('Access Reg'!$I$1:$I$49),ROW(H19))),\"\")","v":""},{"$f":"IFERROR(INDEX('Access Reg'!B$1:B$49,_xlfn.AGGREGATE(15,6,ROW($A$1:$A$49)/ISNUMBER('Access Reg'!$I$1:$I$49),ROW(I19))),\"\")","v":""},{"$f":"IFERROR(INDEX('Access Reg'!C$1:C$49,_xlfn.AGGREGATE(15,6,ROW($A$1:$A$49)/ISNUMBER('Access Reg'!$I$1:$I$49),ROW(J19))),\"\")","v":""},{"$f":"IFERROR(INDEX('Access Reg'!D$1:D$49,_xlfn.AGGREGATE(15,6,ROW($A$1:$A$49)/ISNUMBER('Access Reg'!$I$1:$I$49),ROW(K19))),\"\")","v":""},{"$f":"IFERROR(INDEX('Access Reg'!F$1:F$49,_xlfn.AGGREGATE(15,6,ROW($A$1:$A$49)/ISNUMBER('Access Reg'!$I$1:$I$49),ROW(K19))),\"\")","v":""},{"$f":"MAX(IF('Access Reg'!$F$1:$F$49=POB!E20,'Access Reg'!$G$1:$G$49))","v":"00:00:00"},null,null,null,null,null,null,{"$f":"'Access Reg'!F32","v":0}]
[{"$f":"IFERROR(INDEX('Access Reg'!A$1:A$49,_xlfn.AGGREGATE(15,6,ROW($A$1:$A$49)/ISNUMBER('Access Reg'!$I$1:$I$49),ROW(H20))),\"\")","v":""},{"$f":"IFERROR(INDEX('Access Reg'!B$1:B$49,_xlfn.AGGREGATE(15,6,ROW($A$1:$A$49)/ISNUMBER('Access Reg'!$I$1:$I$49),ROW(I20))),\"\")","v":""},{"$f":"IFERROR(INDEX('Access Reg'!C$1:C$49,_xlfn.AGGREGATE(15,6,ROW($A$1:$A$49)/ISNUMBER('Access Reg'!$I$1:$I$49),ROW(J20))),\"\")","v":""},{"$f":"IFERROR(INDEX('Access Reg'!D$1:D$49,_xlfn.AGGREGATE(15,6,ROW($A$1:$A$49)/ISNUMBER('Access Reg'!$I$1:$I$49),ROW(K20))),\"\")","v":""},{"$f":"IFERROR(INDEX('Access Reg'!F$1:F$49,_xlfn.AGGREGATE(15,6,ROW($A$1:$A$49)/ISNUMBER('Access Reg'!$I$1:$I$49),ROW(K20))),\"\")","v":""},{"$f":"MAX(IF('Access Reg'!$F$1:$F$49=POB!E21,'Access Reg'!$G$1:$G$49))","v":"00:00:00"},null,null,null,null,null,null,{"$f":"'Access Reg'!F33","v":0}]
[{"$f":"IFERROR(INDEX('Access Reg'!A$1:A$49,_xlfn.AGGREGATE(15,6,ROW($A$1:$A$49)/ISNUMBER('Access Reg'!$I$1:$I$49),ROW(H21))),\"\")","v":""},{"$f":"IFERROR(INDEX('Access Reg'!B$1:B$49,_xlfn.AGGREGATE(15,6,ROW($A$1:$A$49)/ISNUMBER('Access Reg'!$I$1:$I$49),ROW(I21))),\"\")","v":""},{"$f":"IFERROR(INDEX('Access Reg'!C$1:C$49,_xlfn.AGGREGATE(15,6,ROW($A$1:$A$49)/ISNUMBER('Access Reg'!$I$1:$I$49),ROW(J21))),\"\")","v":""},{"$f":"IFERROR(INDEX('Access Reg'!D$1:D$49,_xlfn.AGGREGATE(15,6,ROW($A$1:$A$49)/ISNUMBER('Access Reg'!$I$1:$I$49),ROW(K21))),\"\")","v":""},{"$f":"IFERROR(INDEX('Access Reg'!F$1:F$49,_xlfn.AGGREGATE(15,6,ROW($A$1:$A$49)/ISNUMBER('Access Reg'!$I$1:$I$49),ROW(K21))),\"\")","v":""},{"$f":"MAX(IF('Access Reg'!$F$1:$F$49=POB!E22,'Access Reg'!$G$1:$G$49))","v":"00:00:00"},null,null,null,null,null,null,{"$f":"'Access Reg'!F34","v":0}]
[{"$f":"IFERROR(INDEX('Access Reg'!A$1:A$49,_xlfn.AGGREGATE(15,6,ROW($A$1:$A$49)/ISNUMBER('Access Reg'!$I$1:$I$49),ROW(H22))),\"\")","v":""},{"$f":"IFERROR(INDEX('Access Reg'!B$1:B$49,_xlfn.AGGREGATE(15,6,ROW($A$1:$A$49)/ISNUMBER('Access Reg'!$I$1:$I$49),ROW(I22))),\"\")","v":""},{"$f":"IFERROR(INDEX('Access Reg'!C$1:C$49,_xlfn.AGGREGATE(15,6,ROW($A$1:$A$49)/ISNUMBER('Access Reg'!$I$1:$I$49),ROW(J22))),\"\")","v":""},{"$f":"IFERROR(INDEX('Access Reg'!D$1:D$49,_xlfn.AGGREGATE(15,6,ROW($A$1:$A$49)/ISNUMBER('Access Reg'!$I$1:$I$49),ROW(K22))),\"\")","v":""},{"$f":"IFERROR(INDEX('Access Reg'!F$1:F$49,_xlfn.AGGREGATE(15,6,ROW($A$1:$A$49)/ISNUMBER('Access Reg'!$I$1:$I$49),ROW(K22))),\"\")","v":""},{"$f":"MAX(IF('Access Reg'!$F$1:$F$49=POB!E23,'Access Reg'!$G$1:$G$49))","v":"00:00:00"},null,null,null,null,null,null,{"$f":"'Access Reg'!F35","v":0}]
[{"$f":"IFERROR(INDEX('Access Reg'!A$1:A$49,_xlfn.AGGREGATE(15,6,ROW($A$1:$A$49)/ISNUMBER('Access Reg'!$I$1:$I$49),ROW(H23))),\"\")","v":""},{"$f":"IFERROR(INDEX('Access Reg'!B$1:B$49,_xlfn.AGGREGATE(15,6,ROW($A$1:$A$49)/ISNUMBER('Access Reg'!$I$1:$I$49),ROW(I23))),\"\")","v":""},{"$f":"IFERROR(INDEX('Access Reg'!C$1:C$49,_xlfn.AGGREGATE(15,6,ROW($A$1:$A$49)/ISNUMBER('Access Reg'!$I$1:$I$49),ROW(J23))),\"\")","v":""},{"$f":"IFERROR(INDEX('Access Reg'!D$1:D$49,_xlfn.AGGREGATE(15,6,ROW($A$1:$A$49)/ISNUMBER('Access Reg'!$I$1:$I$49),ROW(K23))),\"\")","v":""},{"$f":"IFERROR(INDEX('Access Reg'!F$1:F$49,_xlfn.AGGREGATE(15,6,ROW($A$1:$A$49)/ISNUMBER('Access Reg'!$I$1:$I$49),ROW(K23))),\"\")","v":""},{"$f":"MAX(IF('Access Reg'!$F$1:$F$49=POB!E24,'Access Reg'!$G$1:$G$49))","v":"00:00:00"},null,null,null,null,null,null,{"$f":"'Access Reg'!F36","v":0}]
[{"$f":"IFERROR(INDEX('Access Reg'!A$1:A$49,_xlfn.AGGREGATE(15,6,ROW($A$1:$A$49)/ISNUMBER('Access Reg'!$I$1:$I$49),ROW(H24))),\"\")","v":""},{"$f":"IFERROR(INDEX('Access Reg'!B$1:B$49,_xlfn.AGGREGATE(15,6,ROW($A$1:$A$49)/ISNUMBER('Access Reg'!$I$1:$I$49),ROW(I24))),\"\")","v":""},{"$f":"IFERROR(INDEX('Access Reg'!C$1:C$49,_xlfn.AGGREGATE(15,6,ROW($A$1:$A$49)/ISNUMBER('Access Reg'!$I$1:$I$49),ROW(J24))),\"\")","v":""},{"$f":"IFERROR(INDEX('Access Reg'!D$1:D$49,_xlfn.AGGREGATE(15,6,ROW($A$1:$A$49)/ISNUMBER('Access Reg'!$I$1:$I$49),ROW(K24))),\"\")","v":""},{"$f":"IFERROR(INDEX('Access Reg'!F$1:F$49,_xlfn.AGGREGATE(15,6,ROW($A$1:$A$49)/ISNUMBER('Access Reg'!$I$1:$I$49),ROW(K24))),\"\")","v":""},{"$f":"MAX(IF('Access Reg'!$F$1:$F$49=POB!E25,'Access Reg'!$G$1:$G$49))","v":"00:00:00"},null,null,null,null,null,null,{"$f":"'Access Reg'!F37","v":0}]
[{"$f":"IFERROR(INDEX('Access Reg'!A$1:A$49,_xlfn.AGGREGATE(15,6,ROW($A$1:$A$49)/ISNUMBER('Access Reg'!$I$1:$I$49),ROW(H25))),\"\")","v":""},{"$f":"IFERROR(INDEX('Access Reg'!B$1:B$49,_xlfn.AGGREGATE(15,6,ROW($A$1:$A$49)/ISNUMBER('Access Reg'!$I$1:$I$49),ROW(I25))),\"\")","v":""},{"$f":"IFERROR(INDEX('Access Reg'!C$1:C$49,_xlfn.AGGREGATE(15,6,ROW($A$1:$A$49)/ISNUMBER('Access Reg'!$I$1:$I$49),ROW(J25))),\"\")","v":""},{"$f":"IFERROR(INDEX('Access Reg'!D$1:D$49,_xlfn.AGGREGATE(15,6,ROW($A$1:$A$49)/ISNUMBER('Access Reg'!$I$1:$I$49),ROW(K25))),\"\")","v":""},{"$f":"IFERROR(INDEX('Access Reg'!F$1:F$49,_xlfn.AGGREGATE(15,6,ROW($A$1:$A$49)/ISNUMBER('Access Reg'!$I$1:$I$49),ROW(K25))),\"\")","v":""},{"$f":"MAX(IF('Access Reg'!$F$1:$F$49=POB!E26,'Access Reg'!$G$1:$G$49))","v":"00:00:00"},null,null,null,null,null,null,{"$f":"'Access Reg'!F38","v":0}]
[{"$f":"IFERROR(INDEX('Access Reg'!A$1:A$49,_xlfn.AGGREGATE(15,6,ROW($A$1:$A$49)/ISNUMBER('Access Reg'!$I$1:$I$49),ROW(H26))),\"\")","v":""},{"$f":"IFERROR(INDEX('Access Reg'!B$1:B$49,_xlfn.AGGREGATE(15,6,ROW($A$1:$A$49)/ISNUMBER('Access Reg'!$I$1:$I$49),ROW(I26))),\"\")","v":""},{"$f":"IFERROR(INDEX('Access Reg'!C$1:C$49,_xlfn.AGGREGATE(15,6,ROW($A$1:$A$49)/ISNUMBER('Access Reg'!$I$1:$I$49),ROW(J26))),\"\")","v":""},{"$f":"IFERROR(INDEX('Access Reg'!D$1:D$49,_xlfn.AGGREGATE(15,6,ROW($A$1:$A$49)/ISNUMBER('Access Reg'!$I$1:$I$49),ROW(K26))),\"\")","v":""},{"$f":"IFERROR(INDEX('Access Reg'!F$1:F$49,_xlfn.AGGREGATE(15,6,ROW($A$1:$A$49)/ISNUMBER('Access Reg'!$I$1:$I$49),ROW(K26))),\"\")","v":""},{"$f":"MAX(IF('Access Reg'!$F$1:$F$49=POB!E27,'Access Reg'!$G$1:$G$49))","v":"00:00:00"},null,null,null,null,null,null,{"$f":"'Access Reg'!F39","v":0}]
[{"$f":"IFERROR(INDEX('Access Reg'!A$1:A$49,_xlfn.AGGREGATE(15,6,ROW($A$1:$A$49)/ISNUMBER('Access Reg'!$I$1:$I$49),ROW(H27))),\"\")","v":""},{"$f":"IFERROR(INDEX('Access Reg'!B$1:B$49,_xlfn.AGGREGATE(15,6,ROW($A$1:$A$49)/ISNUMBER('Access Reg'!$I$1:$I$49),ROW(I27))),\"\")","v":""},{"$f":"IFERROR(INDEX('Access Reg'!C$1:C$49,_xlfn.AGGREGATE(15,6,ROW($A$1:$A$49)/ISNUMBER('Access Reg'!$I$1:$I$49),ROW(J27))),\"\")","v":""},{"$f":"IFERROR(INDEX('Access Reg'!D$1:D$49,_xlfn.AGGREGATE(15,6,ROW($A$1:$A$49)/ISNUMBER('Access Reg'!$I$1:$I$49),ROW(K27))),\"\")","v":""},{"$f":"IFERROR(INDEX('Access Reg'!F$1:F$49,_xlfn.AGGREGATE(15,6,ROW($A$1:$A$49)/ISNUMBER('Access Reg'!$I$1:$I$49),ROW(K27))),\"\")","v":""},{"$f":"MAX(IF('Access Reg'!$F$1:$F$49=POB!E28,'Access Reg'!$G$1:$G$49))","v":"00:00:00"},null,null,null,null,null,null,{"$f":"'Access Reg'!F40","v":0}]
[{"$f":"IFERROR(INDEX('Access Reg'!A$1:A$49,_xlfn.AGGREGATE(15,6,ROW($A$1:$A$49)/ISNUMBER('Access Reg'!$I$1:$I$49),ROW(H28))),\"\")","v":""},{"$f":"IFERROR(INDEX('Access Reg'!B$1:B$49,_xlfn.AGGREGATE(15,6,ROW($A$1:$A$49)/ISNUMBER('Access Reg'!$I$1:$I$49),ROW(I28))),\"\")","v":""},{"$f":"IFERROR(INDEX('Access Reg'!C$1:C$49,_xlfn.AGGREGATE(15,6,ROW($A$1:$A$49)/ISNUMBER('Access Reg'!$I$1:$I$49),ROW(J28))),\"\")","v":""},{"$f":"IFERROR(INDEX('Access Reg'!D$1:D$49,_xlfn.AGGREGATE(15,6,ROW($A$1:$A$49)/ISNUMBER('Access Reg'!$I$1:$I$49),ROW(K28))),\"\")","v":""},{"$f":"IFERROR(INDEX('Access Reg'!F$1:F$49,_xlfn.AGGREGATE(15,6,ROW($A$1:$A$49)/ISNUMBER('Access Reg'!$I$1:$I$49),ROW(K28))),\"\")","v":""},{"$f":"MAX(IF('Access Reg'!$F$1:$F$49=POB!E29,'Access Reg'!$G$1:$G$49))","v":"00:00:00"},null,null,null,null,null,null,{"$f":"'Access Reg'!F41","v":0}]
[{"$f":"IFERROR(INDEX('Access Reg'!A$1:A$49,_xlfn.AGGREGATE(15,6,ROW($A$1:$A$49)/ISNUMBER('Access Reg'!$I$1:$I$49),ROW(H29))),\"\")","v":""},{"$f":"IFERROR(INDEX('Access Reg'!B$1:B$49,_xlfn.AGGREGATE(15,6,ROW($A$1:$A$49)/ISNUMBER('Access Reg'!$I$1:$I$49),ROW(I29))),\"\")","v":""},{"$f":"IFERROR(INDEX('Access Reg'!C$1:C$49,_xlfn.AGGREGATE(15,6,ROW($A$1:$A$49)/ISNUMBER('Access Reg'!$I$1:$I$49),ROW(J29))),\"\")","v":""},{"$f":"IFERROR(INDEX('Access Reg'!D$1:D$49,_xlfn.AGGREGATE(15,6,ROW($A$1:$A$49)/ISNUMBER('Access Reg'!$I$1:$I$49),ROW(K29))),\"\")","v":""},{"$f":"IFERROR(INDEX('Access Reg'!F$1:F$49,_xlfn.AGGREGATE(15,6,ROW($A$1:$A$49)/ISNUMBER('Access Reg'!$I$1:$I$49),ROW(K29))),\"\")","v":""},{"$f":"MAX(IF('Access Reg'!$F$1:$F$49=POB!E30,'Access Reg'!$G$1:$G$49))","v":"00:00:00"},null,null,null,null,null,null,{"$f":"'Access Reg'!F42","v":0},null,null,null,null,null,null,null,{"$f":"IFERROR(INDEX('Access Reg'!W$1:W$49,_xlfn.AGGREGATE(15,6,ROW($A$1:$A$49)/ISNUMBER('Access Reg'!$I$1:$I$49),ROW(AA29))),\"\")","v":""}]
[{"$f":"IFERROR(INDEX('Access Reg'!A$1:A$49,_xlfn.AGGREGATE(15,6,ROW($A$1:$A$49)/ISNUMBER('Access Reg'!$I$1:$I$49),ROW(H30))),\"\")","v":""},{"$f":"IFERROR(INDEX('Access Reg'!B$1:B$49,_xlfn.AGGREGATE(15,6,ROW($A$1:$A$49)/ISNUMBER('Access Reg'!$I$1:$I$49),ROW(I30))),\"\")","v":""},{"$f":"IFERROR(INDEX('Access Reg'!C$1:C$49,_xlfn.AGGREGATE(15,6,ROW($A$1:$A$49)/ISNUMBER('Access Reg'!$I$1:$I$49),ROW(J30))),\"\")","v":""},{"$f":"IFERROR(INDEX('Access Reg'!D$1:D$49,_xlfn.AGGREGATE(15,6,ROW($A$1:$A$49)/ISNUMBER('Access Reg'!$I$1:$I$49),ROW(K30))),\"\")","v":""},{"$f":"IFERROR(INDEX('Access Reg'!F$1:F$49,_xlfn.AGGREGATE(15,6,ROW($A$1:$A$49)/ISNUMBER('Access Reg'!$I$1:$I$49),ROW(K30))),\"\")","v":""},{"$f":"MAX(IF('Access Reg'!$F$1:$F$49=POB!E31,'Access Reg'!$G$1:$G$49))","v":"00:00:00"},null,null,null,null,null,null,{"$f":"'Access Reg'!F43","v":0}]
[{"$f":"IFERROR(INDEX('Access Reg'!A$1:A$49,_xlfn.AGGREGATE(15,6,ROW($A$1:$A$49)/ISNUMBER('Access Reg'!$I$1:$I$49),ROW(H31))),\"\")","v":""},{"$f":"IFERROR(INDEX('Access Reg'!B$1:B$49,_xlfn.AGGREGATE(15,6,ROW($A$1:$A$49)/ISNUMBER('Access Reg'!$I$1:$I$49),ROW(I31))),\"\")","v":""},{"$f":"IFERROR(INDEX('Access Reg'!C$1:C$49,_xlfn.AGGREGATE(15,6,ROW($A$1:$A$49)/ISNUMBER('Access Reg'!$I$1:$I$49),ROW(J31))),\"\")","v":""},{"$f":"IFERROR(INDEX('Access Reg'!D$1:D$49,_xlfn.AGGREGATE(15,6,ROW($A$1:$A$49)/ISNUMBER('Access Reg'!$I$1:$I$49),ROW(K31))),\"\")","v":""},{"$f":"IFERROR(INDEX('Access Reg'!F$1:F$49,_xlfn.AGGREGATE(15,6,ROW($A$1:$A$49)/ISNUMBER('Access Reg'!$I$1:$I$49),ROW(K31))),\"\")","v":""},{"$f":"MAX(IF('Access Reg'!$F$1:$F$49=POB!E32,'Access Reg'!$G$1:$G$49))","v":"00:00:00"},null,null,null,null,null,null,{"$f":"'Access Reg'!F44","v":0}]
[{"$f":"IFERROR(INDEX('Access Reg'!A$1:A$49,_xlfn.AGGREGATE(15,6,ROW($A$1:$A$49)/ISNUMBER('Access Reg'!$I$1:$I$49),ROW(H32))),\"\")","v":""},{"$f":"IFERROR(INDEX('Access Reg'!B$1:B$49,_xlfn.AGGREGATE(15,6,ROW($A$1:$A$49)/ISNUMBER('Access Reg'!$I$1:$I$49),ROW(I32))),\"\")","v":""},{"$f":"IFERROR(INDEX('Access Reg'!C$1:C$49,_xlfn.AGGREGATE(15,6,ROW($A$1:$A$49)/ISNUMBER('Access Reg'!$I$1:$I$49),ROW(J32))),\"\")","v":""},{"$f":"IFERROR(INDEX('Access Reg'!D$1:D$49,_xlfn.AGGREGATE(15,6,ROW($A$1:$A$49)/ISNUMBER('Access Reg'!$I$1:$I$49),ROW(K32))),\"\")","v":""},{"$f":"IFERROR(INDEX('Access Reg'!F$1:F$49,_xlfn.AGGREGATE(15,6,ROW($A$1:$A$49)/ISNUMBER('Access Reg'!$I$1:$I$49),ROW(K32))),\"\")","v":""},{"$f":"MAX(IF('Access Reg'!$F$1:$F$49=POB!E33,'Access Reg'!$G$1:$G$49))","v":"00:00:00"},null,null,null,null,null,null,{"$f":"'Access Reg'!F45","v":0}]
[{"$f":"IFERROR(INDEX('Access Reg'!A$1:A$49,_xlfn.AGGREGATE(15,6,ROW($A$1:$A$49)/ISNUMBER('Access Reg'!$I$1:$I$49),ROW(H33))),\"\")","v":""},{"$f":"IFERROR(INDEX('Access Reg'!B$1:B$49,_xlfn.AGGREGATE(15,6,ROW($A$1:$A$49)/ISNUMBER('Access Reg'!$I$1:$I$49),ROW(I33))),\"\")","v":""},{"$f":"IFERROR(INDEX('Access Reg'!C$1:C$49,_xlfn.AGGREGATE(15,6,ROW($A$1:$A$49)/ISNUMBER('Access Reg'!$I$1:$I$49),ROW(J33))),\"\")","v":""},{"$f":"IFERROR(INDEX('Access Reg'!D$1:D$49,_xlfn.AGGREGATE(15,6,ROW($A$1:$A$49)/ISNUMBER('Access Reg'!$I$1:$I$49),ROW(K33))),\"\")","v":""},{"$f":"IFERROR(INDEX('Access Reg'!F$1:F$49,_xlfn.AGGREGATE(15,6,ROW($A$1:$A$49)/ISNUMBER('Access Reg'!$I$1:$I$49),ROW(K33))),\"\")","v":""},{"$f":"MAX(IF('Access Reg'!$F$1:$F$49=POB!E34,'Access Reg'!$G$1:$G$49))","v":"00:00:00"},null,null,null,null,null,null,{"$f":"'Access Reg'!F46","v":0}]
[{"$f":"IFERROR(INDEX('Access Reg'!A$1:A$49,_xlfn.AGGREGATE(15,6,ROW($A$1:$A$49)/ISNUMBER('Access Reg'!$I$1:$I$49),ROW(H34))),\"\")","v":""},{"$f":"IFERROR(INDEX('Access Reg'!B$1:B$49,_xlfn.AGGREGATE(15,6,ROW($A$1:$A$49)/ISNUMBER('Access Reg'!$I$1:$I$49),ROW(I34))),\"\")","v":""},{"$f":"IFERROR(INDEX('Access Reg'!C$1:C$49,_xlfn.AGGREGATE(15,6,ROW($A$1:$A$49)/ISNUMBER('Access Reg'!$I$1:$I$49),ROW(J34))),\"\")","v":""},{"$f":"IFERROR(INDEX('Access Reg'!D$1:D$49,_xlfn.AGGREGATE(15,6,ROW($A$1:$A$49)/ISNUMBER('Access Reg'!$I$1:$I$49),ROW(K34))),\"\")","v":""},{"$f":"IFERROR(INDEX('Access Reg'!F$1:F$49,_xlfn.AGGREGATE(15,6,ROW($A$1:$A$49)/ISNUMBER('Access Reg'!$I$1:$I$49),ROW(K34))),\"\")","v":""},{"$f":"MAX(IF('Access Reg'!$F$1:$F$49=POB!E35,'Access Reg'!$G$1:$G$49))","v":"00:00:00"},null,null,null,null,null,null,{"$f":"'Access Reg'!F47","v":0}]
[{"$f":"IFERROR(INDEX('Access Reg'!A$1:A$49,_xlfn.AGGREGATE(15,6,ROW($A$1:$A$49)/ISNUMBER('Access Reg'!$I$1:$I$49),ROW(H35))),\"\")","v":""},{"$f":"IFERROR(INDEX('Access Reg'!B$1:B$49,_xlfn.AGGREGATE(15,6,ROW($A$1:$A$49)/ISNUMBER('Access Reg'!$I$1:$I$49),ROW(I35))),\"\")","v":""},{"$f":"IFERROR(INDEX('Access Reg'!C$1:C$49,_xlfn.AGGREGATE(15,6,ROW($A$1:$A$49)/ISNUMBER('Access Reg'!$I$1:$I$49),ROW(J35))),\"\")","v":""},{"$f":"IFERROR(INDEX('Access Reg'!D$1:D$49,_xlfn.AGGREGATE(15,6,ROW($A$1:$A$49)/ISNUMBER('Access Reg'!$I$1:$I$49),ROW(K35))),\"\")","v":""},{"$f":"IFERROR(INDEX('Access Reg'!F$1:F$49,_xlfn.AGGREGATE(15,6,ROW($A$1:$A$49)/ISNUMBER('Access Reg'!$I$1:$I$49),ROW(K35))),\"\")","v":""},{"$f":"MAX(IF('Access Reg'!$F$1:$F$49=POB!E36,'Access Reg'!$G$1:$G$49))","v":"00:00:00"},null,null,null,null,null,null,{"$f":"'Access Reg'!F48","v":0}]
[{"$f":"IFERROR(INDEX('Access Reg'!A$1:A$49,_xlfn.AGGREGATE(15,6,ROW($A$1:$A$49)/ISNUMBER('Access Reg'!$I$1:$I$49),ROW(H36))),\"\")","v":""},{"$f":"IFERROR(INDEX('Access Reg'!B$1:B$49,_xlfn.AGGREGATE(15,6,ROW($A$1:$A$49)/ISNUMBER('Access Reg'!$I$1:$I$49),ROW(I36))),\"\")","v":""},{"$f":"IFERROR(INDEX('Access Reg'!C$1:C$49,_xlfn.AGGREGATE(15,6,ROW($A$1:$A$49)/ISNUMBER('Access Reg'!$I$1:$I$49),ROW(J36))),\"\")","v":""},{"$f":"IFERROR(INDEX('Access Reg'!D$1:D$49,_xlfn.AGGREGATE(15,6,ROW($A$1:$A$49)/ISNUMBER('Access Reg'!$I$1:$I$49),ROW(K36))),\"\")","v":""},{"$f":"IFERROR(INDEX('Access Reg'!F$1:F$49,_xlfn.AGGREGATE(15,6,ROW($A$1:$A$49)/ISNUMBER('Access Reg'!$I$1:$I$49),ROW(K36))),\"\")","v":""},{"$f":"MAX(IF('Access Reg'!$F$1:$F$49=POB!E37,'Access Reg'!$G$1:$G$49))","v":"00:00:00"},null,null,null,null,null,null,{"$f":"'Access Reg'!F49","v":0}]
[{"$f":"IFERROR(INDEX('Access Reg'!A$1:A$49,_xlfn.AGGREGATE(15,6,ROW($A$1:$A$49)/ISNUMBER('Access Reg'!$I$1:$I$49),ROW(H37))),\"\")","v":""},{"$f":"IFERROR(INDEX('Access Reg'!B$1:B$49,_xlfn.AGGREGATE(15,6,ROW($A$1:$A$49)/ISNUMBER('Access Reg'!$I$1:$I$49),ROW(I37))),\"\")","v":""},{"$f":"IFERROR(INDEX('Access Reg'!C$1:C$49,_xlfn.AGGREGATE(15,6,ROW($A$1:$A$49)/ISNUMBER('Access Reg'!$I$1:$I$49),ROW(J37))),\"\")","v":""},{"$f":"IFERROR(INDEX('Access Reg'!D$1:D$49,_xlfn.AGGREGATE(15,6,ROW($A$1:$A$49)/ISNUMBER('Access Reg'!$I$1:$I$49),ROW(K37))),\"\")","v":""},{"$f":"IFERROR(INDEX('Access Reg'!F$1:F$49,_xlfn.AGGREGATE(15,6,ROW($A$1:$A$49)/ISNUMBER('Access Reg'!$I$1:$I$49),ROW(K37))),\"\")","v":""},{"$f":"MAX(IF('Access Reg'!$F$1:$F$49=POB!E38,'Access Reg'!$G$1:$G$49))","v":"00:00:00"},null,null,null,null,null,null,{"$f":"'Access Reg'!#REF!","v":{"$error":"#REF!"}}]
[{"$f":"IFERROR(INDEX('Access Reg'!A$1:A$49,_xlfn.AGGREGATE(15,6,ROW($A$1:$A$49)/ISNUMBER('Access Reg'!$I$1:$I$49),ROW(H38))),\"\")","v":""},{"$f":"IFERROR(INDEX('Access Reg'!B$1:B$49,_xlfn.AGGREGATE(15,6,ROW($A$1:$A$49)/ISNUMBER('Access Reg'!$I$1:$I$49),ROW(I38))),\"\")","v":""},{"$f":"IFERROR(INDEX('Access Reg'!C$1:C$49,_xlfn.AGGREGATE(15,6,ROW($A$1:$A$49)/ISNUMBER('Access Reg'!$I$1:$I$49),ROW(J38))),\"\")","v":""},{"$f":"IFERROR(INDEX('Access Reg'!D$1:D$49,_xlfn.AGGREGATE(15,6,ROW($A$1:$A$49)/ISNUMBER('Access Reg'!$I$1:$I$49),ROW(K38))),\"\")","v":""},{"$f":"IFERROR(INDEX('Access Reg'!F$1:F$49,_xlfn.AGGREGATE(15,6,ROW($A$1:$A$49)/ISNUMBER('Access Reg'!$I$1:$I$49),ROW(K38))),\"\")","v":""},{"$f":"MAX(IF('Access Reg'!$F$1:$F$49=POB!E39,'Access Reg'!$G$1:$G$49))","v":"00:00:00"},null,null,null,null,null,null,{"$f":"'Access Reg'!#REF!","v":{"$error":"#REF!"}}]
[{"$f":"IFERROR(INDEX('Access Reg'!A$1:A$49,_xlfn.AGGREGATE(15,6,ROW($A$1:$A$49)/ISNUMBER('Access Reg'!$I$1:$I$49),ROW(H39))),\"\")","v":""},{"$f":"IFERROR(INDEX('Access Reg'!B$1:B$49,_xlfn.AGGREGATE(15,6,ROW($A$1:$A$49)/ISNUMBER('Access Reg'!$I$1:$I$49),ROW(I39))),\"\")","v":""},{"$f":"IFERROR(INDEX('Access Reg'!C$1:C$49,_xlfn.AGGREGATE(15,6,ROW($A$1:$A$49)/ISNUMBER('Access Reg'!$I$1:$I$49),ROW(J39))),\"\")","v":""},{"$f":"IFERROR(INDEX('Access Reg'!D$1:D$49,_xlfn.AGGREGATE(15,6,ROW($A$1:$A$49)/ISNUMBER('Access Reg'!$I$1:$I$49),ROW(K39))),\"\")","v":""},{"$f":"IFERROR(INDEX('Access Reg'!F$1:F$49,_xlfn.AGGREGATE(15,6,ROW($A$1:$A$49)/ISNUMBER('Access Reg'!$I$1:$I$49),ROW(K39))),\"\")","v":""},{"$f":"MAX(IF('Access Reg'!$F$1:$F$49=POB!E40,'Access Reg'!$G$1:$G$49))","v":"00:00:00"},null,null,null,null,null,null,{"$f":"'Access Reg'!#REF!","v":{"$error":"#REF!"}}]
[{"$f":"IFERROR(INDEX('Access Reg'!A$1:A$49,_xlfn.AGGREGATE(15,6,ROW($A$1:$A$49)/ISNUMBER('Access Reg'!$I$1:$I$49),ROW(H40))),\"\")","v":""},{"$f":"IFERROR(INDEX('Access Reg'!B$1:B$49,_xlfn.AGGREGATE(15,6,ROW($A$1:$A$49)/ISNUMBER('Access Reg'!$I$1:$I$49),ROW(I40))),\"\")","v":""},{"$f":"IFERROR(INDEX('Access Reg'!C$1:C$49,_xlfn.AGGREGATE(15,6,ROW($A$1:$A$49)/ISNUMBER('Access Reg'!$I$1:$I$49),ROW(J40))),\"\")","v":""},{"$f":"IFERROR(INDEX('Access Reg'!D$1:D$49,_xlfn.AGGREGATE(15,6,ROW($A$1:$A$49)/ISNUMBER('Access Reg'!$I$1:$I$49),ROW(K40))),\"\")","v":""},{"$f":"IFERROR(INDEX('Access Reg'!F$1:F$49,_xlfn.AGGREGATE(15,6,ROW($A$1:$A$49)/ISNUMBER('Access Reg'!$I$1:$I$49),ROW(K40))),\"\")","v":""},{"$f":"MAX(IF('Access Reg'!$F$1:$F$49=POB!E41,'Access Reg'!$G$1:$G$49))","v":"00:00:00"},null,null,null,null,null,null,{"$f":"'Access Reg'!#REF!","v":{"$error":"#REF!"}}]
[{"$f":"IFERROR(INDEX('Access Reg'!A$1:A$49,_xlfn.AGGREGATE(15,6,ROW($A$1:$A$49)/ISNUMBER('Access Reg'!$I$1:$I$49),ROW(H41))),\"\")","v":""},{"$f":"IFERROR(INDEX('Access Reg'!B$1:B$49,_xlfn.AGGREGATE(15,6,ROW($A$1:$A$49)/ISNUMBER('Access Reg'!$I$1:$I$49),ROW(I41))),\"\")","v":""},{"$f":"IFERROR(INDEX('Access Reg'!C$1:C$49,_xlfn.AGGREGATE(15,6,ROW($A$1:$A$49)/ISNUMBER('Access Reg'!$I$1:$I$49),ROW(J41))),\"\")","v":""},{"$f":"IFERROR(INDEX('Access Reg'!D$1:D$49,_xlfn.AGGREGATE(15,6,ROW($A$1:$A$49)/ISNUMBER('Access Reg'!$I$1:$I$49),ROW(K41))),\"\")","v":""},{"$f":"IFERROR(INDEX('Access Reg'!F$1:F$49,_xlfn.AGGREGATE(15,6,ROW($A$1:$A$49)/ISNUMBER('Access Reg'!$I$1:$I$49),ROW(K41))),\"\")","v":""},{"$f":"MAX(IF('Access Reg'!$F$1:$F$49=POB!E42,'Access Reg'!$G$1:$G$49))","v":"00:00:00"},null,null,null,null,null,null,{"$f":"'Access Reg'!#REF!","v":{"$error":"#REF!"}}]
[{"$f":"IFERROR(INDEX('Access Reg'!A$1:A$49,_xlfn.AGGREGATE(15,6,ROW($A$1:$A$49)/ISNUMBER('Access Reg'!$I$1:$I$49),ROW(H42))),\"\")","v":""},{"$f":"IFERROR(INDEX('Access Reg'!B$1:B$49,_xlfn.AGGREGATE(15,6,ROW($A$1:$A$49)/ISNUMBER('Access Reg'!$I$1:$I$49),ROW(I42))),\"\")","v":""},{"$f":"IFERROR(INDEX('Access Reg'!C$1:C$49,_xlfn.AGGREGATE(15,6,ROW($A$1:$A$49)/ISNUMBER('Access Reg'!$I$1:$I$49),ROW(J42))),\"\")","v":""},{"$f":"IFERROR(INDEX('Access Reg'!D$1:D$49,_xlfn.AGGREGATE(15,6,ROW($A$1:$A$49)/ISNUMBER('Access Reg'!$I$1:$I$49),ROW(K42))),\"\")","v":""},{"$f":"IFERROR(INDEX('Access Reg'!F$1:F$49,_xlfn.AGGREGATE(15,6,ROW($A$1:$A$49)/ISNUMBER('Access Reg'!$I$1:$I$49),ROW(K42))),\"\")","v":""},{"$f":"MAX(IF('Access Reg'!$F$1:$F$49=POB!E43,'Access Reg'!$G$1:$G$49))","v":"00:00:00"},null,null,null,null,null,null,{"$f":"'Access Reg'!#REF!","v":{"$error":"#REF!"}}]
[{"$f":"IFERROR(INDEX('Access Reg'!A$1:A$49,_xlfn.AGGREGATE(15,6,ROW($A$1:$A$49)/ISNUMBER('Access Reg'!$I$1:$I$49),ROW(H43))),\"\")","v":""},{"$f":"IFERROR(INDEX('Access Reg'!B$1:B$49,_xlfn.AGGREGATE(15,6,ROW($A$1:$A$49)/ISNUMBER('Access Reg'!$I$1:$I$49),ROW(I43))),\"\")","v":""},{"$f":"IFERROR(INDEX('Access Reg'!C$1:C$49,_xlfn.AGGREGATE(15,6,ROW($A$1:$A$49)/ISNUMBER('Access Reg'!$I$1:$I$49),ROW(J43))),\"\")","v":""},{"$f":"IFERROR(INDEX('Access Reg'!D$1:D$49,_xlfn.AGGREGATE(15,6,ROW($A$1:$A$49)/ISNUMBER('Access Reg'!$I$1:$I$49),ROW(K43))),\"\")","v":""},{"$f":"IFERROR(INDEX('Access Reg'!F$1:F$49,_xlfn.AGGREGATE(15,6,ROW($A$1:$A$49)/ISNUMBER('Access Reg'!$I$1:$I$49),ROW(K43))),\"\")","v":""},{"$f":"MAX(IF('Access Reg'!$F$1:$F$49=POB!E44,'Access Reg'!$G$1:$G$49))","v":"00:00:00"},null,null,null,null,null,null,{"$f":"'Access Reg'!#REF!","v":{"$error":"#REF!"}}]
[{"$f":"IFERROR(INDEX('Access Reg'!A$1:A$49,_xlfn.AGGREGATE(15,6,ROW($A$1:$A$49)/ISNUMBER('Access Reg'!$I$1:$I$49),ROW(H44))),\"\")","v":""},{"$f":"IFERROR(INDEX('Access Reg'!B$1:B$49,_xlfn.AGGREGATE(15,6,ROW($A$1:$A$49)/ISNUMBER('Access Reg'!$I$1:$I$49),ROW(I44))),\"\")","v":""},{"$f":"IFERROR(INDEX('Access Reg'!C$1:C$49,_xlfn.AGGREGATE(15,6,ROW($A$1:$A$49)/ISNUMBER('Access Reg'!$I$1:$I$49),ROW(J44))),\"\")","v":""},{"$f":"IFERROR(INDEX('Access Reg'!D$1:D$49,_xlfn.AGGREGATE(15,6,ROW($A$1:$A$49)/ISNUMBER('Access Reg'!$I$1:$I$49),ROW(K44))),\"\")","v":""},{"$f":"IFERROR(INDEX('Access Reg'!F$1:F$49,_xlfn.AGGREGATE(15,6,ROW($A$1:$A$49)/ISNUMBER('Access Reg'!$I$1:$I$49),ROW(K44))),\"\")","v":""},{"$f":"MAX(IF('Access Reg'!$F$1:$F$49=POB!E45,'Access Reg'!$G$1:$G$49))","v":"00:00:00"},null,null,null,null,null,null,{"$f":"'Access Reg'!#REF!","v":{"$error":"#REF!"}}]
[{"$f":"IFERROR(INDEX('Access Reg'!A$1:A$49,_xlfn.AGGREGATE(15,6,ROW($A$1:$A$49)/ISNUMBER('Access Reg'!$I$1:$I$49),ROW(H45))),\"\")","v":""},{"$f":"IFERROR(INDEX('Access Reg'!B$1:B$49,_xlfn.AGGREGATE(15,6,ROW($A$1:$A$49)/ISNUMBER('Access Reg'!$I$1:$I$49),ROW(I45))),\"\")","v":""},{"$f":"IFERROR(INDEX('Access Reg'!C$1:C$49,_xlfn.AGGREGATE(15,6,ROW($A$1:$A$49)/ISNUMBER('Access Reg'!$I$1:$I$49),ROW(J45))),\"\")","v":""},{"$f":"IFERROR(INDEX('Access Reg'!D$1:D$49,_xlfn.AGGREGATE(15,6,ROW($A$1:$A$49)/ISNUMBER('Access Reg'!$I$1:$I$49),ROW(K45))),\"\")","v":""},{"$f":"IFERROR(INDEX('Access Reg'!F$1:F$49,_xlfn.AGGREGATE(15,6,ROW($A$1:$A$49)/ISNUMBER('Access Reg'!$I$1:$I$49),ROW(K45))),\"\")","v":""},{"$f":"MAX(IF('Access Reg'!$F$1:$F$49=POB!E46,'Access Reg'!$G$1:$G$49))","v":"00:00:00"},null,null,null,null,null,null,{"$f":"'Access Reg'!#REF!","v":{"$error":"#REF!"}}]
[{"$f":"IFERROR(INDEX('Access Reg'!A$1:A$49,_xlfn.AGGREGATE(15,6,ROW($A$1:$A$49)/ISNUMBER('Access Reg'!$I$1:$I$49),ROW(H46))),\"\")","v":""},{"$f":"IFERROR(INDEX('Access Reg'!B$1:B$49,_xlfn.AGGREGATE(15,6,ROW($A$1:$A$49)/ISNUMBER('Access Reg'!$I$1:$I$49),ROW(I46))),\"\")","v":""},{"$f":"IFERROR(INDEX('Access Reg'!C$1:C$49,_xlfn.AGGREGATE(15,6,ROW($A$1:$A$49)/ISNUMBER('Access Reg'!$I$1:$I$49),ROW(J46))),\"\")","v":""},{"$f":"IFERROR(INDEX('Access Reg'!D$1:D$49,_xlfn.AGGREGATE(15,6,ROW($A$1:$A$49)/ISNUMBER('Access Reg'!$I$1:$I$49),ROW(K46))),\"\")","v":""},{"$f":"IFERROR(INDEX('Access Reg'!F$1:F$49,_xlfn.AGGREGATE(15,6,ROW($A$1:$A$49)/ISNUMBER('Access Reg'!$I$1:$I$49),ROW(K46))),\"\")","v":""},{"$f":"MAX(IF('Access Reg'!$F$1:$F$49=POB!E47,'Access Reg'!$G$1:$G$49))","v":"00:00:00"},null,null,null,null,null,null,{"$f":"'Access Reg'!#REF!","v":{"$error":"#REF!"}}]
[{"$f":"IFERROR(INDEX('Access Reg'!A$1:A$49,_xlfn.AGGREGATE(15,6,ROW($A$1:$A$49)/ISNUMBER('Access Reg'!$I$1:$I$49),ROW(H47))),\"\")","v":""},{"$f":"IFERROR(INDEX('Access Reg'!B$1:B$49,_xlfn.AGGREGATE(15,6,ROW($A$1:$A$49)/ISNUMBER('Access Reg'!$I$1:$I$49),ROW(I47))),\"\")","v":""},{"$f":"IFERROR(INDEX('Access Reg'!C$1:C$49,_xlfn.AGGREGATE(15,6,ROW($A$1:$A$49)/ISNUMBER('Access Reg'!$I$1:$I$49),ROW(J47))),\"\")","v":""},{"$f":"IFERROR(INDEX('Access Reg'!D$1:D$49,_xlfn.AGGREGATE(15,6,ROW($A$1:$A$49)/ISNUMBER('Access Reg'!$I$1:$I$49),ROW(K47))),\"\")","v":""},{"$f":"IFERROR(INDEX('Access Reg'!F$1:F$49,_xlfn.AGGREGATE(15,6,ROW($A$1:$A$49)/ISNUMBER('Access Reg'!$I$1:$I$49),ROW(K47))),\"\")","v":""},{"$f":"MAX(IF('Access Reg'!$F$1:$F$49=POB!E48,'Access Reg'!$G$1:$G$49))","v":"00:00:00"},null,null,null,null,null,null,{"$f":"'Access Reg'!#REF!","v":{"$error":"#REF!"}}]
[{"$f":"IFERROR(INDEX('Access Reg'!A$1:A$49,_xlfn.AGGREGATE(15,6,ROW($A$1:$A$49)/ISNUMBER('Access Reg'!$I$1:$I$49),ROW(H48))),\"\")","v":""},{"$f":"IFERROR(INDEX('Access Reg'!B$1:B$49,_xlfn.AGGREGATE(15,6,ROW($A$1:$A$49)/ISNUMBER('Access Reg'!$I$1:$I$49),ROW(I48))),\"\")","v":""},{"$f":"IFERROR(INDEX('Access Reg'!C$1:C$49,_xlfn.AGGREGATE(15,6,ROW($A$1:$A$49)/ISNUMBER('Access Reg'!$I$1:$I$49),ROW(J48))),\"\")","v":""},{"$f":"IFERROR(INDEX('Access Reg'!D$1:D$49,_xlfn.AGGREGATE(15,6,ROW($A$1:$A$49)/ISNUMBER('Access Reg'!$I$1:$I$49),ROW(K48))),\"\")","v":""},{"$f":"IFERROR(INDEX('Access Reg'!F$1:F$49,_xlfn.AGGREGATE(15,6,ROW($A$1:$A$49)/ISNUMBER('Access Reg'!$I$1:$I$49),ROW(K48))),\"\")","v":""},{"$f":"MAX(IF('Access Reg'!$F$1:$F$49=POB!E49,'Access Reg'!$G$1:$G$49))","v":"00:00:00"},null,null,null,null,null,null,{"$f":"'Access Reg'!#REF!","v":{"$error":"#REF!"}}]

{"sheet":"Database","index":1,"n_rows":13,"n_cols":5,"rows_kept":13,"cut":false,"hidden":false,"merged":[]}
["Last name","First name","Agency code","Organization","Card number"]
["Иванов","Алексей",11111,"COMP",10383028]
["Смирнов","Артём",11112,"COMP",10377298]
["Кузнецов","Вадим",11113,"COMP",10372258]
["Попов","Владимир",11114,"COMP",10377263]
["Васильев","Валентин",11115,"COMP",13109388]
["Петров","Данил",11116,"COMP",13107363]
["Соколов","Денис",11117,"COMP",10389621]
["Михайлов","Дмитрий",11118,"COMP",10379363]
["Новиков","Егор",11119,"COMP",10414889]
["Фёдоров","Кирилл",11120,"COMP",10379579]
["Морозов","Леонид",11121,"COMP",10378815]
["Волков","Максим",11122,"COMP",13108908]

{"sheet":"Access Reg","index":2,"n_rows":49,"n_cols":16,"rows_kept":49,"cut":false,"hidden":false,"merged":[[0,11,0,13]]}
["Last name","First name","Badge Number","Organization",null,"Card number","Date/Time",null,null,null,"IN/OUT",{"$f":"SUMPRODUCT(--(LEN(TRIM(POB!E:E))>0))-1","v":5},null,null,"Current Time",{"$f":"NOW()","v":"2020-08-29T07:54:47.410"}]
[{"$f":"IFERROR(IF(F2=\"\",\"\",INDEX(Database!A:A,MATCH('Access Reg'!F2,Database!E:E,0))),\"\")","v":"Михайлов"},{"$f":"IFERROR(IF(F2=\"\",\"\",INDEX(Database!B:B,MATCH('Access Reg'!F2,Database!E:E,0))),\"\")","v":"Дмитрий"},{"$f":"IFERROR(IF(G2=\"\",\"\",INDEX(Database!C:C,MATCH('Access Reg'!F2,Database!E:E,0))),\"\")","v":11118},{"$f":"IFERROR(IF(F2=\"\",\"\",INDEX(Database!D:D,MATCH('Access Reg'!F2,Database!E:E,0))),\"\")","v":"COMP"},null,10379363,{"$f":"IF(F2<>\"\",IF(G2=\"\",NOW(),G2),\"\")","v":"2020-08-29T07:35:13.530"},null,{"$f":"IF(COUNTIF(F$2:F2,F2)>1,\"\",IF(ISODD(COUNTIF(F$2:F$49,F2)),COUNTIF(F$2:F$49,F2),\"\"))","v":1},null,{"$f":"IF(F2=\"\",\"\",IF(ISODD(COUNTIF($F$2:F2,F2)),\"In\",\"Out\"))","v":"In"}]
[{"$f":"IFERROR(IF(F3=\"\",\"\",INDEX(Database!A:A,MATCH('Access Reg'!F3,Database!E:E,0))),\"\")","v":"Петров"},{"$f":"IFERROR(IF(F3=\"\",\"\",INDEX(Database!B:B,MATCH('Access Reg'!F3,Database!E:E,0))),\"\")","v":"Данил"},{"$f":"IFERROR(IF(G3=\"\",\"\",INDEX(Database!C:C,MATCH('Access Reg'!F3,Database!E:E,0))),\"\")","v":11116},{"$f":"IFERROR(IF(F3=\"\",\"\",INDEX(Database!D:D,MATCH('Access Reg'!F3,Database!E:E,0))),\"\")","v":"COMP"},null,13107363,{"$f":"IF(F3<>\"\",IF(G3=\"\",NOW(),G3),\"\")","v":"2020-08-29T07:35:13.530"},null,{"$f":"IF(COUNTIF(F$2:F3,F3)>1,\"\",IF(ISODD(COUNTIF(F$2:F$49,F3)),COUNTIF(F$2:F$49,F3),\"\"))","v":""},null,{"$f":"IF(F3=\"\",\"\",IF(ISODD(COUNTIF($F$2:F3,F3)),\"In\",\"Out\"))","v":"In"}]
[{"$f":"IFERROR(IF(F4=\"\",\"\",INDEX(Database!A:A,MATCH('Access Reg'!F4,Database!E:E,0))),\"\")","v":"Соколов"},{"$f":"IFERROR(IF(F4=\"\",\"\",INDEX(Database!B:B,MATCH('Access Reg'!F4,Database!E:E,0))),\"\")","v":"Денис"},{"$f":"IFERROR(IF(G4=\"\",\"\",INDEX(Database!C:C,MATCH('Access Reg'!F4,Database!E:E,0))),\"\")","v":11117},{"$f":"IFERROR(IF(F4=\"\",\"\",INDEX(Database!D:D,MATCH('Access Reg'!F4,Database!E:E,0))),\"\")","v":"COMP"},null,10389621,"2020-08-29T07:35:52.850",null,{"$f":"IF(COUNTIF(F$2:F4,F4)>1,\"\",IF(ISODD(COUNTIF(F$2:F$49,F4)),COUNTIF(F$2:F$49,F4),\"\"))","v":1},null,{"$f":"IF(F4=\"\",\"\",IF(ISODD(COUNTIF($F$2:F4,F4)),\"In\",\"Out\"))","v":"In"}]
[{"$f":"IFERROR(IF(F5=\"\",\"\",INDEX(Database!A:A,MATCH('Access Reg'!F5,Database!E:E,0))),\"\")","v":"Новиков"},{"$f":"IFERROR(IF(F5=\"\",\"\",INDEX(Database!B:B,MATCH('Access Reg'!F5,Database!E:E,0))),\"\")","v":"Егор"},{"$f":"IFERROR(IF(G5=\"\",\"\",INDEX(Database!C:C,MATCH('Access Reg'!F5,Database!E:E,0))),\"\")","v":11119},{"$f":"IFERROR(IF(F5=\"\",\"\",INDEX(Database!D:D,MATCH('Access Reg'!F5,Database!E:E,0))),\"\")","v":"COMP"},null,10414889,"2020-08-29T07:36:49.170",null,{"$f":"IF(COUNTIF(F$2:F5,F5)>1,\"\",IF(ISODD(COUNTIF(F$2:F$49,F5)),COUNTIF(F$2:F$49,F5),\"\"))","v":""},null,{"$f":"IF(F5=\"\",\"\",IF(ISODD(COUNTIF($F$2:F5,F5)),\"In\",\"Out\"))","v":"In"}]
[{"$f":"IFERROR(IF(F6=\"\",\"\",INDEX(Database!A:A,MATCH('Access Reg'!F6,Database!E:E,0))),\"\")","v":""},{"$f":"IFERROR(IF(F6=\"\",\"\",INDEX(Database!B:B,MATCH('Access Reg'!F6,Database!E:E,0))),\"\")","v":""},{"$f":"IFERROR(IF(G6=\"\",\"\",INDEX(Database!C:C,MATCH('Access Reg'!F6,Database!E:E,0))),\"\")","v":""},{"$f":"IFERROR(IF(F6=\"\",\"\",INDEX(Database!D:D,MATCH('Access Reg'!F6,Database!E:E,0))),\"\")","v":""},null,1100346948930350,"2020-08-29T07:46:45.830",null,{"$f":"IF(COUNTIF(F$2:F6,F6)>1,\"\",IF(ISODD(COUNTIF(F$2:F$49,F6)),COUNTIF(F$2:F$49,F6),\"\"))","v":1},null,{"$f":"IF(F6=\"\",\"\",IF(ISODD(COUNTIF($F$2:F6,F6)),\"In\",\"Out\"))","v":"In"}]
[{"$f":"IFERROR(IF(F7=\"\",\"\",INDEX(Database!A:A,MATCH('Access Reg'!F7,Database!E:E,0))),\"\")","v":"Новиков"},{"$f":"IFERROR(IF(F7=\"\",\"\",INDEX(Database!B:B,MATCH('Access Reg'!F7,Database!E:E,0))),\"\")","v":"Егор"},{"$f":"IFERROR(IF(G7=\"\",\"\",INDEX(Database!C:C,MATCH('Access Reg'!F7,Database!E:E,0))),\"\")","v":11119},{"$f":"IFERROR(IF(F7=\"\",\"\",INDEX(Database!D:D,MATCH('Access Reg'!F7,Database!E:E,0))),\"\")","v":"COMP"},null,10414889,"2020-08-29T07:47:00.750",null,{"$f":"IF(COUNTIF(F$2:F7,F7)>1,\"\",IF(ISODD(COUNTIF(F$2:F$49,F7)),COUNTIF(F$2:F$49,F7),\"\"))","v":""},null,{"$f":"IF(F7=\"\",\"\",IF(ISODD(COUNTIF($F$2:F7,F7)),\"In\",\"Out\"))","v":"Out"}]
[{"$f":"IFERROR(IF(F8=\"\",\"\",INDEX(Database!A:A,MATCH('Access Reg'!F8,Database!E:E,0))),\"\")","v":""},{"$f":"IFERROR(IF(F8=\"\",\"\",INDEX(Database!B:B,MATCH('Access Reg'!F8,Database!E:E,0))),\"\")","v":""},{"$f":"IFERROR(IF(G8=\"\",\"\",INDEX(Database!C:C,MATCH('Access Reg'!F8,Database!E:E,0))),\"\")","v":""},{"$f":"IFERROR(IF(F8=\"\",\"\",INDEX(Database!D:D,MATCH('Access Reg'!F8,Database!E:E,0))),\"\")","v":""},null,104983341,"2020-08-29T07:47:12.660",null,{"$f":"IF(COUNTIF(F$2:F8,F8)>1,\"\",IF(ISODD(COUNTIF(F$2:F$49,F8)),COUNTIF(F$2:F$49,F8),\"\"))","v":1},null,{"$f":"IF(F8=\"\",\"\",IF(ISODD(COUNTIF($F$2:F8,F8)),\"In\",\"Out\"))","v":"In"}]
[{"$f":"IFERROR(IF(F9=\"\",\"\",INDEX(Database!A:A,MATCH('Access Reg'!F9,Database!E:E,0))),\"\")","v":""},{"$f":"IFERROR(IF(F9=\"\",\"\",INDEX(Database!B:B,MATCH('Access Reg'!F9,Database!E:E,0))),\"\")","v":""},{"$f":"IFERROR(IF(G9=\"\",\"\",INDEX(Database!C:C,MATCH('Access Reg'!F9,Database!E:E,0))),\"\")","v":""},{"$f":"IFERROR(IF(F9=\"\",\"\",INDEX(Database!D:D,MATCH('Access Reg'!F9,Database!E:E,0))),\"\")","v":""},null,364905,"2020-08-29T07:47:12.660",null,{"$f":"IF(COUNTIF(F$2:F9,F9)>1,\"\",IF(ISODD(COUNTIF(F$2:F$49,F9)),COUNTIF(F$2:F$49,F9),\"\"))","v":1},null,{"$f":"IF(F9=\"\",\"\",IF(ISODD(COUNTIF($F$2:F9,F9)),\"In\",\"Out\"))","v":"In"}]
[{"$f":"IFERROR(IF(F10=\"\",\"\",INDEX(Database!A:A,MATCH('Access Reg'!F10,Database!E:E,0))),\"\")","v":"Петров"},{"$f":"IFERROR(IF(F10=\"\",\"\",INDEX(Database!B:B,MATCH('Access Reg'!F10,Database!E:E,0))),\"\")","v":"Данил"},{"$f":"IFERROR(IF(G10=\"\",\"\",INDEX(Database!C:C,MATCH('Access Reg'!F10,Database!E:E,0))),\"\")","v":11116},{"$f":"IFERROR(IF(F10=\"\",\"\",INDEX(Database!D:D,MATCH('Access Reg'!F10,Database!E:E,0))),\"\")","v":"COMP"},null,13107363,"2020-08-29T07:47:24.090",null,{"$f":"IF(COUNTIF(F$2:F10,F10)>1,\"\",IF(ISODD(COUNTIF(F$2:F$49,F10)),COUNTIF(F$2:F$49,F10),\"\"))","v":""},null,{"$f":"IF(F10=\"\",\"\",IF(ISODD(COUNTIF($F$2:F10,F10)),\"In\",\"Out\"))","v":"Out"}]
[{"$f":"IFERROR(IF(F11=\"\",\"\",INDEX(Database!A:A,MATCH('Access Reg'!F11,Database!E:E,0))),\"\")","v":"Новиков"},{"$f":"IFERROR(IF(F11=\"\",\"\",INDEX(Database!B:B,MATCH('Access Reg'!F11,Database!E:E,0))),\"\")","v":"Егор"},{"$f":"IFERROR(IF(G11=\"\",\"\",INDEX(Database!C:C,MATCH('Access Reg'!F11,Database!E:E,0))),\"\")","v":11119},{"$f":"IFERROR(IF(F11=\"\",\"\",INDEX(Database!D:D,MATCH('Access Reg'!F11,Database!E:E,0))),\"\")","v":"COMP"},null,10414889,"2020-08-29T07:47:24.090",null,{"$f":"IF(COUNTIF(F$2:F11,F11)>1,\"\",IF(ISODD(COUNTIF(F$2:F$49,F11)),COUNTIF(F$2:F$49,F11),\"\"))","v":""},null,{"$f":"IF(F11=\"\",\"\",IF(ISODD(COUNTIF($F$2:F11,F11)),\"In\",\"Out\"))","v":"In"}]
[{"$f":"IFERROR(IF(F12=\"\",\"\",INDEX(Database!A:A,MATCH('Access Reg'!F12,Database!E:E,0))),\"\")","v":"Петров"},{"$f":"IFERROR(IF(F12=\"\",\"\",INDEX(Database!B:B,MATCH('Access Reg'!F12,Database!E:E,0))),\"\")","v":"Данил"},{"$f":"IFERROR(IF(G12=\"\",\"\",INDEX(Database!C:C,MATCH('Access Reg'!F12,Database!E:E,0))),\"\")","v":11116},{"$f":"IFERROR(IF(F12=\"\",\"\",INDEX(Database!D:D,MATCH('Access Reg'!F12,Database!E:E,0))),\"\")","v":"COMP"},null,13107363,"2020-08-29T07:47:32.280",null,{"$f":"IF(COUNTIF(F$2:F12,F12)>1,\"\",IF(ISODD(COUNTIF(F$2:F$49,F12)),COUNTIF(F$2:F$49,F12),\"\"))","v":""},null,{"$f":"IF(F12=\"\",\"\",IF(ISODD(COUNTIF($F$2:F12,F12)),\"In\",\"Out\"))","v":"In"}]
[{"$f":"IFERROR(IF(F13=\"\",\"\",INDEX(Database!A:A,MATCH('Access Reg'!F13,Database!E:E,0))),\"\")","v":"Петров"},{"$f":"IFERROR(IF(F13=\"\",\"\",INDEX(Database!B:B,MATCH('Access Reg'!F13,Database!E:E,0))),\"\")","v":"Данил"},{"$f":"IFERROR(IF(G13=\"\",\"\",INDEX(Database!C:C,MATCH('Access Reg'!F13,Database!E:E,0))),\"\")","v":11116},{"$f":"IFERROR(IF(F13=\"\",\"\",INDEX(Database!D:D,MATCH('Access Reg'!F13,Database!E:E,0))),\"\")","v":"COMP"},null,13107363,"2020-08-29T07:47:54.190",null,{"$f":"IF(COUNTIF(F$2:F13,F13)>1,\"\",IF(ISODD(COUNTIF(F$2:F$49,F13)),COUNTIF(F$2:F$49,F13),\"\"))","v":""},null,{"$f":"IF(F13=\"\",\"\",IF(ISODD(COUNTIF($F$2:F13,F13)),\"In\",\"Out\"))","v":"Out"}]
[{"$f":"IFERROR(IF(F14=\"\",\"\",INDEX(Database!A:A,MATCH('Access Reg'!F14,Database!E:E,0))),\"\")","v":"Новиков"},{"$f":"IFERROR(IF(F14=\"\",\"\",INDEX(Database!B:B,MATCH('Access Reg'!F14,Database!E:E,0))),\"\")","v":"Егор"},{"$f":"IFERROR(IF(G14=\"\",\"\",INDEX(Database!C:C,MATCH('Access Reg'!F14,Database!E:E,0))),\"\")","v":11119},{"$f":"IFERROR(IF(F14=\"\",\"\",INDEX(Database!D:D,MATCH('Access Reg'!F14,Database!E:E,0))),\"\")","v":"COMP"},null,10414889,"2020-08-29T07:48:03.240",null,{"$f":"IF(COUNTIF(F$2:F14,F14)>1,\"\",IF(ISODD(COUNTIF(F$2:F$49,F14)),COUNTIF(F$2:F$49,F14),\"\"))","v":""},null,{"$f":"IF(F14=\"\",\"\",IF(ISODD(COUNTIF($F$2:F14,F14)),\"In\",\"Out\"))","v":"Out"}]
[{"$f":"IFERROR(IF(F15=\"\",\"\",INDEX(Database!A:A,MATCH('Access Reg'!F15,Database!E:E,0))),\"\")","v":""},{"$f":"IFERROR(IF(F15=\"\",\"\",INDEX(Database!B:B,MATCH('Access Reg'!F15,Database!E:E,0))),\"\")","v":""},{"$f":"IFERROR(IF(G15=\"\",\"\",INDEX(Database!C:C,MATCH('Access Reg'!F15,Database!E:E,0))),\"\")","v":""},{"$f":"IFERROR(IF(F15=\"\",\"\",INDEX(Database!D:D,MATCH('Access Reg'!F15,Database!E:E,0))),\"\")","v":""},null,null,"",null,{"$f":"IF(COUNTIF(F$2:F15,F15)>1,\"\",IF(ISODD(COUNTIF(F$2:F$49,F15)),COUNTIF(F$2:F$49,F15),\"\"))","v":""},null,{"$f":"IF(F15=\"\",\"\",IF(ISODD(COUNTIF($F$2:F15,F15)),\"In\",\"Out\"))","v":""}]
[{"$f":"IFERROR(IF(F16=\"\",\"\",INDEX(Database!A:A,MATCH('Access Reg'!F16,Database!E:E,0))),\"\")","v":""},{"$f":"IFERROR(IF(F16=\"\",\"\",INDEX(Database!B:B,MATCH('Access Reg'!F16,Database!E:E,0))),\"\")","v":""},{"$f":"IFERROR(IF(G16=\"\",\"\",INDEX(Database!C:C,MATCH('Access Reg'!F16,Database!E:E,0))),\"\")","v":""},{"$f":"IFERROR(IF(F16=\"\",\"\",INDEX(Database!D:D,MATCH('Access Reg'!F16,Database!E:E,0))),\"\")","v":""},null,null,"",null,{"$f":"IF(COUNTIF(F$2:F16,F16)>1,\"\",IF(ISODD(COUNTIF(F$2:F$49,F16)),COUNTIF(F$2:F$49,F16),\"\"))","v":""},null,{"$f":"IF(F16=\"\",\"\",IF(ISODD(COUNTIF($F$2:F16,F16)),\"In\",\"Out\"))","v":""}]
[{"$f":"IFERROR(IF(F17=\"\",\"\",INDEX(Database!A:A,MATCH('Access Reg'!F17,Database!E:E,0))),\"\")","v":""},{"$f":"IFERROR(IF(F17=\"\",\"\",INDEX(Database!B:B,MATCH('Access Reg'!F17,Database!E:E,0))),\"\")","v":""},{"$f":"IFERROR(IF(G17=\"\",\"\",INDEX(Database!C:C,MATCH('Access Reg'!F17,Database!E:E,0))),\"\")","v":""},{"$f":"IFERROR(IF(F17=\"\",\"\",INDEX(Database!D:D,MATCH('Access Reg'!F17,Database!E:E,0))),\"\")","v":""},null,null,"",null,{"$f":"IF(COUNTIF(F$2:F17,F17)>1,\"\",IF(ISODD(COUNTIF(F$2:F$49,F17)),COUNTIF(F$2:F$49,F17),\"\"))","v":""},null,{"$f":"IF(F17=\"\",\"\",IF(ISODD(COUNTIF($F$2:F17,F17)),\"In\",\"Out\"))","v":""}]
[{"$f":"IFERROR(IF(F18=\"\",\"\",INDEX(Database!A:A,MATCH('Access Reg'!F18,Database!E:E,0))),\"\")","v":""},{"$f":"IFERROR(IF(F18=\"\",\"\",INDEX(Database!B:B,MATCH('Access Reg'!F18,Database!E:E,0))),\"\")","v":""},{"$f":"IFERROR(IF(G18=\"\",\"\",INDEX(Database!C:C,MATCH('Access Reg'!F18,Database!E:E,0))),\"\")","v":""},{"$f":"IFERROR(IF(F18=\"\",\"\",INDEX(Database!D:D,MATCH('Access Reg'!F18,Database!E:E,0))),\"\")","v":""},null,null,"",null,{"$f":"IF(COUNTIF(F$2:F18,F18)>1,\"\",IF(ISODD(COUNTIF(F$2:F$49,F18)),COUNTIF(F$2:F$49,F18),\"\"))","v":""},null,{"$f":"IF(F18=\"\",\"\",IF(ISODD(COUNTIF($F$2:F18,F18)),\"In\",\"Out\"))","v":""}]
[{"$f":"IFERROR(IF(F19=\"\",\"\",INDEX(Database!A:A,MATCH('Access Reg'!F19,Database!E:E,0))),\"\")","v":""},{"$f":"IFERROR(IF(F19=\"\",\"\",INDEX(Database!B:B,MATCH('Access Reg'!F19,Database!E:E,0))),\"\")","v":""},{"$f":"IFERROR(IF(G19=\"\",\"\",INDEX(Database!C:C,MATCH('Access Reg'!F19,Database!E:E,0))),\"\")","v":""},{"$f":"IFERROR(IF(F19=\"\",\"\",INDEX(Database!D:D,MATCH('Access Reg'!F19,Database!E:E,0))),\"\")","v":""},null,null,"",null,{"$f":"IF(COUNTIF(F$2:F19,F19)>1,\"\",IF(ISODD(COUNTIF(F$2:F$49,F19)),COUNTIF(F$2:F$49,F19),\"\"))","v":""},null,{"$f":"IF(F19=\"\",\"\",IF(ISODD(COUNTIF($F$2:F19,F19)),\"In\",\"Out\"))","v":""}]
[{"$f":"IFERROR(IF(F20=\"\",\"\",INDEX(Database!A:A,MATCH('Access Reg'!F20,Database!E:E,0))),\"\")","v":""},{"$f":"IFERROR(IF(F20=\"\",\"\",INDEX(Database!B:B,MATCH('Access Reg'!F20,Database!E:E,0))),\"\")","v":""},{"$f":"IFERROR(IF(G20=\"\",\"\",INDEX(Database!C:C,MATCH('Access Reg'!F20,Database!E:E,0))),\"\")","v":""},{"$f":"IFERROR(IF(F20=\"\",\"\",INDEX(Database!D:D,MATCH('Access Reg'!F20,Database!E:E,0))),\"\")","v":""},null,null,"",null,{"$f":"IF(COUNTIF(F$2:F20,F20)>1,\"\",IF(ISODD(COUNTIF(F$2:F$49,F20)),COUNTIF(F$2:F$49,F20),\"\"))","v":""},null,{"$f":"IF(F20=\"\",\"\",IF(ISODD(COUNTIF($F$2:F20,F20)),\"In\",\"Out\"))","v":""}]
[{"$f":"IFERROR(IF(F21=\"\",\"\",INDEX(Database!A:A,MATCH('Access Reg'!F21,Database!E:E,0))),\"\")","v":""},{"$f":"IFERROR(IF(F21=\"\",\"\",INDEX(Database!B:B,MATCH('Access Reg'!F21,Database!E:E,0))),\"\")","v":""},{"$f":"IFERROR(IF(G21=\"\",\"\",INDEX(Database!C:C,MATCH('Access Reg'!F21,Database!E:E,0))),\"\")","v":""},{"$f":"IFERROR(IF(F21=\"\",\"\",INDEX(Database!D:D,MATCH('Access Reg'!F21,Database!E:E,0))),\"\")","v":""},null,null,"",null,{"$f":"IF(COUNTIF(F$2:F21,F21)>1,\"\",IF(ISODD(COUNTIF(F$2:F$49,F21)),COUNTIF(F$2:F$49,F21),\"\"))","v":""},null,{"$f":"IF(F21=\"\",\"\",IF(ISODD(COUNTIF($F$2:F21,F21)),\"In\",\"Out\"))","v":""}]
[{"$f":"IFERROR(IF(F22=\"\",\"\",INDEX(Database!A:A,MATCH('Access Reg'!F22,Database!E:E,0))),\"\")","v":""},{"$f":"IFERROR(IF(F22=\"\",\"\",INDEX(Database!B:B,MATCH('Access Reg'!F22,Database!E:E,0))),\"\")","v":""},{"$f":"IFERROR(IF(G22=\"\",\"\",INDEX(Database!C:C,MATCH('Access Reg'!F22,Database!E:E,0))),\"\")","v":""},{"$f":"IFERROR(IF(F22=\"\",\"\",INDEX(Database!D:D,MATCH('Access Reg'!F22,Database!E:E,0))),\"\")","v":""},null,null,"",null,{"$f":"IF(COUNTIF(F$2:F22,F22)>1,\"\",IF(ISODD(COUNTIF(F$2:F$49,F22)),COUNTIF(F$2:F$49,F22),\"\"))","v":""},null,{"$f":"IF(F22=\"\",\"\",IF(ISODD(COUNTIF($F$2:F22,F22)),\"In\",\"Out\"))","v":""}]
[{"$f":"IFERROR(IF(F23=\"\",\"\",INDEX(Database!A:A,MATCH('Access Reg'!F23,Database!E:E,0))),\"\")","v":""},{"$f":"IFERROR(IF(F23=\"\",\"\",INDEX(Database!B:B,MATCH('Access Reg'!F23,Database!E:E,0))),\"\")","v":""},{"$f":"IFERROR(IF(G23=\"\",\"\",INDEX(Database!C:C,MATCH('Access Reg'!F23,Database!E:E,0))),\"\")","v":""},{"$f":"IFERROR(IF(F23=\"\",\"\",INDEX(Database!D:D,MATCH('Access Reg'!F23,Database!E:E,0))),\"\")","v":""},null,null,"",null,{"$f":"IF(COUNTIF(F$2:F23,F23)>1,\"\",IF(ISODD(COUNTIF(F$2:F$49,F23)),COUNTIF(F$2:F$49,F23),\"\"))","v":""},null,{"$f":"IF(F23=\"\",\"\",IF(ISODD(COUNTIF($F$2:F23,F23)),\"In\",\"Out\"))","v":""}]
[{"$f":"IFERROR(IF(F24=\"\",\"\",INDEX(Database!A:A,MATCH('Access Reg'!F24,Database!E:E,0))),\"\")","v":""},{"$f":"IFERROR(IF(F24=\"\",\"\",INDEX(Database!B:B,MATCH('Access Reg'!F24,Database!E:E,0))),\"\")","v":""},{"$f":"IFERROR(IF(G24=\"\",\"\",INDEX(Database!C:C,MATCH('Access Reg'!F24,Database!E:E,0))),\"\")","v":""},{"$f":"IFERROR(IF(F24=\"\",\"\",INDEX(Database!D:D,MATCH('Access Reg'!F24,Database!E:E,0))),\"\")","v":""},null,null,"",null,{"$f":"IF(COUNTIF(F$2:F24,F24)>1,\"\",IF(ISODD(COUNTIF(F$2:F$49,F24)),COUNTIF(F$2:F$49,F24),\"\"))","v":""},null,{"$f":"IF(F24=\"\",\"\",IF(ISODD(COUNTIF($F$2:F24,F24)),\"In\",\"Out\"))","v":""}]
[{"$f":"IFERROR(IF(F25=\"\",\"\",INDEX(Database!A:A,MATCH('Access Reg'!F25,Database!E:E,0))),\"\")","v":""},{"$f":"IFERROR(IF(F25=\"\",\"\",INDEX(Database!B:B,MATCH('Access Reg'!F25,Database!E:E,0))),\"\")","v":""},{"$f":"IFERROR(IF(G25=\"\",\"\",INDEX(Database!C:C,MATCH('Access Reg'!F25,Database!E:E,0))),\"\")","v":""},{"$f":"IFERROR(IF(F25=\"\",\"\",INDEX(Database!D:D,MATCH('Access Reg'!F25,Database!E:E,0))),\"\")","v":""},null,null,"",null,{"$f":"IF(COUNTIF(F$2:F25,F25)>1,\"\",IF(ISODD(COUNTIF(F$2:F$49,F25)),COUNTIF(F$2:F$49,F25),\"\"))","v":""},null,{"$f":"IF(F25=\"\",\"\",IF(ISODD(COUNTIF($F$2:F25,F25)),\"In\",\"Out\"))","v":""}]
[{"$f":"IFERROR(IF(F26=\"\",\"\",INDEX(Database!A:A,MATCH('Access Reg'!F26,Database!E:E,0))),\"\")","v":""},{"$f":"IFERROR(IF(F26=\"\",\"\",INDEX(Database!B:B,MATCH('Access Reg'!F26,Database!E:E,0))),\"\")","v":""},{"$f":"IFERROR(IF(G26=\"\",\"\",INDEX(Database!C:C,MATCH('Access Reg'!F26,Database!E:E,0))),\"\")","v":""},{"$f":"IFERROR(IF(F26=\"\",\"\",INDEX(Database!D:D,MATCH('Access Reg'!F26,Database!E:E,0))),\"\")","v":""},null,null,"",null,{"$f":"IF(COUNTIF(F$2:F26,F26)>1,\"\",IF(ISODD(COUNTIF(F$2:F$49,F26)),COUNTIF(F$2:F$49,F26),\"\"))","v":""},null,{"$f":"IF(F26=\"\",\"\",IF(ISODD(COUNTIF($F$2:F26,F26)),\"In\",\"Out\"))","v":""}]
[{"$f":"IFERROR(IF(F27=\"\",\"\",INDEX(Database!A:A,MATCH('Access Reg'!F27,Database!E:E,0))),\"\")","v":""},{"$f":"IFERROR(IF(F27=\"\",\"\",INDEX(Database!B:B,MATCH('Access Reg'!F27,Database!E:E,0))),\"\")","v":""},{"$f":"IFERROR(IF(G27=\"\",\"\",INDEX(Database!C:C,MATCH('Access Reg'!F27,Database!E:E,0))),\"\")","v":""},{"$f":"IFERROR(IF(F27=\"\",\"\",INDEX(Database!D:D,MATCH('Access Reg'!F27,Database!E:E,0))),\"\")","v":""},null,null,"",null,{"$f":"IF(COUNTIF(F$2:F27,F27)>1,\"\",IF(ISODD(COUNTIF(F$2:F$49,F27)),COUNTIF(F$2:F$49,F27),\"\"))","v":""},null,{"$f":"IF(F27=\"\",\"\",IF(ISODD(COUNTIF($F$2:F27,F27)),\"In\",\"Out\"))","v":""}]
[{"$f":"IFERROR(IF(F28=\"\",\"\",INDEX(Database!A:A,MATCH('Access Reg'!F28,Database!E:E,0))),\"\")","v":""},{"$f":"IFERROR(IF(F28=\"\",\"\",INDEX(Database!B:B,MATCH('Access Reg'!F28,Database!E:E,0))),\"\")","v":""},{"$f":"IFERROR(IF(G28=\"\",\"\",INDEX(Database!C:C,MATCH('Access Reg'!F28,Database!E:E,0))),\"\")","v":""},{"$f":"IFERROR(IF(F28=\"\",\"\",INDEX(Database!D:D,MATCH('Access Reg'!F28,Database!E:E,0))),\"\")","v":""},null,null,{"$f":"IF(F28<>\"\",IF(G28=\"\",NOW(),G28),\"\")","v":""},null,{"$f":"IF(COUNTIF(F$2:F28,F28)>1,\"\",IF(ISODD(COUNTIF(F$2:F$49,F28)),COUNTIF(F$2:F$49,F28),\"\"))","v":""},null,{"$f":"IF(F28=\"\",\"\",IF(ISODD(COUNTIF($F$2:F28,F28)),\"In\",\"Out\"))","v":""}]
[{"$f":"IFERROR(IF(F29=\"\",\"\",INDEX(Database!A:A,MATCH('Access Reg'!F29,Database!E:E,0))),\"\")","v":""},{"$f":"IFERROR(IF(F29=\"\",\"\",INDEX(Database!B:B,MATCH('Access Reg'!F29,Database!E:E,0))),\"\")","v":""},{"$f":"IFERROR(IF(G29=\"\",\"\",INDEX(Database!C:C,MATCH('Access Reg'!F29,Database!E:E,0))),\"\")","v":""},{"$f":"IFERROR(IF(F29=\"\",\"\",INDEX(Database!D:D,MATCH('Access Reg'!F29,Database!E:E,0))),\"\")","v":""},null,null,"",null,{"$f":"IF(COUNTIF(F$2:F29,F29)>1,\"\",IF(ISODD(COUNTIF(F$2:F$49,F29)),COUNTIF(F$2:F$49,F29),\"\"))","v":""},null,{"$f":"IF(F29=\"\",\"\",IF(ISODD(COUNTIF($F$2:F29,F29)),\"In\",\"Out\"))","v":""}]
[{"$f":"IFERROR(IF(F30=\"\",\"\",INDEX(Database!A:A,MATCH('Access Reg'!F30,Database!E:E,0))),\"\")","v":""},{"$f":"IFERROR(IF(F30=\"\",\"\",INDEX(Database!B:B,MATCH('Access Reg'!F30,Database!E:E,0))),\"\")","v":""},{"$f":"IFERROR(IF(G30=\"\",\"\",INDEX(Database!C:C,MATCH('Access Reg'!F30,Database!E:E,0))),\"\")","v":""},{"$f":"IFERROR(IF(F30=\"\",\"\",INDEX(Database!D:D,MATCH('Access Reg'!F30,Database!E:E,0))),\"\")","v":""},null,null,"",null,{"$f":"IF(COUNTIF(F$2:F30,F30)>1,\"\",IF(ISODD(COUNTIF(F$2:F$49,F30)),COUNTIF(F$2:F$49,F30),\"\"))","v":""},null,{"$f":"IF(F30=\"\",\"\",IF(ISODD(COUNTIF($F$2:F30,F30)),\"In\",\"Out\"))","v":""}]
[{"$f":"IFERROR(IF(F31=\"\",\"\",INDEX(Database!A:A,MATCH('Access Reg'!F31,Database!E:E,0))),\"\")","v":""},{"$f":"IFERROR(IF(F31=\"\",\"\",INDEX(Database!B:B,MATCH('Access Reg'!F31,Database!E:E,0))),\"\")","v":""},{"$f":"IFERROR(IF(G31=\"\",\"\",INDEX(Database!C:C,MATCH('Access Reg'!F31,Database!E:E,0))),\"\")","v":""},{"$f":"IFERROR(IF(F31=\"\",\"\",INDEX(Database!D:D,MATCH('Access Reg'!F31,Database!E:E,0))),\"\")","v":""},null,null,"",null,{"$f":"IF(COUNTIF(F$2:F31,F31)>1,\"\",IF(ISODD(COUNTIF(F$2:F$49,F31)),COUNTIF(F$2:F$49,F31),\"\"))","v":""},null,{"$f":"IF(F31=\"\",\"\",IF(ISODD(COUNTIF($F$2:F31,F31)),\"In\",\"Out\"))","v":""}]
[{"$f":"IFERROR(IF(F32=\"\",\"\",INDEX(Database!A:A,MATCH('Access Reg'!F32,Database!E:E,0))),\"\")","v":""},{"$f":"IFERROR(IF(F32=\"\",\"\",INDEX(Database!B:B,MATCH('Access Reg'!F32,Database!E:E,0))),\"\")","v":""},{"$f":"IFERROR(IF(G32=\"\",\"\",INDEX(Database!C:C,MATCH('Access Reg'!F32,Database!E:E,0))),\"\")","v":""},{"$f":"IFERROR(IF(F32=\"\",\"\",INDEX(Database!D:D,MATCH('Access Reg'!F32,Database!E:E,0))),\"\")","v":""},null,null,"",null,{"$f":"IF(COUNTIF(F$2:F32,F32)>1,\"\",IF(ISODD(COUNTIF(F$2:F$49,F32)),COUNTIF(F$2:F$49,F32),\"\"))","v":""},null,{"$f":"IF(F32=\"\",\"\",IF(ISODD(COUNTIF($F$2:F32,F32)),\"In\",\"Out\"))","v":""}]
[{"$f":"IFERROR(IF(F33=\"\",\"\",INDEX(Database!A:A,MATCH('Access Reg'!F33,Database!E:E,0))),\"\")","v":""},{"$f":"IFERROR(IF(F33=\"\",\"\",INDEX(Database!B:B,MATCH('Access Reg'!F33,Database!E:E,0))),\"\")","v":""},{"$f":"IFERROR(IF(G33=\"\",\"\",INDEX(Database!C:C,MATCH('Access Reg'!F33,Database!E:E,0))),\"\")","v":""},{"$f":"IFERROR(IF(F33=\"\",\"\",INDEX(Database!D:D,MATCH('Access Reg'!F33,Database!E:E,0))),\"\")","v":""},null,null,"",null,{"$f":"IF(COUNTIF(F$2:F33,F33)>1,\"\",IF(ISODD(COUNTIF(F$2:F$49,F33)),COUNTIF(F$2:F$49,F33),\"\"))","v":""},null,{"$f":"IF(F33=\"\",\"\",IF(ISODD(COUNTIF($F$2:F33,F33)),\"In\",\"Out\"))","v":""}]
[{"$f":"IFERROR(IF(F34=\"\",\"\",INDEX(Database!A:A,MATCH('Access Reg'!F34,Database!E:E,0))),\"\")","v":""},{"$f":"IFERROR(IF(F34=\"\",\"\",INDEX(Database!B:B,MATCH('Access Reg'!F34,Database!E:E,0))),\"\")","v":""},{"$f":"IFERROR(IF(G34=\"\",\"\",INDEX(Database!C:C,MATCH('Access Reg'!F34,Database!E:E,0))),\"\")","v":""},{"$f":"IFERROR(IF(F34=\"\",\"\",INDEX(Database!D:D,MATCH('Access Reg'!F34,Database!E:E,0))),\"\")","v":""},null,null,"",null,{"$f":"IF(COUNTIF(F$2:F34,F34)>1,\"\",IF(ISODD(COUNTIF(F$2:F$49,F34)),COUNTIF(F$2:F$49,F34),\"\"))","v":""},null,{"$f":"IF(F34=\"\",\"\",IF(ISODD(COUNTIF($F$2:F34,F34)),\"In\",\"Out\"))","v":""}]
[{"$f":"IFERROR(IF(F35=\"\",\"\",INDEX(Database!A:A,MATCH('Access Reg'!F35,Database!E:E,0))),\"\")","v":""},{"$f":"IFERROR(IF(F35=\"\",\"\",INDEX(Database!B:B,MATCH('Access Reg'!F35,Database!E:E,0))),\"\")","v":""},{"$f":"IFERROR(IF(G35=\"\",\"\",INDEX(Database!C:C,MATCH('Access Reg'!F35,Database!E:E,0))),\"\")","v":""},{"$f":"IFERROR(IF(F35=\"\",\"\",INDEX(Database!D:D,MATCH('Access Reg'!F35,Database!E:E,0))),\"\")","v":""},null,null,"",null,{"$f":"IF(COUNTIF(F$2:F35,F35)>1,\"\",IF(ISODD(COUNTIF(F$2:F$49,F35)),COUNTIF(F$2:F$49,F35),\"\"))","v":""},null,{"$f":"IF(F35=\"\",\"\",IF(ISODD(COUNTIF($F$2:F35,F35)),\"In\",\"Out\"))","v":""}]
[{"$f":"IFERROR(IF(F36=\"\",\"\",INDEX(Database!A:A,MATCH('Access Reg'!F36,Database!E:E,0))),\"\")","v":""},{"$f":"IFERROR(IF(F36=\"\",\"\",INDEX(Database!B:B,MATCH('Access Reg'!F36,Database!E:E,0))),\"\")","v":""},{"$f":"IFERROR(IF(G36=\"\",\"\",INDEX(Database!C:C,MATCH('Access Reg'!F36,Database!E:E,0))),\"\")","v":""},{"$f":"IFERROR(IF(F36=\"\",\"\",INDEX(Database!D:D,MATCH('Access Reg'!F36,Database!E:E,0))),\"\")","v":""},null,null,"",null,{"$f":"IF(COUNTIF(F$2:F36,F36)>1,\"\",IF(ISODD(COUNTIF(F$2:F$49,F36)),COUNTIF(F$2:F$49,F36),\"\"))","v":""},null,{"$f":"IF(F36=\"\",\"\",IF(ISODD(COUNTIF($F$2:F36,F36)),\"In\",\"Out\"))","v":""}]
[{"$f":"IFERROR(IF(F37=\"\",\"\",INDEX(Database!A:A,MATCH('Access Reg'!F37,Database!E:E,0))),\"\")","v":""},{"$f":"IFERROR(IF(F37=\"\",\"\",INDEX(Database!B:B,MATCH('Access Reg'!F37,Database!E:E,0))),\"\")","v":""},{"$f":"IFERROR(IF(G37=\"\",\"\",INDEX(Database!C:C,MATCH('Access Reg'!F37,Database!E:E,0))),\"\")","v":""},{"$f":"IFERROR(IF(F37=\"\",\"\",INDEX(Database!D:D,MATCH('Access Reg'!F37,Database!E:E,0))),\"\")","v":""},null,null,"",null,{"$f":"IF(COUNTIF(F$2:F37,F37)>1,\"\",IF(ISODD(COUNTIF(F$2:F$49,F37)),COUNTIF(F$2:F$49,F37),\"\"))","v":""},null,{"$f":"IF(F37=\"\",\"\",IF(ISODD(COUNTIF($F$2:F37,F37)),\"In\",\"Out\"))","v":""}]
[{"$f":"IFERROR(IF(F38=\"\",\"\",INDEX(Database!A:A,MATCH('Access Reg'!F38,Database!E:E,0))),\"\")","v":""},{"$f":"IFERROR(IF(F38=\"\",\"\",INDEX(Database!B:B,MATCH('Access Reg'!F38,Database!E:E,0))),\"\")","v":""},{"$f":"IFERROR(IF(G38=\"\",\"\",INDEX(Database!C:C,MATCH('Access Reg'!F38,Database!E:E,0))),\"\")","v":""},{"$f":"IFERROR(IF(F38=\"\",\"\",INDEX(Database!D:D,MATCH('Access Reg'!F38,Database!E:E,0))),\"\")","v":""},null,null,"",null,{"$f":"IF(COUNTIF(F$2:F38,F38)>1,\"\",IF(ISODD(COUNTIF(F$2:F$49,F38)),COUNTIF(F$2:F$49,F38),\"\"))","v":""},null,{"$f":"IF(F38=\"\",\"\",IF(ISODD(COUNTIF($F$2:F38,F38)),\"In\",\"Out\"))","v":""}]
[{"$f":"IFERROR(IF(F39=\"\",\"\",INDEX(Database!A:A,MATCH('Access Reg'!F39,Database!E:E,0))),\"\")","v":""},{"$f":"IFERROR(IF(F39=\"\",\"\",INDEX(Database!B:B,MATCH('Access Reg'!F39,Database!E:E,0))),\"\")","v":""},{"$f":"IFERROR(IF(G39=\"\",\"\",INDEX(Database!C:C,MATCH('Access Reg'!F39,Database!E:E,0))),\"\")","v":""},{"$f":"IFERROR(IF(F39=\"\",\"\",INDEX(Database!D:D,MATCH('Access Reg'!F39,Database!E:E,0))),\"\")","v":""},null,null,"",null,{"$f":"IF(COUNTIF(F$2:F39,F39)>1,\"\",IF(ISODD(COUNTIF(F$2:F$49,F39)),COUNTIF(F$2:F$49,F39),\"\"))","v":""},null,{"$f":"IF(F39=\"\",\"\",IF(ISODD(COUNTIF($F$2:F39,F39)),\"In\",\"Out\"))","v":""}]
[{"$f":"IFERROR(IF(F40=\"\",\"\",INDEX(Database!A:A,MATCH('Access Reg'!F40,Database!E:E,0))),\"\")","v":""},{"$f":"IFERROR(IF(F40=\"\",\"\",INDEX(Database!B:B,MATCH('Access Reg'!F40,Database!E:E,0))),\"\")","v":""},{"$f":"IFERROR(IF(G40=\"\",\"\",INDEX(Database!C:C,MATCH('Access Reg'!F40,Database!E:E,0))),\"\")","v":""},{"$f":"IFERROR(IF(F40=\"\",\"\",INDEX(Database!D:D,MATCH('Access Reg'!F40,Database!E:E,0))),\"\")","v":""},null,null,"",null,{"$f":"IF(COUNTIF(F$2:F40,F40)>1,\"\",IF(ISODD(COUNTIF(F$2:F$49,F40)),COUNTIF(F$2:F$49,F40),\"\"))","v":""},null,{"$f":"IF(F40=\"\",\"\",IF(ISODD(COUNTIF($F$2:F40,F40)),\"In\",\"Out\"))","v":""}]
[{"$f":"IFERROR(IF(F41=\"\",\"\",INDEX(Database!A:A,MATCH('Access Reg'!F41,Database!E:E,0))),\"\")","v":""},{"$f":"IFERROR(IF(F41=\"\",\"\",INDEX(Database!B:B,MATCH('Access Reg'!F41,Database!E:E,0))),\"\")","v":""},{"$f":"IFERROR(IF(G41=\"\",\"\",INDEX(Database!C:C,MATCH('Access Reg'!F41,Database!E:E,0))),\"\")","v":""},{"$f":"IFERROR(IF(F41=\"\",\"\",INDEX(Database!D:D,MATCH('Access Reg'!F41,Database!E:E,0))),\"\")","v":""},null,null,"",null,{"$f":"IF(COUNTIF(F$2:F41,F41)>1,\"\",IF(ISODD(COUNTIF(F$2:F$49,F41)),COUNTIF(F$2:F$49,F41),\"\"))","v":""},null,{"$f":"IF(F41=\"\",\"\",IF(ISODD(COUNTIF($F$2:F41,F41)),\"In\",\"Out\"))","v":""}]
[{"$f":"IFERROR(IF(F42=\"\",\"\",INDEX(Database!A:A,MATCH('Access Reg'!F42,Database!E:E,0))),\"\")","v":""},{"$f":"IFERROR(IF(F42=\"\",\"\",INDEX(Database!B:B,MATCH('Access Reg'!F42,Database!E:E,0))),\"\")","v":""},{"$f":"IFERROR(IF(G42=\"\",\"\",INDEX(Database!C:C,MATCH('Access Reg'!F42,Database!E:E,0))),\"\")","v":""},{"$f":"IFERROR(IF(F42=\"\",\"\",INDEX(Database!D:D,MATCH('Access Reg'!F42,Database!E:E,0))),\"\")","v":""},null,null,"",null,{"$f":"IF(COUNTIF(F$2:F42,F42)>1,\"\",IF(ISODD(COUNTIF(F$2:F$49,F42)),COUNTIF(F$2:F$49,F42),\"\"))","v":""},null,{"$f":"IF(F42=\"\",\"\",IF(ISODD(COUNTIF($F$2:F42,F42)),\"In\",\"Out\"))","v":""}]
[{"$f":"IFERROR(IF(F43=\"\",\"\",INDEX(Database!A:A,MATCH('Access Reg'!F43,Database!E:E,0))),\"\")","v":""},{"$f":"IFERROR(IF(F43=\"\",\"\",INDEX(Database!B:B,MATCH('Access Reg'!F43,Database!E:E,0))),\"\")","v":""},{"$f":"IFERROR(IF(G43=\"\",\"\",INDEX(Database!C:C,MATCH('Access Reg'!F43,Database!E:E,0))),\"\")","v":""},{"$f":"IFERROR(IF(F43=\"\",\"\",INDEX(Database!D:D,MATCH('Access Reg'!F43,Database!E:E,0))),\"\")","v":""},null,null,"",null,{"$f":"IF(COUNTIF(F$2:F43,F43)>1,\"\",IF(ISODD(COUNTIF(F$2:F$49,F43)),COUNTIF(F$2:F$49,F43),\"\"))","v":""},null,{"$f":"IF(F43=\"\",\"\",IF(ISODD(COUNTIF($F$2:F43,F43)),\"In\",\"Out\"))","v":""}]
[{"$f":"IFERROR(IF(F44=\"\",\"\",INDEX(Database!A:A,MATCH('Access Reg'!F44,Database!E:E,0))),\"\")","v":""},{"$f":"IFERROR(IF(F44=\"\",\"\",INDEX(Database!B:B,MATCH('Access Reg'!F44,Database!E:E,0))),\"\")","v":""},{"$f":"IFERROR(IF(G44=\"\",\"\",INDEX(Database!C:C,MATCH('Access Reg'!F44,Database!E:E,0))),\"\")","v":""},{"$f":"IFERROR(IF(F44=\"\",\"\",INDEX(Database!D:D,MATCH('Access Reg'!F44,Database!E:E,0))),\"\")","v":""},null,null,"",null,{"$f":"IF(COUNTIF(F$2:F44,F44)>1,\"\",IF(ISODD(COUNTIF(F$2:F$49,F44)),COUNTIF(F$2:F$49,F44),\"\"))","v":""},null,{"$f":"IF(F44=\"\",\"\",IF(ISODD(COUNTIF($F$2:F44,F44)),\"In\",\"Out\"))","v":""}]
[{"$f":"IFERROR(IF(F45=\"\",\"\",INDEX(Database!A:A,MATCH('Access Reg'!F45,Database!E:E,0))),\"\")","v":""},{"$f":"IFERROR(IF(F45=\"\",\"\",INDEX(Database!B:B,MATCH('Access Reg'!F45,Database!E:E,0))),\"\")","v":""},{"$f":"IFERROR(IF(G45=\"\",\"\",INDEX(Database!C:C,MATCH('Access Reg'!F45,Database!E:E,0))),\"\")","v":""},{"$f":"IFERROR(IF(F45=\"\",\"\",INDEX(Database!D:D,MATCH('Access Reg'!F45,Database!E:E,0))),\"\")","v":""},null,null,"",null,{"$f":"IF(COUNTIF(F$2:F45,F45)>1,\"\",IF(ISODD(COUNTIF(F$2:F$49,F45)),COUNTIF(F$2:F$49,F45),\"\"))","v":""},null,{"$f":"IF(F45=\"\",\"\",IF(ISODD(COUNTIF($F$2:F45,F45)),\"In\",\"Out\"))","v":""}]
[{"$f":"IFERROR(IF(F46=\"\",\"\",INDEX(Database!A:A,MATCH('Access Reg'!F46,Database!E:E,0))),\"\")","v":""},{"$f":"IFERROR(IF(F46=\"\",\"\",INDEX(Database!B:B,MATCH('Access Reg'!F46,Database!E:E,0))),\"\")","v":""},{"$f":"IFERROR(IF(G46=\"\",\"\",INDEX(Database!C:C,MATCH('Access Reg'!F46,Database!E:E,0))),\"\")","v":""},{"$f":"IFERROR(IF(F46=\"\",\"\",INDEX(Database!D:D,MATCH('Access Reg'!F46,Database!E:E,0))),\"\")","v":""},null,null,"",null,{"$f":"IF(COUNTIF(F$2:F46,F46)>1,\"\",IF(ISODD(COUNTIF(F$2:F$49,F46)),COUNTIF(F$2:F$49,F46),\"\"))","v":""},null,{"$f":"IF(F46=\"\",\"\",IF(ISODD(COUNTIF($F$2:F46,F46)),\"In\",\"Out\"))","v":""}]
[{"$f":"IFERROR(IF(F47=\"\",\"\",INDEX(Database!A:A,MATCH('Access Reg'!F47,Database!E:E,0))),\"\")","v":""},{"$f":"IFERROR(IF(F47=\"\",\"\",INDEX(Database!B:B,MATCH('Access Reg'!F47,Database!E:E,0))),\"\")","v":""},{"$f":"IFERROR(IF(G47=\"\",\"\",INDEX(Database!C:C,MATCH('Access Reg'!F47,Database!E:E,0))),\"\")","v":""},{"$f":"IFERROR(IF(F47=\"\",\"\",INDEX(Database!D:D,MATCH('Access Reg'!F47,Database!E:E,0))),\"\")","v":""},null,null,"",null,{"$f":"IF(COUNTIF(F$2:F47,F47)>1,\"\",IF(ISODD(COUNTIF(F$2:F$49,F47)),COUNTIF(F$2:F$49,F47),\"\"))","v":""},null,{"$f":"IF(F47=\"\",\"\",IF(ISODD(COUNTIF($F$2:F47,F47)),\"In\",\"Out\"))","v":""}]
[{"$f":"IFERROR(IF(F48=\"\",\"\",INDEX(Database!A:A,MATCH('Access Reg'!F48,Database!E:E,0))),\"\")","v":""},{"$f":"IFERROR(IF(F48=\"\",\"\",INDEX(Database!B:B,MATCH('Access Reg'!F48,Database!E:E,0))),\"\")","v":""},{"$f":"IFERROR(IF(G48=\"\",\"\",INDEX(Database!C:C,MATCH('Access Reg'!F48,Database!E:E,0))),\"\")","v":""},{"$f":"IFERROR(IF(F48=\"\",\"\",INDEX(Database!D:D,MATCH('Access Reg'!F48,Database!E:E,0))),\"\")","v":""},null,null,"",null,{"$f":"IF(COUNTIF(F$2:F48,F48)>1,\"\",IF(ISODD(COUNTIF(F$2:F$49,F48)),COUNTIF(F$2:F$49,F48),\"\"))","v":""},null,{"$f":"IF(F48=\"\",\"\",IF(ISODD(COUNTIF($F$2:F48,F48)),\"In\",\"Out\"))","v":""}]
[{"$f":"IFERROR(IF(F49=\"\",\"\",INDEX(Database!A:A,MATCH('Access Reg'!F49,Database!E:E,0))),\"\")","v":""},{"$f":"IFERROR(IF(F49=\"\",\"\",INDEX(Database!B:B,MATCH('Access Reg'!F49,Database!E:E,0))),\"\")","v":""},{"$f":"IFERROR(IF(G49=\"\",\"\",INDEX(Database!C:C,MATCH('Access Reg'!F49,Database!E:E,0))),\"\")","v":""},{"$f":"IFERROR(IF(F49=\"\",\"\",INDEX(Database!D:D,MATCH('Access Reg'!F49,Database!E:E,0))),\"\")","v":""},null,null,"",null,{"$f":"IF(COUNTIF(F$2:F49,F49)>1,\"\",IF(ISODD(COUNTIF(F$2:F$49,F49)),COUNTIF(F$2:F$49,F49),\"\"))","v":""},null,{"$f":"IF(F49=\"\",\"\",IF(ISODD(COUNTIF($F$2:F49,F49)),\"In\",\"Out\"))","v":""}]