{"text_format":"1","workbook":"xlsx","n_sheets":4,"sheets":["Таблица","Календарь","Лист1","Лист2"],"not_rendered":{"charts":0,"images":2,"macros":1,"external_links":0,"defined_names":1,"comments":0,"pivot_tables":0},"unopened":[],"bounds":{"document_bytes":16777216,"sheet_cells":100000,"rows_first":2000,"rows_last":500,"rows_between":2000,"halvings":0,"cell_chars":16384,"cell_head_chars":4096},"cells_cut":0,"cells_raw":0,"read":"whole","date_system":"1900"}

{"sheet":"Таблица","index":0,"n_rows":68,"n_cols":17,"rows_kept":68,"cut":false,"hidden":false,"merged":[[0,9,0,10],[0,2,0,5],[1,2,1,5]]}
[null,null,"СПИСОК",null,null,null,"на испытании",null,null,"проведен периодический осмотр"]
[null,null,"CИЗ, находящихся на участке связи № 5",null,null,null,{"$f":"TODAY()","v":"2020-10-03"}]
["В календарь","№ п/п","Наименование СИЗ","Поряд. № СИЗ","Место нахождения","Инв. №","Дата последнего годового испытания","Дата следующего испытания","Дата отправки на испытание","Дата периодического осмотра","Дата следующего квартального осмотра","Дата следующего квартального осмотра2","Дата следующего квартального осмотра3","Дата следующего квартального осмотра4","Дата следующего квартального осмотра5","Испытание ","Здесь нужна отметка"]
[{"$f":"IF(AND(EOMONTH(1&Календарь!$D$2,0)>=INDEX(B4:K4,MATCH(Календарь!$B$2,Календарь!$A$4:$J$4,)),INDEX(B4:K4,MATCH(Календарь!$B$2,Календарь!$A$4:$J$4,))>0,Q4=\"\"),MAX($A$1:A3)+1,\"\")","v":1},1,"Перчатки диэлектрические",4,"Выпрям.","LOC100433954","2020-03-11",{"$f":"IF(EDATE(G4,6)>91,EDATE(G4,6),-50)","v":"2020-09-11"},{"$f":"IF(EDATE(G4,4)>91,EDATE(G4,4),-50)","v":"2020-07-11"},{"$f":"G4+87","v":"2020-06-06"},{"$f":"J4+87","v":"2020-09-01"},null,null,null,null,"Испытание 1 раз в 6 мес., осмотр 1 раз в 3 мес."]
[{"$f":"IF(AND(EOMONTH(1&Календарь!$D$2,0)>=INDEX(B5:K5,MATCH(Календарь!$B$2,Календарь!$A$4:$J$4,)),INDEX(B5:K5,MATCH(Календарь!$B$2,Календарь!$A$4:$J$4,))>0,Q5=\"\"),MAX($A$1:A4)+1,\"\")","v":2},2,"Перчатки диэлектрические",5,"ВБ","LOC100433954","2020-03-11",{"$f":"IF(EDATE(G5,6)>91,EDATE(G5,6),-50)","v":"2020-09-11"},{"$f":"IF(EDATE(G5,4)>91,EDATE(G5,4),-50)","v":"2020-07-11"},{"$f":"G5+87","v":"2020-06-06"},{"$f":"J5+87","v":"2020-09-01"},null,null,null,null,"Испытание 1 раз в 6 мес., осмотр 1 раз в 3 мес."]
[{"$f":"IF(AND(EOMONTH(1&Календарь!$D$2,0)>=INDEX(B6:K6,MATCH(Календарь!$B$2,Календарь!$A$4:$J$4,)),INDEX(B6:K6,MATCH(Календарь!$B$2,Календарь!$A$4:$J$4,))>0,Q6=\"\"),MAX($A$1:A5)+1,\"\")","v":3},3,"Перчатки диэлектрические",31,"АТС","LOC100433954","2020-03-11",{"$f":"IF(EDATE(G6,6)>91,EDATE(G6,6),-50)","v":"2020-09-11"},{"$f":"IF(EDATE(G6,4)>91,EDATE(G6,4),-50)","v":"2020-07-11"},{"$f":"G6+87","v":"2020-06-06"},{"$f":"J6+87","v":"2020-09-01"},null,null,null,null,"Испытание 1 раз в 6 мес., осмотр 1 раз в 3 мес."]
[{"$f":"IF(AND(EOMONTH(1&Календарь!$D$2,0)>=INDEX(B7:K7,MATCH(Календарь!$B$2,Календарь!$A$4:$J$4,)),INDEX(B7:K7,MATCH(Календарь!$B$2,Календарь!$A$4:$J$4,))>0,Q7=\"\"),MAX($A$1:A6)+1,\"\")","v":""},4,"Перчатки диэлектрические",9,"ВБ","LOC100433954","2020-06-02",{"$f":"IF(EDATE(G7,6)>91,EDATE(G7,6),-50)","v":"2020-12-02"},{"$f":"IF(EDATE(G7,4)>91,EDATE(G7,4),-50)","v":"2020-10-02"},{"$f":"G7+87","v":"2020-08-28"},{"$f":"J7+87","v":"2020-11-23"},null,null,null,null,"Испытание 1 раз в 6 мес., осмотр 1 раз в 3 мес."]
[{"$f":"IF(AND(EOMONTH(1&Календарь!$D$2,0)>=INDEX(B8:K8,MATCH(Календарь!$B$2,Календарь!$A$4:$J$4,)),INDEX(B8:K8,MATCH(Календарь!$B$2,Календарь!$A$4:$J$4,))>0,Q8=\"\"),MAX($A$1:A7)+1,\"\")","v":""},5,"Перчатки диэлектрические",10,"Выпрям.","LOC100433954","2020-06-02","2020-12-02","2020-10-02","2020-08-28","2020-11-23",null,null,null,null,"Испытание 1 раз в 6 мес., осмотр 1 раз в 3 мес."]
[{"$f":"IF(AND(EOMONTH(1&Календарь!$D$2,0)>=INDEX(B9:K9,MATCH(Календарь!$B$2,Календарь!$A$4:$J$4,)),INDEX(B9:K9,MATCH(Календарь!$B$2,Календарь!$A$4:$J$4,))>0,Q9=\"\"),MAX($A$1:A8)+1,\"\")","v":""},6,"Перчатки диэлектрические (новые)",11,"Выпрям.","LOC100828099","?",null,null,null,null,null,null,null,null,"Испытание 1 раз в 6 мес., осмотр 1 раз в 3 мес."]
[{"$f":"IF(AND(EOMONTH(1&Календарь!$D$2,0)>=INDEX(B10:K10,MATCH(Календарь!$B$2,Календарь!$A$4:$J$4,)),INDEX(B10:K10,MATCH(Календарь!$B$2,Календарь!$A$4:$J$4,))>0,Q10=\"\"),MAX($A$1:A9)+1,\"\")","v":""},7,"Боты диэлектрические",12,"АТС","LOC100416152","2020-03-11",{"$f":"IF(EDATE(G10,36)>91,EDATE(G10,36),-50)","v":"2023-03-11"},{"$f":"IF(EDATE(G10,34)>91,EDATE(G10,34),-50)","v":"2023-01-11"},{"$f":"G10+175","v":"2020-09-02"},{"$f":"J10+175","v":"2021-02-24"},"2021-08-18","2022-02-09","2022-08-03","2023-01-25","Испытание 1 раз в 3 года, осмотр 1 раз в 6 мес."]
[{"$f":"IF(AND(EOMONTH(1&Календарь!$D$2,0)>=INDEX(B11:K11,MATCH(Календарь!$B$2,Календарь!$A$4:$J$4,)),INDEX(B11:K11,MATCH(Календарь!$B$2,Календарь!$A$4:$J$4,))>0,Q11=\"\"),MAX($A$1:A10)+1,\"\")","v":""},8,"Боты диэлектрические",11,"Выпрям.","350010000715","2019-02-19",{"$f":"IF(EDATE(G11,36)>91,EDATE(G11,36),-50)","v":"2022-02-19"},{"$f":"IF(EDATE(G11,34)>91,EDATE(G11,34),-50)","v":"2021-12-19"},{"$f":"G11+175","v":"2019-08-13"},"2020-02-04","2020-07-28","2021-01-19","2021-07-13","2022-01-04","Испытание 1 раз в 3 года, осмотр 1 раз в 6 мес."]
[{"$f":"IF(AND(EOMONTH(1&Календарь!$D$2,0)>=INDEX(B12:K12,MATCH(Календарь!$B$2,Календарь!$A$4:$J$4,)),INDEX(B12:K12,MATCH(Календарь!$B$2,Календарь!$A$4:$J$4,))>0,Q12=\"\"),MAX($A$1:A11)+1,\"\")","v":""},7,"Боты диэлектрические",9,"АТС","350010000716","2019-11-25",{"$f":"IF(EDATE(G12,36)>91,EDATE(G12,36),-50)","v":"2022-11-25"},{"$f":"IF(EDATE(G12,34)>91,EDATE(G12,34),-50)","v":"2022-09-25"},{"$f":"G12+175","v":"2020-05-18"},"2020-11-09","2021-05-03","2021-10-25","2022-04-18","2022-10-10","Испытание 1 раз в 3 года, осмотр 1 раз в 6 мес."]
[{"$f":"IF(AND(EOMONTH(1&Календарь!$D$2,0)>=INDEX(B13:K13,MATCH(Календарь!$B$2,Календарь!$A$4:$J$4,)),INDEX(B13:K13,MATCH(Календарь!$B$2,Календарь!$A$4:$J$4,))>0,Q13=\"\"),MAX($A$1:A12)+1,\"\")","v":""},7,"Боты диэлектрические (новые)",10,"Выпрям.","LOC100827944","?",null,null,null,null,null,null,null,null,"Испытание 1 раз в 3 года, осмотр 1 раз в 6 мес."]
[{"$f":"IF(AND(EOMONTH(1&Календарь!$D$2,0)>=INDEX(B14:K14,MATCH(Календарь!$B$2,Календарь!$A$4:$J$4,)),INDEX(B14:K14,MATCH(Календарь!$B$2,Календарь!$A$4:$J$4,))>0,Q14=\"\"),MAX($A$1:A13)+1,\"\")","v":4},11,"Индикатор напряж.ПИН90-2М",5,"Выпрям.","LOC100422167","2019-08-20",{"$f":"IF(EDATE(G14,12)>91,EDATE(G14,12),-50)","v":"2020-08-20"},{"$f":"IF(EDATE(G14,10)>91,EDATE(G14,10),-50)","v":"2020-06-20"},{"$f":"G14+87","v":"2019-11-15"},{"$f":"J14+87","v":"2020-02-10"},"2020-05-07","2020-08-02",null,null,"Испытание 1 раз в год осмотр 1 раз в 3 мес."]
[{"$f":"IF(AND(EOMONTH(1&Календарь!$D$2,0)>=INDEX(B15:K15,MATCH(Календарь!$B$2,Календарь!$A$4:$J$4,)),INDEX(B15:K15,MATCH(Календарь!$B$2,Календарь!$A$4:$J$4,))>0,Q15=\"\"),MAX($A$1:A14)+1,\"\")","v":5},12,"Индикатор ИНО-500 напряжения-отвертк",6,"АТС","LOC100422159","2019-08-20","2020-08-20","2020-06-20","2019-11-15","2020-02-10","2020-05-07","2020-08-02",null,null,"Испытание 1 раз в год осмотр 1 раз в 3 мес."]
[{"$f":"IF(AND(EOMONTH(1&Календарь!$D$2,0)>=INDEX(B16:K16,MATCH(Календарь!$B$2,Календарь!$A$4:$J$4,)),INDEX(B16:K16,MATCH(Календарь!$B$2,Календарь!$A$4:$J$4,))>0,Q16=\"\"),MAX($A$1:A15)+1,\"\")","v":6},13,"Индикатор ИНО-500 напряжения-отвертк",10,"ВБ","LOC100422159","2019-08-20","2020-08-20","2020-06-20","2019-11-15","2020-02-10","2020-05-07","2020-08-02",null,null,"Испытание 1 раз в год осмотр 1 раз в 3 мес."]
[{"$f":"IF(AND(EOMONTH(1&Календарь!$D$2,0)>=INDEX(B17:K17,MATCH(Календарь!$B$2,Календарь!$A$4:$J$4,)),INDEX(B17:K17,MATCH(Календарь!$B$2,Календарь!$A$4:$J$4,))>0,Q17=\"\"),MAX($A$1:A16)+1,\"\")","v":""},14,"Индикатор ИНО-500 напряжения-отвертк",9,"ВБ","LOC100422159","2019-11-25","2020-11-25","2020-09-25","2020-02-20",{"$f":"IF(EDATE(J17,3)>3,EDATE(J17,3),-3)","v":"2020-05-20"},{"$f":"K17+87","v":"2020-08-15"},"2020-11-10",null,null,"Испытание 1 раз в год осмотр 1 раз в 3 мес."]
[{"$f":"IF(AND(EOMONTH(1&Календарь!$D$2,0)>=INDEX(B18:K18,MATCH(Календарь!$B$2,Календарь!$A$4:$J$4,)),INDEX(B18:K18,MATCH(Календарь!$B$2,Календарь!$A$4:$J$4,))>0,Q18=\"\"),MAX($A$1:A17)+1,\"\")","v":""},15,"Индикатор ИНО-500 напряжения-отвертк",8,"АТС","LOC100422159","2019-11-25","2020-11-25","2020-09-25","2020-02-20",{"$f":"IF(EDATE(J18,3)>3,EDATE(J18,3),-3)","v":"2020-05-20"},"2020-08-15","2020-11-10",null,null,"Испытание 1 раз в год осмотр 1 раз в 3 мес."]
[null,null,"Индикатор ИНО-500 напряжения-отвертк",3,"Выпрям.","LOC100422159","2019-11-25",{"$f":"IF(EDATE(G19,12)>91,EDATE(G19,12),-50)","v":"2020-11-25"},{"$f":"IF(EDATE(G19,10)>91,EDATE(G19,10),-50)","v":"2020-09-25"},{"$f":"G19+87","v":"2020-02-20"},{"$f":"IF(EDATE(J19,3)>3,EDATE(J19,3),-3)","v":"2020-05-20"},{"$f":"K19+87","v":"2020-08-15"},{"$f":"L19+87","v":"2020-11-10"},null,null,"Испытание 1 раз в год осмотр 1 раз в 3 мес."]
[{"$f":"IF(AND(EOMONTH(1&Календарь!$D$2,0)>=INDEX(B20:K20,MATCH(Календарь!$B$2,Календарь!$A$4:$J$4,)),INDEX(B20:K20,MATCH(Календарь!$B$2,Календарь!$A$4:$J$4,))>0,Q20=\"\"),MAX($A$1:A18)+1,\"\")","v":""},16,"Индикатор напряж.ПИН90-2М",7,"Выпрям.","LOC100422167","2019-11-25","2020-11-25","2020-09-25","2020-02-20",{"$f":"IF(EDATE(J20,3)>3,EDATE(J20,3),-3)","v":"2020-05-20"},"2020-08-15","2020-11-10",null,null,"Испытание 1 раз в год осмотр 1 раз в 3 мес."]
{"$rows_left_out":49}
{"sheet":"Календарь","index":1,"n_rows":62,"n_cols":12,"rows_kept":62,"cut":false,"hidden":false,"merged":[[7,11,17,14],[2,0,3,0],[0,1,0,4],[2,5,3,5],[2,4,3,4],[2,3,3,3],[2,2,3,2],[2,1,3,1],[0,5,0,7]]}
[null,"СПИСОК СИЗ на",null,null,null,{"$f":"TODAY()","v":"2020-10-03"}]
[null,"годового испытания",null,"октябрь"]
["№ п/п","Наименование СИЗ","Поряд. № СИЗ","Место нахождения","Инв. №","Дата последнего годового испытания ","Дата следующего","Дата ","Дата ","Дата следующего "]
[null,null,null,null,null,null,"годового испытания","отправки на испытание","периодического осмотра","квартального осмотра"]
[null,1,2,3,4,5,6,7,9,10]
[{"$f":"IFERROR(VLOOKUP(ROW()-5,Таблица!$A:$P,COLUMN()+1,0),\"\")","v":1},{"$f":"IFERROR(VLOOKUP(ROW()-5,Таблица!$A:$P,COLUMN()+1,0),\"\")","v":"Перчатки диэлектрические"},{"$f":"IFERROR(VLOOKUP(ROW()-5,Таблица!$A:$P,COLUMN()+1,0),\"\")","v":4},{"$f":"IFERROR(VLOOKUP(ROW()-5,Таблица!$A:$P,COLUMN()+1,0),\"\")","v":"Выпрям."},{"$f":"IFERROR(VLOOKUP(ROW()-5,Таблица!$A:$P,COLUMN()+1,0),\"\")","v":"LOC100433954"},{"$f":"IFERROR(VLOOKUP(ROW()-5,Таблица!$A:$P,COLUMN()+1,0),\"\")","v":"2020-03-11"},{"$f":"IFERROR(VLOOKUP(ROW()-5,Таблица!$A:$P,COLUMN()+1,0),\"\")","v":"2020-09-11"},{"$f":"IFERROR(VLOOKUP(ROW()-5,Таблица!$A:$P,COLUMN()+1,0),\"\")","v":"2020-07-11"},{"$f":"IFERROR(VLOOKUP(ROW()-5,Таблица!$A:$P,COLUMN()+1,0),\"\")","v":"2020-06-06"},{"$f":"IFERROR(VLOOKUP(ROW()-5,Таблица!$A:$P,COLUMN()+1,0),\"\")","v":"2020-09-01"}]
[{"$f":"IFERROR(VLOOKUP(ROW()-5,Таблица!$A:$P,COLUMN()+1,0),\"\")","v":2},{"$f":"IFERROR(VLOOKUP(ROW()-5,Таблица!$A:$P,COLUMN()+1,0),\"\")","v":"Перчатки диэлектрические"},{"$f":"IFERROR(VLOOKUP(ROW()-5,Таблица!$A:$P,COLUMN()+1,0),\"\")","v":5},{"$f":"IFERROR(VLOOKUP(ROW()-5,Таблица!$A:$P,COLUMN()+1,0),\"\")","v":"ВБ"},{"$f":"IFERROR(VLOOKUP(ROW()-5,Таблица!$A:$P,COLUMN()+1,0),\"\")","v":"LOC100433954"},{"$f":"IFERROR(VLOOKUP(ROW()-5,Таблица!$A:$P,COLUMN()+1,0),\"\")","v":"2020-03-11"},{"$f":"IFERROR(VLOOKUP(ROW()-5,Таблица!$A:$P,COLUMN()+1,0),\"\")","v":"2020-09-11"},{"$f":"IFERROR(VLOOKUP(ROW()-5,Таблица!$A:$P,COLUMN()+1,0),\"\")","v":"2020-07-11"},{"$f":"IFERROR(VLOOKUP(ROW()-5,Таблица!$A:$P,COLUMN()+1,0),\"\")","v":"2020-06-06"},{"$f":"IFERROR(VLOOKUP(ROW()-5,Таблица!$A:$P,COLUMN()+1,0),\"\")","v":"2020-09-01"}]
[{"$f":"IFERROR(VLOOKUP(ROW()-5,Таблица!$A:$P,COLUMN()+1,0),\"\")","v":3},{"$f":"IFERROR(VLOOKUP(ROW()-5,Таблица!$A:$P,COLUMN()+1,0),\"\")","v":"Перчатки диэлектрические"},{"$f":"IFERROR(VLOOKUP(ROW()-5,Таблица!$A:$P,COLUMN()+1,0),\"\")","v":31},{"$f":"IFERROR(VLOOKUP(ROW()-5,Таблица!$A:$P,COLUMN()+1,0),\"\")","v":"АТС"},{"$f":"IFERROR(VLOOKUP(ROW()-5,Таблица!$A:$P,COLUMN()+1,0),\"\")","v":"LOC100433954"},{"$f":"IFERROR(VLOOKUP(ROW()-5,Таблица!$A:$P,COLUMN()+1,0),\"\")","v":"2020-03-11"},{"$f":"IFERROR(VLOOKUP(ROW()-5,Таблица!$A:$P,COLUMN()+1,0),\"\")","v":"2020-09-11"},{"$f":"IFERROR(VLOOKUP(ROW()-5,Таблица!$A:$P,COLUMN()+1,0),\"\")","v":"2020-07-11"},{"$f":"IFERROR(VLOOKUP(ROW()-5,Таблица!$A:$P,COLUMN()+1,0),\"\")","v":"2020-06-06"},{"$f":"IFERROR(VLOOKUP(ROW()-5,Таблица!$A:$P,COLUMN()+1,0),\"\")","v":"2020-09-01"},null,"Уважаемые Екселисты,здравствуйте! Подскажите мне, пожалуйста! Как мне сохранить файл без кнопки \"Сохранить в файл\" и формул (просто числа), что в макросе нужно заменить! Спасибо большое!!!!"]
[{"$f":"IFERROR(VLOOKUP(ROW()-5,Таблица!$A:$P,COLUMN()+1,0),\"\")","v":11},{"$f":"IFERROR(VLOOKUP(ROW()-5,Таблица!$A:$P,COLUMN()+1,0),\"\")","v":"Индикатор напряж.ПИН90-2М"},{"$f":"IFERROR(VLOOKUP(ROW()-5,Таблица!$A:$P,COLUMN()+1,0),\"\")","v":5},{"$f":"IFERROR(VLOOKUP(ROW()-5,Таблица!$A:$P,COLUMN()+1,0),\"\")","v":"Выпрям."},{"$f":"IFERROR(VLOOKUP(ROW()-5,Таблица!$A:$P,COLUMN()+1,0),\"\")","v":"LOC100422167"},{"$f":"IFERROR(VLOOKUP(ROW()-5,Таблица!$A:$P,COLUMN()+1,0),\"\")","v":"2019-08-20"},{"$f":"IFERROR(VLOOKUP(ROW()-5,Таблица!$A:$P,COLUMN()+1,0),\"\")","v":"2020-08-20"},{"$f":"IFERROR(VLOOKUP(ROW()-5,Таблица!$A:$P,COLUMN()+1,0),\"\")","v":"2020-06-20"},{"$f":"IFERROR(VLOOKUP(ROW()-5,Таблица!$A:$P,COLUMN()+1,0),\"\")","v":"2019-11-15"},{"$f":"IFERROR(VLOOKUP(ROW()-5,Таблица!$A:$P,COLUMN()+1,0),\"\")","v":"2020-02-10"}]
[{"$f":"IFERROR(VLOOKUP(ROW()-5,Таблица!$A:$P,COLUMN()+1,0),\"\")","v":12},{"$f":"IFERROR(VLOOKUP(ROW()-5,Таблица!$A:$P,COLUMN()+1,0),\"\")","v":"Индикатор ИНО-500 напряжения-отвертк"},{"$f":"IFERROR(VLOOKUP(ROW()-5,Таблица!$A:$P,COLUMN()+1,0),\"\")","v":6},{"$f":"IFERROR(VLOOKUP(ROW()-5,Таблица!$A:$P,COLUMN()+1,0),\"\")","v":"АТС"},{"$f":"IFERROR(VLOOKUP(ROW()-5,Таблица!$A:$P,COLUMN()+1,0),\"\")","v":"LOC100422159"},{"$f":"IFERROR(VLOOKUP(ROW()-5,Таблица!$A:$P,COLUMN()+1,0),\"\")","v":"2019-08-20"},{"$f":"IFERROR(VLOOKUP(ROW()-5,Таблица!$A:$P,COLUMN()+1,0),\"\")","v":"2020-08-20"},{"$f":"IFERROR(VLOOKUP(ROW()-5,Таблица!$A:$P,COLUMN()+1,0),\"\")","v":"2020-06-20"},{"$f":"IFERROR(VLOOKUP(ROW()-5,Таблица!$A:$P,COLUMN()+1,0),\"\")","v":"2019-11-15"},{"$f":"IFERROR(VLOOKUP(ROW()-5,Таблица!$A:$P,COLUMN()+1,0),\"\")","v":"2020-02-10"}]
[{"$f":"IFERROR(VLOOKUP(ROW()-5,Таблица!$A:$P,COLUMN()+1,0),\"\")","v":13},{"$f":"IFERROR(VLOOKUP(ROW()-5,Таблица!$A:$P,COLUMN()+1,0),\"\")","v":"Индикатор ИНО-500 напряжения-отвертк"},{"$f":"IFERROR(VLOOKUP(ROW()-5,Таблица!$A:$P,COLUMN()+1,0),\"\")","v":10},{"$f":"IFERROR(VLOOKUP(ROW()-5,Таблица!$A:$P,COLUMN()+1,0),\"\")","v":"ВБ"},{"$f":"IFERROR(VLOOKUP(ROW()-5,Таблица!$A:$P,COLUMN()+1,0),\"\")","v":"LOC100422159"},{"$f":"IFERROR(VLOOKUP(ROW()-5,Таблица!$A:$P,COLUMN()+1,0),\"\")","v":"2019-08-20"},{"$f":"IFERROR(VLOOKUP(ROW()-5,Таблица!$A:$P,COLUMN()+1,0),\"\")","v":"2020-08-20"},{"$f":"IFERROR(VLOOKUP(ROW()-5,Таблица!$A:$P,COLUMN()+1,0),\"\")","v":"2020-06-20"},{"$f":"IFERROR(VLOOKUP(ROW()-5,Таблица!$A:$P,COLUMN()+1,0),\"\")","v":"2019-11-15"},{"$f":"IFERROR(VLOOKUP(ROW()-5,Таблица!$A:$P,COLUMN()+1,0),\"\")","v":"2020-02-10"}]
[{"$f":"IFERROR(VLOOKUP(ROW()-5,Таблица!$A:$P,COLUMN()+1,0),\"\")","v":32},{"$f":"IFERROR(VLOOKUP(ROW()-5,Таблица!$A:$P,COLUMN()+1,0),\"\")","v":"Отвертка"},{"$f":"IFERROR(VLOOKUP(ROW()-5,Таблица!$A:$P,COLUMN()+1,0),\"\")","v":"2-1"},{"$f":"IFERROR(VLOOKUP(ROW()-5,Таблица!$A:$P,COLUMN()+1,0),\"\")","v":"Выпрям."},{"$f":"IFERROR(VLOOKUP(ROW()-5,Таблица!$A:$P,COLUMN()+1,0),\"\")","v":"LOC100431335"},{"$f":"IFERROR(VLOOKUP(ROW()-5,Таблица!$A:$P,COLUMN()+1,0),\"\")","v":"2019-08-23"},{"$f":"IFERROR(VLOOKUP(ROW()-5,Таблица!$A:$P,COLUMN()+1,0),\"\")","v":"2020-08-23"},{"$f":"IFERROR(VLOOKUP(ROW()-5,Таблица!$A:$P,COLUMN()+1,0),\"\")","v":"2020-06-23"},{"$f":"IFERROR(VLOOKUP(ROW()-5,Таблица!$A:$P,COLUMN()+1,0),\"\")","v":"2020-02-13"},{"$f":"IFERROR(VLOOKUP(ROW()-5,Таблица!$A:$P,COLUMN()+1,0),\"\")","v":"2020-05-10"}]
[{"$f":"IFERROR(VLOOKUP(ROW()-5,Таблица!$A:$P,COLUMN()+1,0),\"\")","v":33},{"$f":"IFERROR(VLOOKUP(ROW()-5,Таблица!$A:$P,COLUMN()+1,0),\"\")","v":"Отвертка"},{"$f":"IFERROR(VLOOKUP(ROW()-5,Таблица!$A:$P,COLUMN()+1,0),\"\")","v":"2-2"},{"$f":"IFERROR(VLOOKUP(ROW()-5,Таблица!$A:$P,COLUMN()+1,0),\"\")","v":"Выпрям."},{"$f":"IFERROR(VLOOKUP(ROW()-5,Таблица!$A:$P,COLUMN()+1,0),\"\")","v":"LOC100431335"},{"$f":"IFERROR(VLOOKUP(ROW()-5,Таблица!$A:$P,COLUMN()+1,0),\"\")","v":"2019-08-23"},{"$f":"IFERROR(VLOOKUP(ROW()-5,Таблица!$A:$P,COLUMN()+1,0),\"\")","v":"2020-08-23"},{"$f":"IFERROR(VLOOKUP(ROW()-5,Таблица!$A:$P,COLUMN()+1,0),\"\")","v":"2020-06-23"},{"$f":"IFERROR(VLOOKUP(ROW()-5,Таблица!$A:$P,COLUMN()+1,0),\"\")","v":"2020-02-13"},{"$f":"IFERROR(VLOOKUP(ROW()-5,Таблица!$A:$P,COLUMN()+1,0),\"\")","v":"2020-05-10"}]
[{"$f":"IFERROR(VLOOKUP(ROW()-5,Таблица!$A:$P,COLUMN()+1,0),\"\")","v":34},{"$f":"IFERROR(VLOOKUP(ROW()-5,Таблица!$A:$P,COLUMN()+1,0),\"\")","v":"Отвертка"},{"$f":"IFERROR(VLOOKUP(ROW()-5,Таблица!$A:$P,COLUMN()+1,0),\"\")","v":"2-3"},{"$f":"IFERROR(VLOOKUP(ROW()-5,Таблица!$A:$P,COLUMN()+1,0),\"\")","v":"Выпрям."},{"$f":"IFERROR(VLOOKUP(ROW()-5,Таблица!$A:$P,COLUMN()+1,0),\"\")","v":"LOC100431335"},{"$f":"IFERROR(VLOOKUP(ROW()-5,Таблица!$A:$P,COLUMN()+1,0),\"\")","v":"2019-08-23"},{"$f":"IFERROR(VLOOKUP(ROW()-5,Таблица!$A:$P,COLUMN()+1,0),\"\")","v":"2020-08-23"},{"$f":"IFERROR(VLOOKUP(ROW()-5,Таблица!$A:$P,COLUMN()+1,0),\"\")","v":"2020-06-23"},{"$f":"IFERROR(VLOOKUP(ROW()-5,Таблица!$A:$P,COLUMN()+1,0),\"\")","v":"2020-02-13"},{"$f":"IFERROR(VLOOKUP(ROW()-5,Таблица!$A:$P,COLUMN()+1,0),\"\")","v":"2020-05-10"}]
[{"$f":"IFERROR(VLOOKUP(ROW()-5,Таблица!$A:$P,COLUMN()+1,0),\"\")","v":35},{"$f":"IFERROR(VLOOKUP(ROW()-5,Таблица!$A:$P,COLUMN()+1,0),\"\")","v":"Отвертка"},{"$f":"IFERROR(VLOOKUP(ROW()-5,Таблица!$A:$P,COLUMN()+1,0),\"\")","v":"2-4"},{"$f":"IFERROR(VLOOKUP(ROW()-5,Таблица!$A:$P,COLUMN()+1,0),\"\")","v":"Выпрям."},{"$f":"IFERROR(VLOOKUP(ROW()-5,Таблица!$A:$P,COLUMN()+1,0),\"\")","v":"LOC100431335"},{"$f":"IFERROR(VLOOKUP(ROW()-5,Таблица!$A:$P,COLUMN()+1,0),\"\")","v":"2019-08-23"},{"$f":"IFERROR(VLOOKUP(ROW()-5,Таблица!$A:$P,COLUMN()+1,0),\"\")","v":"2020-08-23"},{"$f":"IFERROR(VLOOKUP(ROW()-5,Таблица!$A:$P,COLUMN()+1,0),\"\")","v":"2020-06-23"},{"$f":"IFERROR(VLOOKUP(ROW()-5,Таблица!$A:$P,COLUMN()+1,0),\"\")","v":"2020-02-13"},{"$f":"IFERROR(VLOOKUP(ROW()-5,Таблица!$A:$P,COLUMN()+1,0),\"\")","v":"2020-05-10"}]
[{"$f":"IFERROR(VLOOKUP(ROW()-5,Таблица!$A:$P,COLUMN()+1,0),\"\")","v":36},{"$f":"IFERROR(VLOOKUP(ROW()-5,Таблица!$A:$P,COLUMN()+1,0),\"\")","v":"Отвертка"},{"$f":"IFERROR(VLOOKUP(ROW()-5,Таблица!$A:$P,COLUMN()+1,0),\"\")","v":"2-5"},{"$f":"IFERROR(VLOOKUP(ROW()-5,Таблица!$A:$P,COLUMN()+1,0),\"\")","v":"Выпрям."},{"$f":"IFERROR(VLOOKUP(ROW()-5,Таблица!$A:$P,COLUMN()+1,0),\"\")","v":"LOC100431335"},{"$f":"IFERROR(VLOOKUP(ROW()-5,Таблица!$A:$P,COLUMN()+1,0),\"\")","v":"2019-08-23"},{"$f":"IFERROR(VLOOKUP(ROW()-5,Таблица!$A:$P,COLUMN()+1,0),\"\")","v":"2020-08-23"},{"$f":"IFERROR(VLOOKUP(ROW()-5,Таблица!$A:$P,COLUMN()+1,0),\"\")","v":"2020-06-23"},{"$f":"IFERROR(VLOOKUP(ROW()-5,Таблица!$A:$P,COLUMN()+1,0),\"\")","v":"2020-02-13"},{"$f":"IFERROR(VLOOKUP(ROW()-5,Таблица!$A:$P,COLUMN()+1,0),\"\")","v":"2020-05-10"}]
[{"$f":"IFERROR(VLOOKUP(ROW()-5,Таблица!$A:$P,COLUMN()+1,0),\"\")","v":37},{"$f":"IFERROR(VLOOKUP(ROW()-5,Таблица!$A:$P,COLUMN()+1,0),\"\")","v":"Отвертка"},{"$f":"IFERROR(VLOOKUP(ROW()-5,Таблица!$A:$P,COLUMN()+1,0),\"\")","v":"2-6"},{"$f":"IFERROR(VLOOKUP(ROW()-5,Таблица!$A:$P,COLUMN()+1,0),\"\")","v":"Выпрям."},{"$f":"IFERROR(VLOOKUP(ROW()-5,Таблица!$A:$P,COLUMN()+1,0),\"\")","v":"LOC100431335"},{"$f":"IFERROR(VLOOKUP(ROW()-5,Таблица!$A:$P,COLUMN()+1,0),\"\")","v":"2019-08-23"},{"$f":"IFERROR(VLOOKUP(ROW()-5,Таблица!$A:$P,COLUMN()+1,0),\"\")","v":"2020-08-23"},{"$f":"IFERROR(VLOOKUP(ROW()-5,Таблица!$A:$P,COLUMN()+1,0),\"\")","v":"2020-06-23"},{"$f":"IFERROR(VLOOKUP(ROW()-5,Таблица!$A:$P,COLUMN()+1,0),\"\")","v":"2020-02-13"},{"$f":"IFERROR(VLOOKUP(ROW()-5,Таблица!$A:$P,COLUMN()+1,0),\"\")","v":"2020-05-10"}]
[{"$f":"IFERROR(VLOOKUP(ROW()-5,Таблица!$A:$P,COLUMN()+1,0),\"\")","v":38},{"$f":"IFERROR(VLOOKUP(ROW()-5,Таблица!$A:$P,COLUMN()+1,0),\"\")","v":"Пассатижи"},{"$f":"IFERROR(VLOOKUP(ROW()-5,Таблица!$A:$P,COLUMN()+1,0),\"\")","v":"2-1"},{"$f":"IFERROR(VLOOKUP(ROW()-5,Таблица!$A:$P,COLUMN()+1,0),\"\")","v":"Выпрям."},{"$f":"IFERROR(VLOOKUP(ROW()-5,Таблица!$A:$P,COLUMN()+1,0),\"\")","v":"LOC100433506"},{"$f":"IFERROR(VLOOKUP(ROW()-5,Таблица!$A:$P,COLUMN()+1,0),\"\")","v":"2019-08-23"},{"$f":"IFERROR(VLOOKUP(ROW()-5,Таблица!$A:$P,COLUMN()+1,0),\"\")","v":"2020-08-23"},{"$f":"IFERROR(VLOOKUP(ROW()-5,Таблица!$A:$P,COLUMN()+1,0),\"\")","v":"2020-06-23"},{"$f":"IFERROR(VLOOKUP(ROW()-5,Таблица!$A:$P,COLUMN()+1,0),\"\")","v":"2019-11-18"},{"$f":"IFERROR(VLOOKUP(ROW()-5,Таблица!$A:$P,COLUMN()+1,0),\"\")","v":"2020-02-13"}]
[{"$f":"IFERROR(VLOOKUP(ROW()-5,Таблица!$A:$P,COLUMN()+1,0),\"\")","v":39},{"$f":"IFERROR(VLOOKUP(ROW()-5,Таблица!$A:$P,COLUMN()+1,0),\"\")","v":"Круглогубцы"},{"$f":"IFERROR(VLOOKUP(ROW()-5,Таблица!$A:$P,COLUMN()+1,0),\"\")","v":"2-2"},{"$f":"IFERROR(VLOOKUP(ROW()-5,Таблица!$A:$P,COLUMN()+1,0),\"\")","v":"Выпрям."},{"$f":"IFERROR(VLOOKUP(ROW()-5,Таблица!$A:$P,COLUMN()+1,0),\"\")","v":"LOC100427548"},{"$f":"IFERROR(VLOOKUP(ROW()-5,Таблица!$A:$P,COLUMN()+1,0),\"\")","v":"2019-08-23"},{"$f":"IFERROR(VLOOKUP(ROW()-5,Таблица!$A:$P,COLUMN()+1,0),\"\")","v":"2020-08-23"},{"$f":"IFERROR(VLOOKUP(ROW()-5,Таблица!$A:$P,COLUMN()+1,0),\"\")","v":"2020-06-23"},{"$f":"IFERROR(VLOOKUP(ROW()-5,Таблица!$A:$P,COLUMN()+1,0),\"\")","v":"2019-11-18"},{"$f":"IFERROR(VLOOKUP(ROW()-5,Таблица!$A:$P,COLUMN()+1,0),\"\")","v":"2020-02-13"}]
[{"$f":"IFERROR(VLOOKUP(ROW()-5,Таблица!$A:$P,COLUMN()+1,0),\"\")","v":40},{"$f":"IFERROR(VLOOKUP(ROW()-5,Таблица!$A:$P,COLUMN()+1,0),\"\")","v":"Бокорезы"},{"$f":"IFERROR(VLOOKUP(ROW()-5,Таблица!$A:$P,COLUMN()+1,0),\"\")","v":"2-3"},{"$f":"IFERROR(VLOOKUP(ROW()-5,Таблица!$A:$P,COLUMN()+1,0),\"\")","v":"Выпрям."},{"$f":"IFERROR(VLOOKUP(ROW()-5,Таблица!$A:$P,COLUMN()+1,0),\"\")","v":"LOC100415755"},{"$f":"IFERROR(VLOOKUP(ROW()-5,Таблица!$A:$P,COLUMN()+1,0),\"\")","v":"2019-08-23"},{"$f":"IFERROR(VLOOKUP(ROW()-5,Таблица!$A:$P,COLUMN()+1,0),\"\")","v":"2020-08-23"},{"$f":"IFERROR(VLOOKUP(ROW()-5,Таблица!$A:$P,COLUMN()+1,0),\"\")","v":"2020-06-23"},{"$f":"IFERROR(VLOOKUP(ROW()-5,Таблица!$A:$P,COLUMN()+1,0),\"\")","v":"2019-11-18"},{"$f":"IFERROR(VLOOKUP(ROW()-5,Таблица!$A:$P,COLUMN()+1,0),\"\")","v":"2020-02-13"}]
{"$rows_left_out":43}
{"sheet":"Лист1","index":2,"n_rows":41,"n_cols":2,"rows_kept":41,"cut":false,"hidden":true,"merged":[]}
["Перчатки диэлектрические № 4","LOC100433954"]
["Перчатки диэлектрические № 5","LOC100433954"]
["Перчатки диэлектрические № 9","LOC100433954"]
["Перчатки диэлектрические № 10","LOC100433954"]
["Перчатки диэлектрические № 11","LOC100828099"]
["Перчатки диэлектрические № 31","LOC100433954"]
["Боты диэлектрические № 9","350010000716"]
["Боты диэлектрические № 10","LOC100827944"]
["Боты диэлектрические № 11","350010000715"]
["Боты диэлектрические № 12","LOC100416152"]
["Набор отверток № 1 ","LOC100431335"]
["Пассатижи 1-1","LOC100433506"]
["Круглогубцы 1-2","LOC100427548"]
["Бокорезы 1-3","LOC100415755"]
["Набор отверток № 2","LOC100431335"]
["Пассатижи 2-1","LOC100433506"]
["Круглогубцы 2-2","LOC100427548"]
["Бокорезы 2-3","LOC100415755"]
["Набор отверток № 3","LOC100431348"]
["Набор отверток № 4","LOC100431348"]
{"$rows_left_out":22}
{"sheet":"Лист2","index":3,"n_rows":0,"n_cols":0,"rows_kept":0,"cut":false,"hidden":false,"merged":[]}