{"text_format":"1","workbook":"xlsx","n_sheets":4,"sheets":["Таблица","Календарь","Лист1","Лист2"],"not_rendered":{"charts":0,"images":2,"macros":1,"external_links":0,"defined_names":1,"comments":0,"pivot_tables":0},"unopened":[],"bounds":{"document_bytes":16777216,"sheet_cells":100000,"rows_first":2000,"rows_last":500,"rows_between":2000,"halvings":0,"cell_chars":16384,"cell_head_chars":4096},"cells_cut":0,"cells_raw":0,"read":"whole","date_system":"1900"}

{"sheet":"Таблица","index":0,"n_rows":68,"n_cols":17,"rows_kept":68,"cut":false,"hidden":false,"merged":[[0,9,0,10],[0,2,0,5],[1,2,1,5]]}
[null,null,"СПИСОК",null,null,null,"на испытании",null,null,"проведен периодический осмотр"]
[null,null,"CИЗ, находящихся на участке связи № 5",null,null,null,{"$f":"TODAY()","v":"2020-10-03"}]
["В календарь","№ п/п","Наименование СИЗ","Поряд. № СИЗ","Место нахождения","Инв. №","Дата последнего годового испытания","Дата следующего испытания","Дата отправки на испытание","Дата периодического осмотра","Дата следующего квартального осмотра","Дата следующего квартального осмотра2","Дата следующего квартального осмотра3","Дата следующего квартального осмотра4","Дата следующего квартального осмотра5","Испытание ","Здесь нужна отметка"]
[{"$f":"IF(AND(EOMONTH(1&Календарь!$D$2,0)>=INDEX(B4:K4,MATCH(Календарь!$B$2,Календарь!$A$4:$J$4,)),INDEX(B4:K4,MATCH(Календарь!$B$2,Календарь!$A$4:$J$4,))>0,Q4=\"\"),MAX($A$1:A3)+1,\"\")","v":1},1,"Перчатки диэлектрические",4,"Выпрям.","LOC100433954","2020-03-11",{"$f":"IF(EDATE(G4,6)>91,EDATE(G4,6),-50)","v":"2020-09-11"},{"$f":"IF(EDATE(G4,4)>91,EDATE(G4,4),-50)","v":"2020-07-11"},{"$f":"G4+87","v":"2020-06-06"},{"$f":"J4+87","v":"2020-09-01"},null,null,null,null,"Испытание 1 раз в 6 мес., осмотр 1 раз в 3 мес."]
[{"$f":"IF(AND(EOMONTH(1&Календарь!$D$2,0)>=INDEX(B5:K5,MATCH(Календарь!$B$2,Календарь!$A$4:$J$4,)),INDEX(B5:K5,MATCH(Календарь!$B$2,Календарь!$A$4:$J$4,))>0,Q5=\"\"),MAX($A$1:A4)+1,\"\")","v":2},2,"Перчатки диэлектрические",5,"ВБ","LOC100433954","2020-03-11",{"$f":"IF(EDATE(G5,6)>91,EDATE(G5,6),-50)","v":"2020-09-11"},{"$f":"IF(EDATE(G5,4)>91,EDATE(G5,4),-50)","v":"2020-07-11"},{"$f":"G5+87","v":"2020-06-06"},{"$f":"J5+87","v":"2020-09-01"},null,null,null,null,"Испытание 1 раз в 6 мес., осмотр 1 раз в 3 мес."]
[{"$f":"IF(AND(EOMONTH(1&Календарь!$D$2,0)>=INDEX(B6:K6,MATCH(Календарь!$B$2,Календарь!$A$4:$J$4,)),INDEX(B6:K6,MATCH(Календарь!$B$2,Календарь!$A$4:$J$4,))>0,Q6=\"\"),MAX($A$1:A5)+1,\"\")","v":3},3,"Перчатки диэлектрические",31,"АТС","LOC100433954","2020-03-11",{"$f":"IF(EDATE(G6,6)>91,EDATE(G6,6),-50)","v":"2020-09-11"},{"$f":"IF(EDATE(G6,4)>91,EDATE(G6,4),-50)","v":"2020-07-11"},{"$f":"G6+87","v":"2020-06-06"},{"$f":"J6+87","v":"2020-09-01"},null,null,null,null,"Испытание 1 раз в 6 мес., осмотр 1 раз в 3 мес."]
[{"$f":"IF(AND(EOMONTH(1&Календарь!$D$2,0)>=INDEX(B7:K7,MATCH(Календарь!$B$2,Календарь!$A$4:$J$4,)),INDEX(B7:K7,MATCH(Календарь!$B$2,Календарь!$A$4:$J$4,))>0,Q7=\"\"),MAX($A$1:A6)+1,\"\")","v":""},4,"Перчатки диэлектрические",9,"ВБ","LOC100433954","2020-06-02",{"$f":"IF(EDATE(G7,6)>91,EDATE(G7,6),-50)","v":"2020-12-02"},{"$f":"IF(EDATE(G7,4)>91,EDATE(G7,4),-50)","v":"2020-10-02"},{"$f":"G7+87","v":"2020-08-28"},{"$f":"J7+87","v":"2020-11-23"},null,null,null,null,"Испытание 1 раз в 6 мес., осмотр 1 раз в 3 мес."]
[{"$f":"IF(AND(EOMONTH(1&Календарь!$D$2,0)>=INDEX(B8:K8,MATCH(Календарь!$B$2,Календарь!$A$4:$J$4,)),INDEX(B8:K8,MATCH(Календарь!$B$2,Календарь!$A$4:$J$4,))>0,Q8=\"\"),MAX($A$1:A7)+1,\"\")","v":""},5,"Перчатки диэлектрические",10,"Выпрям.","LOC100433954","2020-06-02","2020-12-02","2020-10-02","2020-08-28","2020-11-23",null,null,null,null,"Испытание 1 раз в 6 мес., осмотр 1 раз в 3 мес."]
[{"$f":"IF(AND(EOMONTH(1&Календарь!$D$2,0)>=INDEX(B9:K9,MATCH(Календарь!$B$2,Календарь!$A$4:$J$4,)),INDEX(B9:K9,MATCH(Календарь!$B$2,Календарь!$A$4:$J$4,))>0,Q9=\"\"),MAX($A$1:A8)+1,\"\")","v":""},6,"Перчатки диэлектрические (новые)",11,"Выпрям.","LOC100828099","?",null,null,null,null,null,null,null,null,"Испытание 1 раз в 6 мес., осмотр 1 раз в 3 мес."]
[{"$f":"IF(AND(EOMONTH(1&Календарь!$D$2,0)>=INDEX(B10:K10,MATCH(Календарь!$B$2,Календарь!$A$4:$J$4,)),INDEX(B10:K10,MATCH(Календарь!$B$2,Календарь!$A$4:$J$4,))>0,Q10=\"\"),MAX($A$1:A9)+1,\"\")","v":""},7,"Боты диэлектрические",12,"АТС","LOC100416152","2020-03-11",{"$f":"IF(EDATE(G10,36)>91,EDATE(G10,36),-50)","v":"2023-03-11"},{"$f":"IF(EDATE(G10,34)>91,EDATE(G10,34),-50)","v":"2023-01-11"},{"$f":"G10+175","v":"2020-09-02"},{"$f":"J10+175","v":"2021-02-24"},"2021-08-18","2022-02-09","2022-08-03","2023-01-25","Испытание 1 раз в 3 года, осмотр 1 раз в 6 мес."]
[{"$f":"IF(AND(EOMONTH(1&Календарь!$D$2,0)>=INDEX(B11:K11,MATCH(Календарь!$B$2,Календарь!$A$4:$J$4,)),INDEX(B11:K11,MATCH(Календарь!$B$2,Календарь!$A$4:$J$4,))>0,Q11=\"\"),MAX($A$1:A10)+1,\"\")","v":""},8,"Боты диэлектрические",11,"Выпрям.","350010000715","2019-02-19",{"$f":"IF(EDATE(G11,36)>91,EDATE(G11,36),-50)","v":"2022-02-19"},{"$f":"IF(EDATE(G11,34)>91,EDATE(G11,34),-50)","v":"2021-12-19"},{"$f":"G11+175","v":"2019-08-13"},"2020-02-04","2020-07-28","2021-01-19","2021-07-13","2022-01-04","Испытание 1 раз в 3 года, осмотр 1 раз в 6 мес."]
[{"$f":"IF(AND(EOMONTH(1&Календарь!$D$2,0)>=INDEX(B12:K12,MATCH(Календарь!$B$2,Календарь!$A$4:$J$4,)),INDEX(B12:K12,MATCH(Календарь!$B$2,Календарь!$A$4:$J$4,))>0,Q12=\"\"),MAX($A$1:A11)+1,\"\")","v":""},7,"Боты диэлектрические",9,"АТС","350010000716","2019-11-25",{"$f":"IF(EDATE(G12,36)>91,EDATE(G12,36),-50)","v":"2022-11-25"},{"$f":"IF(EDATE(G12,34)>91,EDATE(G12,34),-50)","v":"2022-09-25"},{"$f":"G12+175","v":"2020-05-18"},"2020-11-09","2021-05-03","2021-10-25","2022-04-18","2022-10-10","Испытание 1 раз в 3 года, осмотр 1 раз в 6 мес."]
[{"$f":"IF(AND(EOMONTH(1&Календарь!$D$2,0)>=INDEX(B13:K13,MATCH(Календарь!$B$2,Календарь!$A$4:$J$4,)),INDEX(B13:K13,MATCH(Календарь!$B$2,Календарь!$A$4:$J$4,))>0,Q13=\"\"),MAX($A$1:A12)+1,\"\")","v":""},7,"Боты диэлектрические (новые)",10,"Выпрям.","LOC100827944","?",null,null,null,null,null,null,null,null,"Испытание 1 раз в 3 года, осмотр 1 раз в 6 мес."]
[{"$f":"IF(AND(EOMONTH(1&Календарь!$D$2,0)>=INDEX(B14:K14,MATCH(Календарь!$B$2,Календарь!$A$4:$J$4,)),INDEX(B14:K14,MATCH(Календарь!$B$2,Календарь!$A$4:$J$4,))>0,Q14=\"\"),MAX($A$1:A13)+1,\"\")","v":4},11,"Индикатор напряж.ПИН90-2М",5,"Выпрям.","LOC100422167","2019-08-20",{"$f":"IF(EDATE(G14,12)>91,EDATE(G14,12),-50)","v":"2020-08-20"},{"$f":"IF(EDATE(G14,10)>91,EDATE(G14,10),-50)","v":"2020-06-20"},{"$f":"G14+87","v":"2019-11-15"},{"$f":"J14+87","v":"2020-02-10"},"2020-05-07","2020-08-02",null,null,"Испытание 1 раз в год осмотр 1 раз в 3 мес."]
[{"$f":"IF(AND(EOMONTH(1&Календарь!$D$2,0)>=INDEX(B15:K15,MATCH(Календарь!$B$2,Календарь!$A$4:$J$4,)),INDEX(B15:K15,MATCH(Календарь!$B$2,Календарь!$A$4:$J$4,))>0,Q15=\"\"),MAX($A$1:A14)+1,\"\")","v":5},12,"Индикатор ИНО-500 напряжения-отвертк",6,"АТС","LOC100422159","2019-08-20","2020-08-20","2020-06-20","2019-11-15","2020-02-10","2020-05-07","2020-08-02",null,null,"Испытание 1 раз в год осмотр 1 раз в 3 мес."]
[{"$f":"IF(AND(EOMONTH(1&Календарь!$D$2,0)>=INDEX(B16:K16,MATCH(Календарь!$B$2,Календарь!$A$4:$J$4,)),INDEX(B16:K16,MATCH(Календарь!$B$2,Календарь!$A$4:$J$4,))>0,Q16=\"\"),MAX($A$1:A15)+1,\"\")","v":6},13,"Индикатор ИНО-500 напряжения-отвертк",10,"ВБ","LOC100422159","2019-08-20","2020-08-20","2020-06-20","2019-11-15","2020-02-10","2020-05-07","2020-08-02",null,null,"Испытание 1 раз в год осмотр 1 раз в 3 мес."]
[{"$f":"IF(AND(EOMONTH(1&Календарь!$D$2,0)>=INDEX(B17:K17,MATCH(Календарь!$B$2,Календарь!$A$4:$J$4,)),INDEX(B17:K17,MATCH(Календарь!$B$2,Календарь!$A$4:$J$4,))>0,Q17=\"\"),MAX($A$1:A16)+1,\"\")","v":""},14,"Индикатор ИНО-500 напряжения-отвертк",9,"ВБ","LOC100422159","2019-11-25","2020-11-25","2020-09-25","2020-02-20",{"$f":"IF(EDATE(J17,3)>3,EDATE(J17,3),-3)","v":"2020-05-20"},{"$f":"K17+87","v":"2020-08-15"},"2020-11-10",null,null,"Испытание 1 раз в год осмотр 1 раз в 3 мес."]
[{"$f":"IF(AND(EOMONTH(1&Календарь!$D$2,0)>=INDEX(B18:K18,MATCH(Календарь!$B$2,Календарь!$A$4:$J$4,)),INDEX(B18:K18,MATCH(Календарь!$B$2,Календарь!$A$4:$J$4,))>0,Q18=\"\"),MAX($A$1:A17)+1,\"\")","v":""},15,"Индикатор ИНО-500 напряжения-отвертк",8,"АТС","LOC100422159","2019-11-25","2020-11-25","2020-09-25","2020-02-20",{"$f":"IF(EDATE(J18,3)>3,EDATE(J18,3),-3)","v":"2020-05-20"},"2020-08-15","2020-11-10",null,null,"Испытание 1 раз в год осмотр 1 раз в 3 мес."]
[null,null,"Индикатор ИНО-500 напряжения-отвертк",3,"Выпрям.","LOC100422159","2019-11-25",{"$f":"IF(EDATE(G19,12)>91,EDATE(G19,12),-50)","v":"2020-11-25"},{"$f":"IF(EDATE(G19,10)>91,EDATE(G19,10),-50)","v":"2020-09-25"},{"$f":"G19+87","v":"2020-02-20"},{"$f":"IF(EDATE(J19,3)>3,EDATE(J19,3),-3)","v":"2020-05-20"},{"$f":"K19+87","v":"2020-08-15"},{"$f":"L19+87","v":"2020-11-10"},null,null,"Испытание 1 раз в год осмотр 1 раз в 3 мес."]
[{"$f":"IF(AND(EOMONTH(1&Календарь!$D$2,0)>=INDEX(B20:K20,MATCH(Календарь!$B$2,Календарь!$A$4:$J$4,)),INDEX(B20:K20,MATCH(Календарь!$B$2,Календарь!$A$4:$J$4,))>0,Q20=\"\"),MAX($A$1:A18)+1,\"\")","v":""},16,"Индикатор напряж.ПИН90-2М",7,"Выпрям.","LOC100422167","2019-11-25","2020-11-25","2020-09-25","2020-02-20",{"$f":"IF(EDATE(J20,3)>3,EDATE(J20,3),-3)","v":"2020-05-20"},"2020-08-15","2020-11-10",null,null,"Испытание 1 раз в год осмотр 1 раз в 3 мес."]
[{"$f":"IF(AND(EOMONTH(1&Календарь!$D$2,0)>=INDEX(B21:K21,MATCH(Календарь!$B$2,Календарь!$A$4:$J$4,)),INDEX(B21:K21,MATCH(Календарь!$B$2,Календарь!$A$4:$J$4,))>0,Q21=\"\"),MAX($A$1:A20)+1,\"\")","v":""},18,"Ковер диэлектрический  ","1-7","ЛАЗ",null,null,null,null,"2020-06-25",{"$f":"J21+175","v":"2020-12-17"},"2021-06-10","2021-12-02","2022-05-26","2022-11-17","Осмотр 1 раз в 6 месяца"]
[{"$f":"IF(AND(EOMONTH(1&Календарь!$D$2,0)>=INDEX(B22:K22,MATCH(Календарь!$B$2,Календарь!$A$4:$J$4,)),INDEX(B22:K22,MATCH(Календарь!$B$2,Календарь!$A$4:$J$4,))>0,Q22=\"\"),MAX($A$1:A21)+1,\"\")","v":""},19,"Ковер диэлектрический  ","8-9","АТС",null,null,null,null,"2020-06-25","2020-12-17","2021-06-10","2021-12-02","2022-05-26","2022-11-17","Осмотр 1 раз в 6 месяца"]
[{"$f":"IF(AND(EOMONTH(1&Календарь!$D$2,0)>=INDEX(B23:K23,MATCH(Календарь!$B$2,Календарь!$A$4:$J$4,)),INDEX(B23:K23,MATCH(Календарь!$B$2,Календарь!$A$4:$J$4,))>0,Q23=\"\"),MAX($A$1:A22)+1,\"\")","v":""},20,"Ковер диэлектрический  ","10-14","Выпрям.",null,null,null,null,"2020-06-25","2020-12-17","2021-06-10","2021-12-02","2022-05-26","2022-11-17","Осмотр 1 раз в 6 месяца"]
[{"$f":"IF(AND(EOMONTH(1&Календарь!$D$2,0)>=INDEX(B24:K24,MATCH(Календарь!$B$2,Календарь!$A$4:$J$4,)),INDEX(B24:K24,MATCH(Календарь!$B$2,Календарь!$A$4:$J$4,))>0,Q24=\"\"),MAX($A$1:A23)+1,\"\")","v":""},22,"Отвертка","1-1","КАЗ №2","LOC100431335","2019-11-25",{"$f":"IF(EDATE(G24,12)>91,EDATE(G24,12),-50)","v":"2020-11-25"},{"$f":"IF(EDATE(G24,10)>91,EDATE(G24,10),-50)","v":"2020-09-25"},{"$f":"G24+87","v":"2020-02-20"},{"$f":"J24+87","v":"2020-05-17"},"2020-08-12","2020-11-07",null,null,"Испытание 1 раз в год осмотр 1 раз в 3 мес."]
[{"$f":"IF(AND(EOMONTH(1&Календарь!$D$2,0)>=INDEX(B25:K25,MATCH(Календарь!$B$2,Календарь!$A$4:$J$4,)),INDEX(B25:K25,MATCH(Календарь!$B$2,Календарь!$A$4:$J$4,))>0,Q25=\"\"),MAX($A$1:A24)+1,\"\")","v":""},23,"Отвертка","1-2","КАЗ №2","LOC100431335","2019-11-25","2020-11-25","2020-09-25",{"$f":"J24","v":"2020-02-20"},"2020-05-17","2020-08-12","2020-11-07",null,null,"Испытание 1 раз в год осмотр 1 раз в 3 мес."]
[{"$f":"IF(AND(EOMONTH(1&Календарь!$D$2,0)>=INDEX(B26:K26,MATCH(Календарь!$B$2,Календарь!$A$4:$J$4,)),INDEX(B26:K26,MATCH(Календарь!$B$2,Календарь!$A$4:$J$4,))>0,Q26=\"\"),MAX($A$1:A25)+1,\"\")","v":""},24,"Отвертка","1-3","КАЗ №2","LOC100431335","2019-11-25","2020-11-25","2020-09-25",{"$f":"J24","v":"2020-02-20"},"2020-05-17","2020-08-12","2020-11-07",null,null,"Испытание 1 раз в год осмотр 1 раз в 3 мес."]
[{"$f":"IF(AND(EOMONTH(1&Календарь!$D$2,0)>=INDEX(B27:K27,MATCH(Календарь!$B$2,Календарь!$A$4:$J$4,)),INDEX(B27:K27,MATCH(Календарь!$B$2,Календарь!$A$4:$J$4,))>0,Q27=\"\"),MAX($A$1:A26)+1,\"\")","v":""},25,"Отвертка","1-4","КАЗ №2","LOC100431335","2019-11-25","2020-11-25","2020-09-25",{"$f":"J24","v":"2020-02-20"},"2020-05-17","2020-08-12","2020-11-07",null,null,"Испытание 1 раз в год осмотр 1 раз в 3 мес."]
[{"$f":"IF(AND(EOMONTH(1&Календарь!$D$2,0)>=INDEX(B28:K28,MATCH(Календарь!$B$2,Календарь!$A$4:$J$4,)),INDEX(B28:K28,MATCH(Календарь!$B$2,Календарь!$A$4:$J$4,))>0,Q28=\"\"),MAX($A$1:A27)+1,\"\")","v":""},26,"Отвертка","1-5","КАЗ №2","LOC100431335","2019-11-25","2020-11-25","2020-09-25",{"$f":"J24","v":"2020-02-20"},"2020-05-17","2020-08-12","2020-11-07",null,null,"Испытание 1 раз в год осмотр 1 раз в 3 мес."]
[{"$f":"IF(AND(EOMONTH(1&Календарь!$D$2,0)>=INDEX(B29:K29,MATCH(Календарь!$B$2,Календарь!$A$4:$J$4,)),INDEX(B29:K29,MATCH(Календарь!$B$2,Календарь!$A$4:$J$4,))>0,Q29=\"\"),MAX($A$1:A28)+1,\"\")","v":""},27,"Отвертка","1-6","КАЗ №2","LOC100431335","2019-11-25","2020-11-25","2020-09-25",{"$f":"J24","v":"2020-02-20"},"2020-05-17","2020-08-12","2020-11-07",null,null,"Испытание 1 раз в год осмотр 1 раз в 3 мес."]
[{"$f":"IF(AND(EOMONTH(1&Календарь!$D$2,0)>=INDEX(B30:K30,MATCH(Календарь!$B$2,Календарь!$A$4:$J$4,)),INDEX(B30:K30,MATCH(Календарь!$B$2,Календарь!$A$4:$J$4,))>0,Q30=\"\"),MAX($A$1:A29)+1,\"\")","v":""},28,"Пассатижи","1-1","КАЗ №2","LOC100433506","2019-11-25","2020-11-25","2020-09-25",{"$f":"G30+87","v":"2020-02-20"},"2020-05-17","2020-08-12","2020-11-07",null,null,"Испытание 1 раз в год осмотр 1 раз в 3 мес."]
[{"$f":"IF(AND(EOMONTH(1&Календарь!$D$2,0)>=INDEX(B31:K31,MATCH(Календарь!$B$2,Календарь!$A$4:$J$4,)),INDEX(B31:K31,MATCH(Календарь!$B$2,Календарь!$A$4:$J$4,))>0,Q31=\"\"),MAX($A$1:A30)+1,\"\")","v":""},29,"Круглогубцы","1-2","КАЗ №2","LOC100427548","2019-11-25","2020-11-25","2020-09-25",{"$f":"G31+87","v":"2020-02-20"},"2020-05-17","2020-08-12","2020-11-07",null,null,"Испытание 1 раз в год осмотр 1 раз в 3 мес."]
[{"$f":"IF(AND(EOMONTH(1&Календарь!$D$2,0)>=INDEX(B32:K32,MATCH(Календарь!$B$2,Календарь!$A$4:$J$4,)),INDEX(B32:K32,MATCH(Календарь!$B$2,Календарь!$A$4:$J$4,))>0,Q32=\"\"),MAX($A$1:A31)+1,\"\")","v":""},30,"Бокорезы","1-3","КАЗ №2","LOC100415755","2019-11-25","2020-11-25","2020-09-25",{"$f":"G32+87","v":"2020-02-20"},"2020-05-17","2020-08-12","2020-11-07",null,null,"Испытание 1 раз в год осмотр 1 раз в 3 мес."]
[{"$f":"IF(AND(EOMONTH(1&Календарь!$D$2,0)>=INDEX(B33:K33,MATCH(Календарь!$B$2,Календарь!$A$4:$J$4,)),INDEX(B33:K33,MATCH(Календарь!$B$2,Календарь!$A$4:$J$4,))>0,Q33=\"\"),MAX($A$1:A32)+1,\"\")","v":7},32,"Отвертка","2-1","Выпрям.","LOC100431335","2019-08-23","2020-08-23","2020-06-23","2020-02-13","2020-05-10","2020-08-05","2020-10-31",null,null,"Испытание 1 раз в год осмотр 1 раз в 3 мес."]
[{"$f":"IF(AND(EOMONTH(1&Календарь!$D$2,0)>=INDEX(B34:K34,MATCH(Календарь!$B$2,Календарь!$A$4:$J$4,)),INDEX(B34:K34,MATCH(Календарь!$B$2,Календарь!$A$4:$J$4,))>0,Q34=\"\"),MAX($A$1:A33)+1,\"\")","v":8},33,"Отвертка","2-2","Выпрям.","LOC100431335","2019-08-23","2020-08-23","2020-06-23",{"$f":"J33","v":"2020-02-13"},"2020-05-10","2020-08-05","2020-10-31",null,null,"Испытание 1 раз в год осмотр 1 раз в 3 мес."]
[{"$f":"IF(AND(EOMONTH(1&Календарь!$D$2,0)>=INDEX(B35:K35,MATCH(Календарь!$B$2,Календарь!$A$4:$J$4,)),INDEX(B35:K35,MATCH(Календарь!$B$2,Календарь!$A$4:$J$4,))>0,Q35=\"\"),MAX($A$1:A34)+1,\"\")","v":9},34,"Отвертка","2-3","Выпрям.","LOC100431335","2019-08-23","2020-08-23","2020-06-23",{"$f":"J33","v":"2020-02-13"},"2020-05-10","2020-08-05","2020-10-31",null,null,"Испытание 1 раз в год осмотр 1 раз в 3 мес."]
[{"$f":"IF(AND(EOMONTH(1&Календарь!$D$2,0)>=INDEX(B36:K36,MATCH(Календарь!$B$2,Календарь!$A$4:$J$4,)),INDEX(B36:K36,MATCH(Календарь!$B$2,Календарь!$A$4:$J$4,))>0,Q36=\"\"),MAX($A$1:A35)+1,\"\")","v":10},35,"Отвертка","2-4","Выпрям.","LOC100431335","2019-08-23","2020-08-23","2020-06-23",{"$f":"J33","v":"2020-02-13"},"2020-05-10","2020-08-05","2020-10-31",null,null,"Испытание 1 раз в год осмотр 1 раз в 3 мес."]
[{"$f":"IF(AND(EOMONTH(1&Календарь!$D$2,0)>=INDEX(B37:K37,MATCH(Календарь!$B$2,Календарь!$A$4:$J$4,)),INDEX(B37:K37,MATCH(Календарь!$B$2,Календарь!$A$4:$J$4,))>0,Q37=\"\"),MAX($A$1:A36)+1,\"\")","v":11},36,"Отвертка","2-5","Выпрям.","LOC100431335","2019-08-23","2020-08-23","2020-06-23",{"$f":"J33","v":"2020-02-13"},"2020-05-10","2020-08-05","2020-10-31",null,null,"Испытание 1 раз в год осмотр 1 раз в 3 мес."]
[{"$f":"IF(AND(EOMONTH(1&Календарь!$D$2,0)>=INDEX(B38:K38,MATCH(Календарь!$B$2,Календарь!$A$4:$J$4,)),INDEX(B38:K38,MATCH(Календарь!$B$2,Календарь!$A$4:$J$4,))>0,Q38=\"\"),MAX($A$1:A37)+1,\"\")","v":12},37,"Отвертка","2-6","Выпрям.","LOC100431335","2019-08-23","2020-08-23","2020-06-23",{"$f":"J33","v":"2020-02-13"},"2020-05-10","2020-08-05","2020-10-31",null,null,"Испытание 1 раз в год осмотр 1 раз в 3 мес."]
[{"$f":"IF(AND(EOMONTH(1&Календарь!$D$2,0)>=INDEX(B39:K39,MATCH(Календарь!$B$2,Календарь!$A$4:$J$4,)),INDEX(B39:K39,MATCH(Календарь!$B$2,Календарь!$A$4:$J$4,))>0,Q39=\"\"),MAX($A$1:A38)+1,\"\")","v":13},38,"Пассатижи","2-1","Выпрям.","LOC100433506","2019-08-23","2020-08-23","2020-06-23",{"$f":"G39+87","v":"2019-11-18"},"2020-02-13","2020-05-10","2020-08-05",null,null,"Испытание 1 раз в год осмотр 1 раз в 3 мес."]
[{"$f":"IF(AND(EOMONTH(1&Календарь!$D$2,0)>=INDEX(B40:K40,MATCH(Календарь!$B$2,Календарь!$A$4:$J$4,)),INDEX(B40:K40,MATCH(Календарь!$B$2,Календарь!$A$4:$J$4,))>0,Q40=\"\"),MAX($A$1:A39)+1,\"\")","v":14},39,"Круглогубцы","2-2","Выпрям.","LOC100427548","2019-08-23","2020-08-23","2020-06-23",{"$f":"G40+87","v":"2019-11-18"},"2020-02-13","2020-05-10","2020-08-05",null,null,"Испытание 1 раз в год осмотр 1 раз в 3 мес."]
[{"$f":"IF(AND(EOMONTH(1&Календарь!$D$2,0)>=INDEX(B41:K41,MATCH(Календарь!$B$2,Календарь!$A$4:$J$4,)),INDEX(B41:K41,MATCH(Календарь!$B$2,Календарь!$A$4:$J$4,))>0,Q41=\"\"),MAX($A$1:A40)+1,\"\")","v":15},40,"Бокорезы","2-3","Выпрям.","LOC100415755","2019-08-23","2020-08-23","2020-06-23",{"$f":"G41+87","v":"2019-11-18"},"2020-02-13","2020-05-10","2020-08-05",null,null,"Испытание 1 раз в год осмотр 1 раз в 3 мес."]
[{"$f":"IF(AND(EOMONTH(1&Календарь!$D$2,0)>=INDEX(B42:K42,MATCH(Календарь!$B$2,Календарь!$A$4:$J$4,)),INDEX(B42:K42,MATCH(Календарь!$B$2,Календарь!$A$4:$J$4,))>0,Q42=\"\"),MAX($A$1:A41)+1,\"\")","v":16},42,"Отвертка","3-1","АТС","LOC100431348","2019-08-19","2020-08-19","2020-06-19","2020-02-09","2020-05-06","2020-08-01","2020-10-27",null,null,"Испытание 1 раз в год осмотр 1 раз в 3 мес."]
[{"$f":"IF(AND(EOMONTH(1&Календарь!$D$2,0)>=INDEX(B43:K43,MATCH(Календарь!$B$2,Календарь!$A$4:$J$4,)),INDEX(B43:K43,MATCH(Календарь!$B$2,Календарь!$A$4:$J$4,))>0,Q43=\"\"),MAX($A$1:A42)+1,\"\")","v":17},43,"Отвертка","3-2","АТС","LOC100431348","2019-08-19","2020-08-19","2020-06-19",{"$f":"J42","v":"2020-02-09"},"2020-05-06","2020-08-01","2020-10-27",null,null,"Испытание 1 раз в год осмотр 1 раз в 3 мес."]
[{"$f":"IF(AND(EOMONTH(1&Календарь!$D$2,0)>=INDEX(B44:K44,MATCH(Календарь!$B$2,Календарь!$A$4:$J$4,)),INDEX(B44:K44,MATCH(Календарь!$B$2,Календарь!$A$4:$J$4,))>0,Q44=\"\"),MAX($A$1:A43)+1,\"\")","v":18},44,"Отвертка","3-3","АТС","LOC100431348","2019-08-19","2020-08-19","2020-06-19",{"$f":"J42","v":"2020-02-09"},"2020-05-06","2020-08-01","2020-10-27",null,null,"Испытание 1 раз в год осмотр 1 раз в 3 мес."]
[{"$f":"IF(AND(EOMONTH(1&Календарь!$D$2,0)>=INDEX(B45:K45,MATCH(Календарь!$B$2,Календарь!$A$4:$J$4,)),INDEX(B45:K45,MATCH(Календарь!$B$2,Календарь!$A$4:$J$4,))>0,Q45=\"\"),MAX($A$1:A44)+1,\"\")","v":19},45,"Отвертка","3-4","АТС","LOC100431348","2019-08-19","2020-08-19","2020-06-19",{"$f":"J42","v":"2020-02-09"},"2020-05-06","2020-08-01","2020-10-27",null,null,"Испытание 1 раз в год осмотр 1 раз в 3 мес."]
[{"$f":"IF(AND(EOMONTH(1&Календарь!$D$2,0)>=INDEX(B46:K46,MATCH(Календарь!$B$2,Календарь!$A$4:$J$4,)),INDEX(B46:K46,MATCH(Календарь!$B$2,Календарь!$A$4:$J$4,))>0,Q46=\"\"),MAX($A$1:A45)+1,\"\")","v":20},46,"Отвертка","3-5","АТС","LOC100431348","2019-08-19","2020-08-19","2020-06-19",{"$f":"J42","v":"2020-02-09"},"2020-05-06","2020-08-01","2020-10-27",null,null,"Испытание 1 раз в год осмотр 1 раз в 3 мес."]
[{"$f":"IF(AND(EOMONTH(1&Календарь!$D$2,0)>=INDEX(B47:K47,MATCH(Календарь!$B$2,Календарь!$A$4:$J$4,)),INDEX(B47:K47,MATCH(Календарь!$B$2,Календарь!$A$4:$J$4,))>0,Q47=\"\"),MAX($A$1:A46)+1,\"\")","v":21},47,"Отвертка","3-6","АТС","LOC100431348","2019-08-19","2020-08-19","2020-06-19",{"$f":"J42","v":"2020-02-09"},"2020-05-06","2020-08-01","2020-10-27",null,null,"Испытание 1 раз в год осмотр 1 раз в 3 мес."]
[{"$f":"IF(AND(EOMONTH(1&Календарь!$D$2,0)>=INDEX(B48:K48,MATCH(Календарь!$B$2,Календарь!$A$4:$J$4,)),INDEX(B48:K48,MATCH(Календарь!$B$2,Календарь!$A$4:$J$4,))>0,Q48=\"\"),MAX($A$1:A47)+1,\"\")","v":22},49,"Отвертка","4-1","ВБ","LOC100431348","2019-08-19","2020-08-19","2020-06-19","2020-02-09","2020-05-06","2020-08-01","2020-10-27",null,null,"Испытание 1 раз в год осмотр 1 раз в 3 мес."]
[{"$f":"IF(AND(EOMONTH(1&Календарь!$D$2,0)>=INDEX(B49:K49,MATCH(Календарь!$B$2,Календарь!$A$4:$J$4,)),INDEX(B49:K49,MATCH(Календарь!$B$2,Календарь!$A$4:$J$4,))>0,Q49=\"\"),MAX($A$1:A48)+1,\"\")","v":23},50,"Отвертка","4-2","ВБ","LOC100431348","2019-08-19","2020-08-19","2020-06-19",{"$f":"J48","v":"2020-02-09"},"2020-05-06","2020-08-01","2020-10-27",null,null,"Испытание 1 раз в год осмотр 1 раз в 3 мес."]
[{"$f":"IF(AND(EOMONTH(1&Календарь!$D$2,0)>=INDEX(B50:K50,MATCH(Календарь!$B$2,Календарь!$A$4:$J$4,)),INDEX(B50:K50,MATCH(Календарь!$B$2,Календарь!$A$4:$J$4,))>0,Q50=\"\"),MAX($A$1:A49)+1,\"\")","v":24},51,"Отвертка","4-3","ВБ","LOC100431348","2019-08-19","2020-08-19","2020-06-19",{"$f":"J48","v":"2020-02-09"},"2020-05-06","2020-08-01","2020-10-27",null,null,"Испытание 1 раз в год осмотр 1 раз в 3 мес."]
[{"$f":"IF(AND(EOMONTH(1&Календарь!$D$2,0)>=INDEX(B51:K51,MATCH(Календарь!$B$2,Календарь!$A$4:$J$4,)),INDEX(B51:K51,MATCH(Календарь!$B$2,Календарь!$A$4:$J$4,))>0,Q51=\"\"),MAX($A$1:A50)+1,\"\")","v":25},52,"Отвертка","4-4","ВБ","LOC100431348","2019-08-19","2020-08-19","2020-06-19",{"$f":"J48","v":"2020-02-09"},"2020-05-06","2020-08-01","2020-10-27",null,null,"Испытание 1 раз в год осмотр 1 раз в 3 мес."]
[{"$f":"IF(AND(EOMONTH(1&Календарь!$D$2,0)>=INDEX(B52:K52,MATCH(Календарь!$B$2,Календарь!$A$4:$J$4,)),INDEX(B52:K52,MATCH(Календарь!$B$2,Календарь!$A$4:$J$4,))>0,Q52=\"\"),MAX($A$1:A51)+1,\"\")","v":26},53,"Отвертка","4-5","ВБ","LOC100431348","2019-08-19","2020-08-19","2020-06-19",{"$f":"J48","v":"2020-02-09"},"2020-05-06","2020-08-01","2020-10-27",null,null,"Испытание 1 раз в год осмотр 1 раз в 3 мес."]
[{"$f":"IF(AND(EOMONTH(1&Календарь!$D$2,0)>=INDEX(B53:K53,MATCH(Календарь!$B$2,Календарь!$A$4:$J$4,)),INDEX(B53:K53,MATCH(Календарь!$B$2,Календарь!$A$4:$J$4,))>0,Q53=\"\"),MAX($A$1:A52)+1,\"\")","v":27},54,"Отвертка","4-6","ВБ","LOC100431348","2019-08-19","2020-08-19","2020-06-19",{"$f":"J48","v":"2020-02-09"},"2020-05-06","2020-08-01","2020-10-27",null,null,"Испытание 1 раз в год осмотр 1 раз в 3 мес."]
[{"$f":"IF(AND(EOMONTH(1&Календарь!$D$2,0)>=INDEX(B54:K54,MATCH(Календарь!$B$2,Календарь!$A$4:$J$4,)),INDEX(B54:K54,MATCH(Календарь!$B$2,Календарь!$A$4:$J$4,))>0,Q54=\"\"),MAX($A$1:A53)+1,\"\")","v":""},56,"Лестница-стремян.Elkop ALW 403 3х56,5",1,"КАЗ №2","LOC100834072","2020-01-28","2021-01-28","2020-11-28",null,null,null,null,null,null,"Испытание 1 раз в год"]
[null,57,"Лестница-стремян.Elkop ALW 506 6х121",2,"КАЗ №2","LOC100834073","2020-08-26","2021-08-26","2021-06-26"]
[{"$f":"IF(AND(EOMONTH(1&Календарь!$D$2,0)>=INDEX(B56:K56,MATCH(Календарь!$B$2,Календарь!$A$4:$J$4,)),INDEX(B56:K56,MATCH(Календарь!$B$2,Календарь!$A$4:$J$4,))>0,Q56=\"\"),MAX($A$1:A54)+1,\"\")","v":28},59,"Электропаяльник ЭПСИ-40/220В",1,"КАЗ №2","LOC100448622","2020-03-11",{"$f":"IF(EDATE(G56,6)>91,EDATE(G56,6),-50)","v":"2020-09-11"},{"$f":"IF(EDATE(G56,4)>91,EDATE(G56,4),-50)","v":"2020-07-11"},null,null,null,null,null,null,"Испытание 1 раз в 6 месяцев"]
[{"$f":"IF(AND(EOMONTH(1&Календарь!$D$2,0)>=INDEX(B57:K57,MATCH(Календарь!$B$2,Календарь!$A$4:$J$4,)),INDEX(B57:K57,MATCH(Календарь!$B$2,Календарь!$A$4:$J$4,))>0,Q57=\"\"),MAX($A$1:A56)+1,\"\")","v":29},60,"Электропаяльник ЭПСИ-40/220В",2,"КАЗ №2","LOC100448622","2020-03-11","2020-09-11","2020-07-11",null,null,null,null,null,null,"Испытание 1 раз в 6 месяцев"]
[{"$f":"IF(AND(EOMONTH(1&Календарь!$D$2,0)>=INDEX(B58:K58,MATCH(Календарь!$B$2,Календарь!$A$4:$J$4,)),INDEX(B58:K58,MATCH(Календарь!$B$2,Календарь!$A$4:$J$4,))>0,Q58=\"\"),MAX($A$1:A57)+1,\"\")","v":30},61,"Электропаяльник ЭПСИ-40/220В",3,"КАЗ №2","LOC100448622","2020-03-11","2020-09-11","2020-07-11",null,null,null,null,null,null,"Испытание 1 раз в 6 месяцев"]
[{"$f":"IF(AND(EOMONTH(1&Календарь!$D$2,0)>=INDEX(B59:K59,MATCH(Календарь!$B$2,Календарь!$A$4:$J$4,)),INDEX(B59:K59,MATCH(Календарь!$B$2,Календарь!$A$4:$J$4,))>0,Q59=\"\"),MAX($A$1:A58)+1,\"\")","v":31},62,"Электропаяльник ЭПСИ-40/220В",4,"КАЗ №2","LOC100448622","2020-03-11","2020-09-11","2020-07-11",null,null,null,null,null,null,"Испытание 1 раз в 6 месяцев"]
[{"$f":"IF(AND(EOMONTH(1&Календарь!$D$2,0)>=INDEX(B60:K60,MATCH(Календарь!$B$2,Календарь!$A$4:$J$4,)),INDEX(B60:K60,MATCH(Календарь!$B$2,Календарь!$A$4:$J$4,))>0,Q60=\"\"),MAX($A$1:A59)+1,\"\")","v":32},63,"Электропаяльник ЭПСН-100/220В",1,"КАЗ №2","LOC100448624","2020-03-11","2020-09-11","2020-07-11",null,null,null,null,null,null,"Испытание 1 раз в 6 месяцев"]
[{"$f":"IF(AND(EOMONTH(1&Календарь!$D$2,0)>=INDEX(B61:K61,MATCH(Календарь!$B$2,Календарь!$A$4:$J$4,)),INDEX(B61:K61,MATCH(Календарь!$B$2,Календарь!$A$4:$J$4,))>0,Q61=\"\"),MAX($A$1:A60)+1,\"\")","v":33},64,"Электропаяльник ЭПСН-100/220В",2,"КАЗ №2","LOC100448624","2020-03-11","2020-09-11","2020-07-11",null,null,null,null,null,null,"Испытание 1 раз в 6 месяцев"]
[{"$f":"IF(AND(EOMONTH(1&Календарь!$D$2,0)>=INDEX(B62:K62,MATCH(Календарь!$B$2,Календарь!$A$4:$J$4,)),INDEX(B62:K62,MATCH(Календарь!$B$2,Календарь!$A$4:$J$4,))>0,Q62=\"\"),MAX($A$1:A61)+1,\"\")","v":34},66,"Машина шлифовальная  МА 2001",null,"КАЗ №2","350000043351","2020-03-11","2020-09-11","2020-07-11",null,null,null,null,null,null,"Испытание 1 раз в 6 месяцев"]
[{"$f":"IF(AND(EOMONTH(1&Календарь!$D$2,0)>=INDEX(B63:K63,MATCH(Календарь!$B$2,Календарь!$A$4:$J$4,)),INDEX(B63:K63,MATCH(Календарь!$B$2,Календарь!$A$4:$J$4,))>0,Q63=\"\"),MAX($A$1:A62)+1,\"\")","v":35},67,"Машина электрическая перфорационная МЭП-500 ЭРУ",null,"КАЗ №2","350000043521","2020-03-11","2020-09-11","2020-07-11",null,null,null,null,null,null,"Испытание 1 раз в 6 месяцев"]
[{"$f":"IF(AND(EOMONTH(1&Календарь!$D$2,0)>=INDEX(B64:K64,MATCH(Календарь!$B$2,Календарь!$A$4:$J$4,)),INDEX(B64:K64,MATCH(Календарь!$B$2,Календарь!$A$4:$J$4,))>0,Q64=\"\"),MAX($A$1:A63)+1,\"\")","v":36},68,"Дрель Интерскол Д-16/1050Р2 безударная",null,"КАЗ №2","LOC100733042","2020-03-11","2020-09-11","2020-07-11",null,null,null,null,null,null,"Испытание 1 раз в 6 месяцев"]
[{"$f":"IF(AND(EOMONTH(1&Календарь!$D$2,0)>=INDEX(B65:K65,MATCH(Календарь!$B$2,Календарь!$A$4:$J$4,)),INDEX(B65:K65,MATCH(Календарь!$B$2,Календарь!$A$4:$J$4,))>0,Q65=\"\"),MAX($A$1:A64)+1,\"\")","v":""},69,"Удлинитель EKF Эксперт UBA16-310-4-05 5м",null,"КАЗ №2","LOC100715318","на испытании",null,null,null,null,null,null,null,null,"Испытание 1 раз в 6 месяцев"]
[{"$f":"IF(AND(EOMONTH(1&Календарь!$D$2,0)>=INDEX(B66:K66,MATCH(Календарь!$B$2,Календарь!$A$4:$J$4,)),INDEX(B66:K66,MATCH(Календарь!$B$2,Календарь!$A$4:$J$4,))>0,Q66=\"\"),MAX($A$1:A65)+1,\"\")","v":""},70,"Удлинитель UNIVersal У10-555 5м 4гн",null,"Каб.нач.","LOC100443989","на испытании",null,null,null,null,null,null,null,null,"Испытание 1 раз в 6 месяцев"]
[null,null,"Фильтр сетев.ZIS Pilot-PRO( 5роз)+1 3м",2,"КАЗ №2","LOC100444829","2020-03-11",{"$f":"IF(EDATE(G67,6)>91,EDATE(G67,6),-50)","v":"2020-09-11"},{"$f":"IF(EDATE(G67,4)>91,EDATE(G67,4),-50)","v":"2020-07-11"},null,null,null,null,null,null,"Испытание 1 раз в 6 месяцев"]
[{"$f":"IF(AND(EOMONTH(1&Календарь!$D$2,0)>=INDEX(B68:K68,MATCH(Календарь!$B$2,Календарь!$A$4:$J$4,)),INDEX(B68:K68,MATCH(Календарь!$B$2,Календарь!$A$4:$J$4,))>0,Q68=\"\"),MAX($A$1:A66)+1,\"\")","v":37},71,"Фильтр сетев.ZIS Pilot-PRO( 5роз)+1 3м",1,"Каб.нач.","LOC100444829","2019-11-25",{"$f":"IF(EDATE(G68,6)>91,EDATE(G68,6),-50)","v":"2020-05-25"},{"$f":"IF(EDATE(G68,4)>91,EDATE(G68,4),-50)","v":"2020-03-25"},null,null,null,null,null,null,"Испытание 1 раз в 6 месяцев"]

{"sheet":"Календарь","index":1,"n_rows":62,"n_cols":12,"rows_kept":62,"cut":false,"hidden":false,"merged":[[7,11,17,14],[2,0,3,0],[0,1,0,4],[2,5,3,5],[2,4,3,4],[2,3,3,3],[2,2,3,2],[2,1,3,1],[0,5,0,7]]}
[null,"СПИСОК СИЗ на",null,null,null,{"$f":"TODAY()","v":"2020-10-03"}]
[null,"годового испытания",null,"октябрь"]
["№ п/п","Наименование СИЗ","Поряд. № СИЗ","Место нахождения","Инв. №","Дата последнего годового испытания ","Дата следующего","Дата ","Дата ","Дата следующего "]
[null,null,null,null,null,null,"годового испытания","отправки на испытание","периодического осмотра","квартального осмотра"]
[null,1,2,3,4,5,6,7,9,10]
[{"$f":"IFERROR(VLOOKUP(ROW()-5,Таблица!$A:$P,COLUMN()+1,0),\"\")","v":1},{"$f":"IFERROR(VLOOKUP(ROW()-5,Таблица!$A:$P,COLUMN()+1,0),\"\")","v":"Перчатки диэлектрические"},{"$f":"IFERROR(VLOOKUP(ROW()-5,Таблица!$A:$P,COLUMN()+1,0),\"\")","v":4},{"$f":"IFERROR(VLOOKUP(ROW()-5,Таблица!$A:$P,COLUMN()+1,0),\"\")","v":"Выпрям."},{"$f":"IFERROR(VLOOKUP(ROW()-5,Таблица!$A:$P,COLUMN()+1,0),\"\")","v":"LOC100433954"},{"$f":"IFERROR(VLOOKUP(ROW()-5,Таблица!$A:$P,COLUMN()+1,0),\"\")","v":"2020-03-11"},{"$f":"IFERROR(VLOOKUP(ROW()-5,Таблица!$A:$P,COLUMN()+1,0),\"\")","v":"2020-09-11"},{"$f":"IFERROR(VLOOKUP(ROW()-5,Таблица!$A:$P,COLUMN()+1,0),\"\")","v":"2020-07-11"},{"$f":"IFERROR(VLOOKUP(ROW()-5,Таблица!$A:$P,COLUMN()+1,0),\"\")","v":"2020-06-06"},{"$f":"IFERROR(VLOOKUP(ROW()-5,Таблица!$A:$P,COLUMN()+1,0),\"\")","v":"2020-09-01"}]
[{"$f":"IFERROR(VLOOKUP(ROW()-5,Таблица!$A:$P,COLUMN()+1,0),\"\")","v":2},{"$f":"IFERROR(VLOOKUP(ROW()-5,Таблица!$A:$P,COLUMN()+1,0),\"\")","v":"Перчатки диэлектрические"},{"$f":"IFERROR(VLOOKUP(ROW()-5,Таблица!$A:$P,COLUMN()+1,0),\"\")","v":5},{"$f":"IFERROR(VLOOKUP(ROW()-5,Таблица!$A:$P,COLUMN()+1,0),\"\")","v":"ВБ"},{"$f":"IFERROR(VLOOKUP(ROW()-5,Таблица!$A:$P,COLUMN()+1,0),\"\")","v":"LOC100433954"},{"$f":"IFERROR(VLOOKUP(ROW()-5,Таблица!$A:$P,COLUMN()+1,0),\"\")","v":"2020-03-11"},{"$f":"IFERROR(VLOOKUP(ROW()-5,Таблица!$A:$P,COLUMN()+1,0),\"\")","v":"2020-09-11"},{"$f":"IFERROR(VLOOKUP(ROW()-5,Таблица!$A:$P,COLUMN()+1,0),\"\")","v":"2020-07-11"},{"$f":"IFERROR(VLOOKUP(ROW()-5,Таблица!$A:$P,COLUMN()+1,0),\"\")","v":"2020-06-06"},{"$f":"IFERROR(VLOOKUP(ROW()-5,Таблица!$A:$P,COLUMN()+1,0),\"\")","v":"2020-09-01"}]
[{"$f":"IFERROR(VLOOKUP(ROW()-5,Таблица!$A:$P,COLUMN()+1,0),\"\")","v":3},{"$f":"IFERROR(VLOOKUP(ROW()-5,Таблица!$A:$P,COLUMN()+1,0),\"\")","v":"Перчатки диэлектрические"},{"$f":"IFERROR(VLOOKUP(ROW()-5,Таблица!$A:$P,COLUMN()+1,0),\"\")","v":31},{"$f":"IFERROR(VLOOKUP(ROW()-5,Таблица!$A:$P,COLUMN()+1,0),\"\")","v":"АТС"},{"$f":"IFERROR(VLOOKUP(ROW()-5,Таблица!$A:$P,COLUMN()+1,0),\"\")","v":"LOC100433954"},{"$f":"IFERROR(VLOOKUP(ROW()-5,Таблица!$A:$P,COLUMN()+1,0),\"\")","v":"2020-03-11"},{"$f":"IFERROR(VLOOKUP(ROW()-5,Таблица!$A:$P,COLUMN()+1,0),\"\")","v":"2020-09-11"},{"$f":"IFERROR(VLOOKUP(ROW()-5,Таблица!$A:$P,COLUMN()+1,0),\"\")","v":"2020-07-11"},{"$f":"IFERROR(VLOOKUP(ROW()-5,Таблица!$A:$P,COLUMN()+1,0),\"\")","v":"2020-06-06"},{"$f":"IFERROR(VLOOKUP(ROW()-5,Таблица!$A:$P,COLUMN()+1,0),\"\")","v":"2020-09-01"},null,"Уважаемые Екселисты,здравствуйте! Подскажите мне, пожалуйста! Как мне сохранить файл без кнопки \"Сохранить в файл\" и формул (просто числа), что в макросе нужно заменить! Спасибо большое!!!!"]
[{"$f":"IFERROR(VLOOKUP(ROW()-5,Таблица!$A:$P,COLUMN()+1,0),\"\")","v":11},{"$f":"IFERROR(VLOOKUP(ROW()-5,Таблица!$A:$P,COLUMN()+1,0),\"\")","v":"Индикатор напряж.ПИН90-2М"},{"$f":"IFERROR(VLOOKUP(ROW()-5,Таблица!$A:$P,COLUMN()+1,0),\"\")","v":5},{"$f":"IFERROR(VLOOKUP(ROW()-5,Таблица!$A:$P,COLUMN()+1,0),\"\")","v":"Выпрям."},{"$f":"IFERROR(VLOOKUP(ROW()-5,Таблица!$A:$P,COLUMN()+1,0),\"\")","v":"LOC100422167"},{"$f":"IFERROR(VLOOKUP(ROW()-5,Таблица!$A:$P,COLUMN()+1,0),\"\")","v":"2019-08-20"},{"$f":"IFERROR(VLOOKUP(ROW()-5,Таблица!$A:$P,COLUMN()+1,0),\"\")","v":"2020-08-20"},{"$f":"IFERROR(VLOOKUP(ROW()-5,Таблица!$A:$P,COLUMN()+1,0),\"\")","v":"2020-06-20"},{"$f":"IFERROR(VLOOKUP(ROW()-5,Таблица!$A:$P,COLUMN()+1,0),\"\")","v":"2019-11-15"},{"$f":"IFERROR(VLOOKUP(ROW()-5,Таблица!$A:$P,COLUMN()+1,0),\"\")","v":"2020-02-10"}]
[{"$f":"IFERROR(VLOOKUP(ROW()-5,Таблица!$A:$P,COLUMN()+1,0),\"\")","v":12},{"$f":"IFERROR(VLOOKUP(ROW()-5,Таблица!$A:$P,COLUMN()+1,0),\"\")","v":"Индикатор ИНО-500 напряжения-отвертк"},{"$f":"IFERROR(VLOOKUP(ROW()-5,Таблица!$A:$P,COLUMN()+1,0),\"\")","v":6},{"$f":"IFERROR(VLOOKUP(ROW()-5,Таблица!$A:$P,COLUMN()+1,0),\"\")","v":"АТС"},{"$f":"IFERROR(VLOOKUP(ROW()-5,Таблица!$A:$P,COLUMN()+1,0),\"\")","v":"LOC100422159"},{"$f":"IFERROR(VLOOKUP(ROW()-5,Таблица!$A:$P,COLUMN()+1,0),\"\")","v":"2019-08-20"},{"$f":"IFERROR(VLOOKUP(ROW()-5,Таблица!$A:$P,COLUMN()+1,0),\"\")","v":"2020-08-20"},{"$f":"IFERROR(VLOOKUP(ROW()-5,Таблица!$A:$P,COLUMN()+1,0),\"\")","v":"2020-06-20"},{"$f":"IFERROR(VLOOKUP(ROW()-5,Таблица!$A:$P,COLUMN()+1,0),\"\")","v":"2019-11-15"},{"$f":"IFERROR(VLOOKUP(ROW()-5,Таблица!$A:$P,COLUMN()+1,0),\"\")","v":"2020-02-10"}]
[{"$f":"IFERROR(VLOOKUP(ROW()-5,Таблица!$A:$P,COLUMN()+1,0),\"\")","v":13},{"$f":"IFERROR(VLOOKUP(ROW()-5,Таблица!$A:$P,COLUMN()+1,0),\"\")","v":"Индикатор ИНО-500 напряжения-отвертк"},{"$f":"IFERROR(VLOOKUP(ROW()-5,Таблица!$A:$P,COLUMN()+1,0),\"\")","v":10},{"$f":"IFERROR(VLOOKUP(ROW()-5,Таблица!$A:$P,COLUMN()+1,0),\"\")","v":"ВБ"},{"$f":"IFERROR(VLOOKUP(ROW()-5,Таблица!$A:$P,COLUMN()+1,0),\"\")","v":"LOC100422159"},{"$f":"IFERROR(VLOOKUP(ROW()-5,Таблица!$A:$P,COLUMN()+1,0),\"\")","v":"2019-08-20"},{"$f":"IFERROR(VLOOKUP(ROW()-5,Таблица!$A:$P,COLUMN()+1,0),\"\")","v":"2020-08-20"},{"$f":"IFERROR(VLOOKUP(ROW()-5,Таблица!$A:$P,COLUMN()+1,0),\"\")","v":"2020-06-20"},{"$f":"IFERROR(VLOOKUP(ROW()-5,Таблица!$A:$P,COLUMN()+1,0),\"\")","v":"2019-11-15"},{"$f":"IFERROR(VLOOKUP(ROW()-5,Таблица!$A:$P,COLUMN()+1,0),\"\")","v":"2020-02-10"}]
[{"$f":"IFERROR(VLOOKUP(ROW()-5,Таблица!$A:$P,COLUMN()+1,0),\"\")","v":32},{"$f":"IFERROR(VLOOKUP(ROW()-5,Таблица!$A:$P,COLUMN()+1,0),\"\")","v":"Отвертка"},{"$f":"IFERROR(VLOOKUP(ROW()-5,Таблица!$A:$P,COLUMN()+1,0),\"\")","v":"2-1"},{"$f":"IFERROR(VLOOKUP(ROW()-5,Таблица!$A:$P,COLUMN()+1,0),\"\")","v":"Выпрям."},{"$f":"IFERROR(VLOOKUP(ROW()-5,Таблица!$A:$P,COLUMN()+1,0),\"\")","v":"LOC100431335"},{"$f":"IFERROR(VLOOKUP(ROW()-5,Таблица!$A:$P,COLUMN()+1,0),\"\")","v":"2019-08-23"},{"$f":"IFERROR(VLOOKUP(ROW()-5,Таблица!$A:$P,COLUMN()+1,0),\"\")","v":"2020-08-23"},{"$f":"IFERROR(VLOOKUP(ROW()-5,Таблица!$A:$P,COLUMN()+1,0),\"\")","v":"2020-06-23"},{"$f":"IFERROR(VLOOKUP(ROW()-5,Таблица!$A:$P,COLUMN()+1,0),\"\")","v":"2020-02-13"},{"$f":"IFERROR(VLOOKUP(ROW()-5,Таблица!$A:$P,COLUMN()+1,0),\"\")","v":"2020-05-10"}]
[{"$f":"IFERROR(VLOOKUP(ROW()-5,Таблица!$A:$P,COLUMN()+1,0),\"\")","v":33},{"$f":"IFERROR(VLOOKUP(ROW()-5,Таблица!$A:$P,COLUMN()+1,0),\"\")","v":"Отвертка"},{"$f":"IFERROR(VLOOKUP(ROW()-5,Таблица!$A:$P,COLUMN()+1,0),\"\")","v":"2-2"},{"$f":"IFERROR(VLOOKUP(ROW()-5,Таблица!$A:$P,COLUMN()+1,0),\"\")","v":"Выпрям."},{"$f":"IFERROR(VLOOKUP(ROW()-5,Таблица!$A:$P,COLUMN()+1,0),\"\")","v":"LOC100431335"},{"$f":"IFERROR(VLOOKUP(ROW()-5,Таблица!$A:$P,COLUMN()+1,0),\"\")","v":"2019-08-23"},{"$f":"IFERROR(VLOOKUP(ROW()-5,Таблица!$A:$P,COLUMN()+1,0),\"\")","v":"2020-08-23"},{"$f":"IFERROR(VLOOKUP(ROW()-5,Таблица!$A:$P,COLUMN()+1,0),\"\")","v":"2020-06-23"},{"$f":"IFERROR(VLOOKUP(ROW()-5,Таблица!$A:$P,COLUMN()+1,0),\"\")","v":"2020-02-13"},{"$f":"IFERROR(VLOOKUP(ROW()-5,Таблица!$A:$P,COLUMN()+1,0),\"\")","v":"2020-05-10"}]
[{"$f":"IFERROR(VLOOKUP(ROW()-5,Таблица!$A:$P,COLUMN()+1,0),\"\")","v":34},{"$f":"IFERROR(VLOOKUP(ROW()-5,Таблица!$A:$P,COLUMN()+1,0),\"\")","v":"Отвертка"},{"$f":"IFERROR(VLOOKUP(ROW()-5,Таблица!$A:$P,COLUMN()+1,0),\"\")","v":"2-3"},{"$f":"IFERROR(VLOOKUP(ROW()-5,Таблица!$A:$P,COLUMN()+1,0),\"\")","v":"Выпрям."},{"$f":"IFERROR(VLOOKUP(ROW()-5,Таблица!$A:$P,COLUMN()+1,0),\"\")","v":"LOC100431335"},{"$f":"IFERROR(VLOOKUP(ROW()-5,Таблица!$A:$P,COLUMN()+1,0),\"\")","v":"2019-08-23"},{"$f":"IFERROR(VLOOKUP(ROW()-5,Таблица!$A:$P,COLUMN()+1,0),\"\")","v":"2020-08-23"},{"$f":"IFERROR(VLOOKUP(ROW()-5,Таблица!$A:$P,COLUMN()+1,0),\"\")","v":"2020-06-23"},{"$f":"IFERROR(VLOOKUP(ROW()-5,Таблица!$A:$P,COLUMN()+1,0),\"\")","v":"2020-02-13"},{"$f":"IFERROR(VLOOKUP(ROW()-5,Таблица!$A:$P,COLUMN()+1,0),\"\")","v":"2020-05-10"}]
[{"$f":"IFERROR(VLOOKUP(ROW()-5,Таблица!$A:$P,COLUMN()+1,0),\"\")","v":35},{"$f":"IFERROR(VLOOKUP(ROW()-5,Таблица!$A:$P,COLUMN()+1,0),\"\")","v":"Отвертка"},{"$f":"IFERROR(VLOOKUP(ROW()-5,Таблица!$A:$P,COLUMN()+1,0),\"\")","v":"2-4"},{"$f":"IFERROR(VLOOKUP(ROW()-5,Таблица!$A:$P,COLUMN()+1,0),\"\")","v":"Выпрям."},{"$f":"IFERROR(VLOOKUP(ROW()-5,Таблица!$A:$P,COLUMN()+1,0),\"\")","v":"LOC100431335"},{"$f":"IFERROR(VLOOKUP(ROW()-5,Таблица!$A:$P,COLUMN()+1,0),\"\")","v":"2019-08-23"},{"$f":"IFERROR(VLOOKUP(ROW()-5,Таблица!$A:$P,COLUMN()+1,0),\"\")","v":"2020-08-23"},{"$f":"IFERROR(VLOOKUP(ROW()-5,Таблица!$A:$P,COLUMN()+1,0),\"\")","v":"2020-06-23"},{"$f":"IFERROR(VLOOKUP(ROW()-5,Таблица!$A:$P,COLUMN()+1,0),\"\")","v":"2020-02-13"},{"$f":"IFERROR(VLOOKUP(ROW()-5,Таблица!$A:$P,COLUMN()+1,0),\"\")","v":"2020-05-10"}]
[{"$f":"IFERROR(VLOOKUP(ROW()-5,Таблица!$A:$P,COLUMN()+1,0),\"\")","v":36},{"$f":"IFERROR(VLOOKUP(ROW()-5,Таблица!$A:$P,COLUMN()+1,0),\"\")","v":"Отвертка"},{"$f":"IFERROR(VLOOKUP(ROW()-5,Таблица!$A:$P,COLUMN()+1,0),\"\")","v":"2-5"},{"$f":"IFERROR(VLOOKUP(ROW()-5,Таблица!$A:$P,COLUMN()+1,0),\"\")","v":"Выпрям."},{"$f":"IFERROR(VLOOKUP(ROW()-5,Таблица!$A:$P,COLUMN()+1,0),\"\")","v":"LOC100431335"},{"$f":"IFERROR(VLOOKUP(ROW()-5,Таблица!$A:$P,COLUMN()+1,0),\"\")","v":"2019-08-23"},{"$f":"IFERROR(VLOOKUP(ROW()-5,Таблица!$A:$P,COLUMN()+1,0),\"\")","v":"2020-08-23"},{"$f":"IFERROR(VLOOKUP(ROW()-5,Таблица!$A:$P,COLUMN()+1,0),\"\")","v":"2020-06-23"},{"$f":"IFERROR(VLOOKUP(ROW()-5,Таблица!$A:$P,COLUMN()+1,0),\"\")","v":"2020-02-13"},{"$f":"IFERROR(VLOOKUP(ROW()-5,Таблица!$A:$P,COLUMN()+1,0),\"\")","v":"2020-05-10"}]
[{"$f":"IFERROR(VLOOKUP(ROW()-5,Таблица!$A:$P,COLUMN()+1,0),\"\")","v":37},{"$f":"IFERROR(VLOOKUP(ROW()-5,Таблица!$A:$P,COLUMN()+1,0),\"\")","v":"Отвертка"},{"$f":"IFERROR(VLOOKUP(ROW()-5,Таблица!$A:$P,COLUMN()+1,0),\"\")","v":"2-6"},{"$f":"IFERROR(VLOOKUP(ROW()-5,Таблица!$A:$P,COLUMN()+1,0),\"\")","v":"Выпрям."},{"$f":"IFERROR(VLOOKUP(ROW()-5,Таблица!$A:$P,COLUMN()+1,0),\"\")","v":"LOC100431335"},{"$f":"IFERROR(VLOOKUP(ROW()-5,Таблица!$A:$P,COLUMN()+1,0),\"\")","v":"2019-08-23"},{"$f":"IFERROR(VLOOKUP(ROW()-5,Таблица!$A:$P,COLUMN()+1,0),\"\")","v":"2020-08-23"},{"$f":"IFERROR(VLOOKUP(ROW()-5,Таблица!$A:$P,COLUMN()+1,0),\"\")","v":"2020-06-23"},{"$f":"IFERROR(VLOOKUP(ROW()-5,Таблица!$A:$P,COLUMN()+1,0),\"\")","v":"2020-02-13"},{"$f":"IFERROR(VLOOKUP(ROW()-5,Таблица!$A:$P,COLUMN()+1,0),\"\")","v":"2020-05-10"}]
[{"$f":"IFERROR(VLOOKUP(ROW()-5,Таблица!$A:$P,COLUMN()+1,0),\"\")","v":38},{"$f":"IFERROR(VLOOKUP(ROW()-5,Таблица!$A:$P,COLUMN()+1,0),\"\")","v":"Пассатижи"},{"$f":"IFERROR(VLOOKUP(ROW()-5,Таблица!$A:$P,COLUMN()+1,0),\"\")","v":"2-1"},{"$f":"IFERROR(VLOOKUP(ROW()-5,Таблица!$A:$P,COLUMN()+1,0),\"\")","v":"Выпрям."},{"$f":"IFERROR(VLOOKUP(ROW()-5,Таблица!$A:$P,COLUMN()+1,0),\"\")","v":"LOC100433506"},{"$f":"IFERROR(VLOOKUP(ROW()-5,Таблица!$A:$P,COLUMN()+1,0),\"\")","v":"2019-08-23"},{"$f":"IFERROR(VLOOKUP(ROW()-5,Таблица!$A:$P,COLUMN()+1,0),\"\")","v":"2020-08-23"},{"$f":"IFERROR(VLOOKUP(ROW()-5,Таблица!$A:$P,COLUMN()+1,0),\"\")","v":"2020-06-23"},{"$f":"IFERROR(VLOOKUP(ROW()-5,Таблица!$A:$P,COLUMN()+1,0),\"\")","v":"2019-11-18"},{"$f":"IFERROR(VLOOKUP(ROW()-5,Таблица!$A:$P,COLUMN()+1,0),\"\")","v":"2020-02-13"}]
[{"$f":"IFERROR(VLOOKUP(ROW()-5,Таблица!$A:$P,COLUMN()+1,0),\"\")","v":39},{"$f":"IFERROR(VLOOKUP(ROW()-5,Таблица!$A:$P,COLUMN()+1,0),\"\")","v":"Круглогубцы"},{"$f":"IFERROR(VLOOKUP(ROW()-5,Таблица!$A:$P,COLUMN()+1,0),\"\")","v":"2-2"},{"$f":"IFERROR(VLOOKUP(ROW()-5,Таблица!$A:$P,COLUMN()+1,0),\"\")","v":"Выпрям."},{"$f":"IFERROR(VLOOKUP(ROW()-5,Таблица!$A:$P,COLUMN()+1,0),\"\")","v":"LOC100427548"},{"$f":"IFERROR(VLOOKUP(ROW()-5,Таблица!$A:$P,COLUMN()+1,0),\"\")","v":"2019-08-23"},{"$f":"IFERROR(VLOOKUP(ROW()-5,Таблица!$A:$P,COLUMN()+1,0),\"\")","v":"2020-08-23"},{"$f":"IFERROR(VLOOKUP(ROW()-5,Таблица!$A:$P,COLUMN()+1,0),\"\")","v":"2020-06-23"},{"$f":"IFERROR(VLOOKUP(ROW()-5,Таблица!$A:$P,COLUMN()+1,0),\"\")","v":"2019-11-18"},{"$f":"IFERROR(VLOOKUP(ROW()-5,Таблица!$A:$P,COLUMN()+1,0),\"\")","v":"2020-02-13"}]
[{"$f":"IFERROR(VLOOKUP(ROW()-5,Таблица!$A:$P,COLUMN()+1,0),\"\")","v":40},{"$f":"IFERROR(VLOOKUP(ROW()-5,Таблица!$A:$P,COLUMN()+1,0),\"\")","v":"Бокорезы"},{"$f":"IFERROR(VLOOKUP(ROW()-5,Таблица!$A:$P,COLUMN()+1,0),\"\")","v":"2-3"},{"$f":"IFERROR(VLOOKUP(ROW()-5,Таблица!$A:$P,COLUMN()+1,0),\"\")","v":"Выпрям."},{"$f":"IFERROR(VLOOKUP(ROW()-5,Таблица!$A:$P,COLUMN()+1,0),\"\")","v":"LOC100415755"},{"$f":"IFERROR(VLOOKUP(ROW()-5,Таблица!$A:$P,COLUMN()+1,0),\"\")","v":"2019-08-23"},{"$f":"IFERROR(VLOOKUP(ROW()-5,Таблица!$A:$P,COLUMN()+1,0),\"\")","v":"2020-08-23"},{"$f":"IFERROR(VLOOKUP(ROW()-5,Таблица!$A:$P,COLUMN()+1,0),\"\")","v":"2020-06-23"},{"$f":"IFERROR(VLOOKUP(ROW()-5,Таблица!$A:$P,COLUMN()+1,0),\"\")","v":"2019-11-18"},{"$f":"IFERROR(VLOOKUP(ROW()-5,Таблица!$A:$P,COLUMN()+1,0),\"\")","v":"2020-02-13"}]
[{"$f":"IFERROR(VLOOKUP(ROW()-5,Таблица!$A:$P,COLUMN()+1,0),\"\")","v":42},{"$f":"IFERROR(VLOOKUP(ROW()-5,Таблица!$A:$P,COLUMN()+1,0),\"\")","v":"Отвертка"},{"$f":"IFERROR(VLOOKUP(ROW()-5,Таблица!$A:$P,COLUMN()+1,0),\"\")","v":"3-1"},{"$f":"IFERROR(VLOOKUP(ROW()-5,Таблица!$A:$P,COLUMN()+1,0),\"\")","v":"АТС"},{"$f":"IFERROR(VLOOKUP(ROW()-5,Таблица!$A:$P,COLUMN()+1,0),\"\")","v":"LOC100431348"},{"$f":"IFERROR(VLOOKUP(ROW()-5,Таблица!$A:$P,COLUMN()+1,0),\"\")","v":"2019-08-19"},{"$f":"IFERROR(VLOOKUP(ROW()-5,Таблица!$A:$P,COLUMN()+1,0),\"\")","v":"2020-08-19"},{"$f":"IFERROR(VLOOKUP(ROW()-5,Таблица!$A:$P,COLUMN()+1,0),\"\")","v":"2020-06-19"},{"$f":"IFERROR(VLOOKUP(ROW()-5,Таблица!$A:$P,COLUMN()+1,0),\"\")","v":"2020-02-09"},{"$f":"IFERROR(VLOOKUP(ROW()-5,Таблица!$A:$P,COLUMN()+1,0),\"\")","v":"2020-05-06"}]
[{"$f":"IFERROR(VLOOKUP(ROW()-5,Таблица!$A:$P,COLUMN()+1,0),\"\")","v":43},{"$f":"IFERROR(VLOOKUP(ROW()-5,Таблица!$A:$P,COLUMN()+1,0),\"\")","v":"Отвертка"},{"$f":"IFERROR(VLOOKUP(ROW()-5,Таблица!$A:$P,COLUMN()+1,0),\"\")","v":"3-2"},{"$f":"IFERROR(VLOOKUP(ROW()-5,Таблица!$A:$P,COLUMN()+1,0),\"\")","v":"АТС"},{"$f":"IFERROR(VLOOKUP(ROW()-5,Таблица!$A:$P,COLUMN()+1,0),\"\")","v":"LOC100431348"},{"$f":"IFERROR(VLOOKUP(ROW()-5,Таблица!$A:$P,COLUMN()+1,0),\"\")","v":"2019-08-19"},{"$f":"IFERROR(VLOOKUP(ROW()-5,Таблица!$A:$P,COLUMN()+1,0),\"\")","v":"2020-08-19"},{"$f":"IFERROR(VLOOKUP(ROW()-5,Таблица!$A:$P,COLUMN()+1,0),\"\")","v":"2020-06-19"},{"$f":"IFERROR(VLOOKUP(ROW()-5,Таблица!$A:$P,COLUMN()+1,0),\"\")","v":"2020-02-09"},{"$f":"IFERROR(VLOOKUP(ROW()-5,Таблица!$A:$P,COLUMN()+1,0),\"\")","v":"2020-05-06"}]
[{"$f":"IFERROR(VLOOKUP(ROW()-5,Таблица!$A:$P,COLUMN()+1,0),\"\")","v":44},{"$f":"IFERROR(VLOOKUP(ROW()-5,Таблица!$A:$P,COLUMN()+1,0),\"\")","v":"Отвертка"},{"$f":"IFERROR(VLOOKUP(ROW()-5,Таблица!$A:$P,COLUMN()+1,0),\"\")","v":"3-3"},{"$f":"IFERROR(VLOOKUP(ROW()-5,Таблица!$A:$P,COLUMN()+1,0),\"\")","v":"АТС"},{"$f":"IFERROR(VLOOKUP(ROW()-5,Таблица!$A:$P,COLUMN()+1,0),\"\")","v":"LOC100431348"},{"$f":"IFERROR(VLOOKUP(ROW()-5,Таблица!$A:$P,COLUMN()+1,0),\"\")","v":"2019-08-19"},{"$f":"IFERROR(VLOOKUP(ROW()-5,Таблица!$A:$P,COLUMN()+1,0),\"\")","v":"2020-08-19"},{"$f":"IFERROR(VLOOKUP(ROW()-5,Таблица!$A:$P,COLUMN()+1,0),\"\")","v":"2020-06-19"},{"$f":"IFERROR(VLOOKUP(ROW()-5,Таблица!$A:$P,COLUMN()+1,0),\"\")","v":"2020-02-09"},{"$f":"IFERROR(VLOOKUP(ROW()-5,Таблица!$A:$P,COLUMN()+1,0),\"\")","v":"2020-05-06"}]
[{"$f":"IFERROR(VLOOKUP(ROW()-5,Таблица!$A:$P,COLUMN()+1,0),\"\")","v":45},{"$f":"IFERROR(VLOOKUP(ROW()-5,Таблица!$A:$P,COLUMN()+1,0),\"\")","v":"Отвертка"},{"$f":"IFERROR(VLOOKUP(ROW()-5,Таблица!$A:$P,COLUMN()+1,0),\"\")","v":"3-4"},{"$f":"IFERROR(VLOOKUP(ROW()-5,Таблица!$A:$P,COLUMN()+1,0),\"\")","v":"АТС"},{"$f":"IFERROR(VLOOKUP(ROW()-5,Таблица!$A:$P,COLUMN()+1,0),\"\")","v":"LOC100431348"},{"$f":"IFERROR(VLOOKUP(ROW()-5,Таблица!$A:$P,COLUMN()+1,0),\"\")","v":"2019-08-19"},{"$f":"IFERROR(VLOOKUP(ROW()-5,Таблица!$A:$P,COLUMN()+1,0),\"\")","v":"2020-08-19"},{"$f":"IFERROR(VLOOKUP(ROW()-5,Таблица!$A:$P,COLUMN()+1,0),\"\")","v":"2020-06-19"},{"$f":"IFERROR(VLOOKUP(ROW()-5,Таблица!$A:$P,COLUMN()+1,0),\"\")","v":"2020-02-09"},{"$f":"IFERROR(VLOOKUP(ROW()-5,Таблица!$A:$P,COLUMN()+1,0),\"\")","v":"2020-05-06"}]
[{"$f":"IFERROR(VLOOKUP(ROW()-5,Таблица!$A:$P,COLUMN()+1,0),\"\")","v":46},{"$f":"IFERROR(VLOOKUP(ROW()-5,Таблица!$A:$P,COLUMN()+1,0),\"\")","v":"Отвертка"},{"$f":"IFERROR(VLOOKUP(ROW()-5,Таблица!$A:$P,COLUMN()+1,0),\"\")","v":"3-5"},{"$f":"IFERROR(VLOOKUP(ROW()-5,Таблица!$A:$P,COLUMN()+1,0),\"\")","v":"АТС"},{"$f":"IFERROR(VLOOKUP(ROW()-5,Таблица!$A:$P,COLUMN()+1,0),\"\")","v":"LOC100431348"},{"$f":"IFERROR(VLOOKUP(ROW()-5,Таблица!$A:$P,COLUMN()+1,0),\"\")","v":"2019-08-19"},{"$f":"IFERROR(VLOOKUP(ROW()-5,Таблица!$A:$P,COLUMN()+1,0),\"\")","v":"2020-08-19"},{"$f":"IFERROR(VLOOKUP(ROW()-5,Таблица!$A:$P,COLUMN()+1,0),\"\")","v":"2020-06-19"},{"$f":"IFERROR(VLOOKUP(ROW()-5,Таблица!$A:$P,COLUMN()+1,0),\"\")","v":"2020-02-09"},{"$f":"IFERROR(VLOOKUP(ROW()-5,Таблица!$A:$P,COLUMN()+1,0),\"\")","v":"2020-05-06"}]
[{"$f":"IFERROR(VLOOKUP(ROW()-5,Таблица!$A:$P,COLUMN()+1,0),\"\")","v":47},{"$f":"IFERROR(VLOOKUP(ROW()-5,Таблица!$A:$P,COLUMN()+1,0),\"\")","v":"Отвертка"},{"$f":"IFERROR(VLOOKUP(ROW()-5,Таблица!$A:$P,COLUMN()+1,0),\"\")","v":"3-6"},{"$f":"IFERROR(VLOOKUP(ROW()-5,Таблица!$A:$P,COLUMN()+1,0),\"\")","v":"АТС"},{"$f":"IFERROR(VLOOKUP(ROW()-5,Таблица!$A:$P,COLUMN()+1,0),\"\")","v":"LOC100431348"},{"$f":"IFERROR(VLOOKUP(ROW()-5,Таблица!$A:$P,COLUMN()+1,0),\"\")","v":"2019-08-19"},{"$f":"IFERROR(VLOOKUP(ROW()-5,Таблица!$A:$P,COLUMN()+1,0),\"\")","v":"2020-08-19"},{"$f":"IFERROR(VLOOKUP(ROW()-5,Таблица!$A:$P,COLUMN()+1,0),\"\")","v":"2020-06-19"},{"$f":"IFERROR(VLOOKUP(ROW()-5,Таблица!$A:$P,COLUMN()+1,0),\"\")","v":"2020-02-09"},{"$f":"IFERROR(VLOOKUP(ROW()-5,Таблица!$A:$P,COLUMN()+1,0),\"\")","v":"2020-05-06"}]
[{"$f":"IFERROR(VLOOKUP(ROW()-5,Таблица!$A:$P,COLUMN()+1,0),\"\")","v":49},{"$f":"IFERROR(VLOOKUP(ROW()-5,Таблица!$A:$P,COLUMN()+1,0),\"\")","v":"Отвертка"},{"$f":"IFERROR(VLOOKUP(ROW()-5,Таблица!$A:$P,COLUMN()+1,0),\"\")","v":"4-1"},{"$f":"IFERROR(VLOOKUP(ROW()-5,Таблица!$A:$P,COLUMN()+1,0),\"\")","v":"ВБ"},{"$f":"IFERROR(VLOOKUP(ROW()-5,Таблица!$A:$P,COLUMN()+1,0),\"\")","v":"LOC100431348"},{"$f":"IFERROR(VLOOKUP(ROW()-5,Таблица!$A:$P,COLUMN()+1,0),\"\")","v":"2019-08-19"},{"$f":"IFERROR(VLOOKUP(ROW()-5,Таблица!$A:$P,COLUMN()+1,0),\"\")","v":"2020-08-19"},{"$f":"IFERROR(VLOOKUP(ROW()-5,Таблица!$A:$P,COLUMN()+1,0),\"\")","v":"2020-06-19"},{"$f":"IFERROR(VLOOKUP(ROW()-5,Таблица!$A:$P,COLUMN()+1,0),\"\")","v":"2020-02-09"},{"$f":"IFERROR(VLOOKUP(ROW()-5,Таблица!$A:$P,COLUMN()+1,0),\"\")","v":"2020-05-06"}]
[{"$f":"IFERROR(VLOOKUP(ROW()-5,Таблица!$A:$P,COLUMN()+1,0),\"\")","v":50},{"$f":"IFERROR(VLOOKUP(ROW()-5,Таблица!$A:$P,COLUMN()+1,0),\"\")","v":"Отвертка"},{"$f":"IFERROR(VLOOKUP(ROW()-5,Таблица!$A:$P,COLUMN()+1,0),\"\")","v":"4-2"},{"$f":"IFERROR(VLOOKUP(ROW()-5,Таблица!$A:$P,COLUMN()+1,0),\"\")","v":"ВБ"},{"$f":"IFERROR(VLOOKUP(ROW()-5,Таблица!$A:$P,COLUMN()+1,0),\"\")","v":"LOC100431348"},{"$f":"IFERROR(VLOOKUP(ROW()-5,Таблица!$A:$P,COLUMN()+1,0),\"\")","v":"2019-08-19"},{"$f":"IFERROR(VLOOKUP(ROW()-5,Таблица!$A:$P,COLUMN()+1,0),\"\")","v":"2020-08-19"},{"$f":"IFERROR(VLOOKUP(ROW()-5,Таблица!$A:$P,COLUMN()+1,0),\"\")","v":"2020-06-19"},{"$f":"IFERROR(VLOOKUP(ROW()-5,Таблица!$A:$P,COLUMN()+1,0),\"\")","v":"2020-02-09"},{"$f":"IFERROR(VLOOKUP(ROW()-5,Таблица!$A:$P,COLUMN()+1,0),\"\")","v":"2020-05-06"}]
[{"$f":"IFERROR(VLOOKUP(ROW()-5,Таблица!$A:$P,COLUMN()+1,0),\"\")","v":51},{"$f":"IFERROR(VLOOKUP(ROW()-5,Таблица!$A:$P,COLUMN()+1,0),\"\")","v":"Отвертка"},{"$f":"IFERROR(VLOOKUP(ROW()-5,Таблица!$A:$P,COLUMN()+1,0),\"\")","v":"4-3"},{"$f":"IFERROR(VLOOKUP(ROW()-5,Таблица!$A:$P,COLUMN()+1,0),\"\")","v":"ВБ"},{"$f":"IFERROR(VLOOKUP(ROW()-5,Таблица!$A:$P,COLUMN()+1,0),\"\")","v":"LOC100431348"},{"$f":"IFERROR(VLOOKUP(ROW()-5,Таблица!$A:$P,COLUMN()+1,0),\"\")","v":"2019-08-19"},{"$f":"IFERROR(VLOOKUP(ROW()-5,Таблица!$A:$P,COLUMN()+1,0),\"\")","v":"2020-08-19"},{"$f":"IFERROR(VLOOKUP(ROW()-5,Таблица!$A:$P,COLUMN()+1,0),\"\")","v":"2020-06-19"},{"$f":"IFERROR(VLOOKUP(ROW()-5,Таблица!$A:$P,COLUMN()+1,0),\"\")","v":"2020-02-09"},{"$f":"IFERROR(VLOOKUP(ROW()-5,Таблица!$A:$P,COLUMN()+1,0),\"\")","v":"2020-05-06"}]
[{"$f":"IFERROR(VLOOKUP(ROW()-5,Таблица!$A:$P,COLUMN()+1,0),\"\")","v":52},{"$f":"IFERROR(VLOOKUP(ROW()-5,Таблица!$A:$P,COLUMN()+1,0),\"\")","v":"Отвертка"},{"$f":"IFERROR(VLOOKUP(ROW()-5,Таблица!$A:$P,COLUMN()+1,0),\"\")","v":"4-4"},{"$f":"IFERROR(VLOOKUP(ROW()-5,Таблица!$A:$P,COLUMN()+1,0),\"\")","v":"ВБ"},{"$f":"IFERROR(VLOOKUP(ROW()-5,Таблица!$A:$P,COLUMN()+1,0),\"\")","v":"LOC100431348"},{"$f":"IFERROR(VLOOKUP(ROW()-5,Таблица!$A:$P,COLUMN()+1,0),\"\")","v":"2019-08-19"},{"$f":"IFERROR(VLOOKUP(ROW()-5,Таблица!$A:$P,COLUMN()+1,0),\"\")","v":"2020-08-19"},{"$f":"IFERROR(VLOOKUP(ROW()-5,Таблица!$A:$P,COLUMN()+1,0),\"\")","v":"2020-06-19"},{"$f":"IFERROR(VLOOKUP(ROW()-5,Таблица!$A:$P,COLUMN()+1,0),\"\")","v":"2020-02-09"},{"$f":"IFERROR(VLOOKUP(ROW()-5,Таблица!$A:$P,COLUMN()+1,0),\"\")","v":"2020-05-06"}]
[{"$f":"IFERROR(VLOOKUP(ROW()-5,Таблица!$A:$P,COLUMN()+1,0),\"\")","v":53},{"$f":"IFERROR(VLOOKUP(ROW()-5,Таблица!$A:$P,COLUMN()+1,0),\"\")","v":"Отвертка"},{"$f":"IFERROR(VLOOKUP(ROW()-5,Таблица!$A:$P,COLUMN()+1,0),\"\")","v":"4-5"},{"$f":"IFERROR(VLOOKUP(ROW()-5,Таблица!$A:$P,COLUMN()+1,0),\"\")","v":"ВБ"},{"$f":"IFERROR(VLOOKUP(ROW()-5,Таблица!$A:$P,COLUMN()+1,0),\"\")","v":"LOC100431348"},{"$f":"IFERROR(VLOOKUP(ROW()-5,Таблица!$A:$P,COLUMN()+1,0),\"\")","v":"2019-08-19"},{"$f":"IFERROR(VLOOKUP(ROW()-5,Таблица!$A:$P,COLUMN()+1,0),\"\")","v":"2020-08-19"},{"$f":"IFERROR(VLOOKUP(ROW()-5,Таблица!$A:$P,COLUMN()+1,0),\"\")","v":"2020-06-19"},{"$f":"IFERROR(VLOOKUP(ROW()-5,Таблица!$A:$P,COLUMN()+1,0),\"\")","v":"2020-02-09"},{"$f":"IFERROR(VLOOKUP(ROW()-5,Таблица!$A:$P,COLUMN()+1,0),\"\")","v":"2020-05-06"}]
[{"$f":"IFERROR(VLOOKUP(ROW()-5,Таблица!$A:$P,COLUMN()+1,0),\"\")","v":54},{"$f":"IFERROR(VLOOKUP(ROW()-5,Таблица!$A:$P,COLUMN()+1,0),\"\")","v":"Отвертка"},{"$f":"IFERROR(VLOOKUP(ROW()-5,Таблица!$A:$P,COLUMN()+1,0),\"\")","v":"4-6"},{"$f":"IFERROR(VLOOKUP(ROW()-5,Таблица!$A:$P,COLUMN()+1,0),\"\")","v":"ВБ"},{"$f":"IFERROR(VLOOKUP(ROW()-5,Таблица!$A:$P,COLUMN()+1,0),\"\")","v":"LOC100431348"},{"$f":"IFERROR(VLOOKUP(ROW()-5,Таблица!$A:$P,COLUMN()+1,0),\"\")","v":"2019-08-19"},{"$f":"IFERROR(VLOOKUP(ROW()-5,Таблица!$A:$P,COLUMN()+1,0),\"\")","v":"2020-08-19"},{"$f":"IFERROR(VLOOKUP(ROW()-5,Таблица!$A:$P,COLUMN()+1,0),\"\")","v":"2020-06-19"},{"$f":"IFERROR(VLOOKUP(ROW()-5,Таблица!$A:$P,COLUMN()+1,0),\"\")","v":"2020-02-09"},{"$f":"IFERROR(VLOOKUP(ROW()-5,Таблица!$A:$P,COLUMN()+1,0),\"\")","v":"2020-05-06"}]
[{"$f":"IFERROR(VLOOKUP(ROW()-5,Таблица!$A:$P,COLUMN()+1,0),\"\")","v":59},{"$f":"IFERROR(VLOOKUP(ROW()-5,Таблица!$A:$P,COLUMN()+1,0),\"\")","v":"Электропаяльник ЭПСИ-40/220В"},{"$f":"IFERROR(VLOOKUP(ROW()-5,Таблица!$A:$P,COLUMN()+1,0),\"\")","v":1},{"$f":"IFERROR(VLOOKUP(ROW()-5,Таблица!$A:$P,COLUMN()+1,0),\"\")","v":"КАЗ №2"},{"$f":"IFERROR(VLOOKUP(ROW()-5,Таблица!$A:$P,COLUMN()+1,0),\"\")","v":"LOC100448622"},{"$f":"IFERROR(VLOOKUP(ROW()-5,Таблица!$A:$P,COLUMN()+1,0),\"\")","v":"2020-03-11"},{"$f":"IFERROR(VLOOKUP(ROW()-5,Таблица!$A:$P,COLUMN()+1,0),\"\")","v":"2020-09-11"},{"$f":"IFERROR(VLOOKUP(ROW()-5,Таблица!$A:$P,COLUMN()+1,0),\"\")","v":"2020-07-11"},{"$f":"IFERROR(VLOOKUP(ROW()-5,Таблица!$A:$P,COLUMN()+1,0),\"\")","v":"00:00:00"},{"$f":"IFERROR(VLOOKUP(ROW()-5,Таблица!$A:$P,COLUMN()+1,0),\"\")","v":"00:00:00"}]
[{"$f":"IFERROR(VLOOKUP(ROW()-5,Таблица!$A:$P,COLUMN()+1,0),\"\")","v":60},{"$f":"IFERROR(VLOOKUP(ROW()-5,Таблица!$A:$P,COLUMN()+1,0),\"\")","v":"Электропаяльник ЭПСИ-40/220В"},{"$f":"IFERROR(VLOOKUP(ROW()-5,Таблица!$A:$P,COLUMN()+1,0),\"\")","v":2},{"$f":"IFERROR(VLOOKUP(ROW()-5,Таблица!$A:$P,COLUMN()+1,0),\"\")","v":"КАЗ №2"},{"$f":"IFERROR(VLOOKUP(ROW()-5,Таблица!$A:$P,COLUMN()+1,0),\"\")","v":"LOC100448622"},{"$f":"IFERROR(VLOOKUP(ROW()-5,Таблица!$A:$P,COLUMN()+1,0),\"\")","v":"2020-03-11"},{"$f":"IFERROR(VLOOKUP(ROW()-5,Таблица!$A:$P,COLUMN()+1,0),\"\")","v":"2020-09-11"},{"$f":"IFERROR(VLOOKUP(ROW()-5,Таблица!$A:$P,COLUMN()+1,0),\"\")","v":"2020-07-11"},{"$f":"IFERROR(VLOOKUP(ROW()-5,Таблица!$A:$P,COLUMN()+1,0),\"\")","v":"00:00:00"},{"$f":"IFERROR(VLOOKUP(ROW()-5,Таблица!$A:$P,COLUMN()+1,0),\"\")","v":"00:00:00"}]
[{"$f":"IFERROR(VLOOKUP(ROW()-5,Таблица!$A:$P,COLUMN()+1,0),\"\")","v":61},{"$f":"IFERROR(VLOOKUP(ROW()-5,Таблица!$A:$P,COLUMN()+1,0),\"\")","v":"Электропаяльник ЭПСИ-40/220В"},{"$f":"IFERROR(VLOOKUP(ROW()-5,Таблица!$A:$P,COLUMN()+1,0),\"\")","v":3},{"$f":"IFERROR(VLOOKUP(ROW()-5,Таблица!$A:$P,COLUMN()+1,0),\"\")","v":"КАЗ №2"},{"$f":"IFERROR(VLOOKUP(ROW()-5,Таблица!$A:$P,COLUMN()+1,0),\"\")","v":"LOC100448622"},{"$f":"IFERROR(VLOOKUP(ROW()-5,Таблица!$A:$P,COLUMN()+1,0),\"\")","v":"2020-03-11"},{"$f":"IFERROR(VLOOKUP(ROW()-5,Таблица!$A:$P,COLUMN()+1,0),\"\")","v":"2020-09-11"},{"$f":"IFERROR(VLOOKUP(ROW()-5,Таблица!$A:$P,COLUMN()+1,0),\"\")","v":"2020-07-11"},{"$f":"IFERROR(VLOOKUP(ROW()-5,Таблица!$A:$P,COLUMN()+1,0),\"\")","v":"00:00:00"},{"$f":"IFERROR(VLOOKUP(ROW()-5,Таблица!$A:$P,COLUMN()+1,0),\"\")","v":"00:00:00"}]
[{"$f":"IFERROR(VLOOKUP(ROW()-5,Таблица!$A:$P,COLUMN()+1,0),\"\")","v":62},{"$f":"IFERROR(VLOOKUP(ROW()-5,Таблица!$A:$P,COLUMN()+1,0),\"\")","v":"Электропаяльник ЭПСИ-40/220В"},{"$f":"IFERROR(VLOOKUP(ROW()-5,Таблица!$A:$P,COLUMN()+1,0),\"\")","v":4},{"$f":"IFERROR(VLOOKUP(ROW()-5,Таблица!$A:$P,COLUMN()+1,0),\"\")","v":"КАЗ №2"},{"$f":"IFERROR(VLOOKUP(ROW()-5,Таблица!$A:$P,COLUMN()+1,0),\"\")","v":"LOC100448622"},{"$f":"IFERROR(VLOOKUP(ROW()-5,Таблица!$A:$P,COLUMN()+1,0),\"\")","v":"2020-03-11"},{"$f":"IFERROR(VLOOKUP(ROW()-5,Таблица!$A:$P,COLUMN()+1,0),\"\")","v":"2020-09-11"},{"$f":"IFERROR(VLOOKUP(ROW()-5,Таблица!$A:$P,COLUMN()+1,0),\"\")","v":"2020-07-11"},{"$f":"IFERROR(VLOOKUP(ROW()-5,Таблица!$A:$P,COLUMN()+1,0),\"\")","v":"00:00:00"},{"$f":"IFERROR(VLOOKUP(ROW()-5,Таблица!$A:$P,COLUMN()+1,0),\"\")","v":"00:00:00"}]
[{"$f":"IFERROR(VLOOKUP(ROW()-5,Таблица!$A:$P,COLUMN()+1,0),\"\")","v":63},{"$f":"IFERROR(VLOOKUP(ROW()-5,Таблица!$A:$P,COLUMN()+1,0),\"\")","v":"Электропаяльник ЭПСН-100/220В"},{"$f":"IFERROR(VLOOKUP(ROW()-5,Таблица!$A:$P,COLUMN()+1,0),\"\")","v":1},{"$f":"IFERROR(VLOOKUP(ROW()-5,Таблица!$A:$P,COLUMN()+1,0),\"\")","v":"КАЗ №2"},{"$f":"IFERROR(VLOOKUP(ROW()-5,Таблица!$A:$P,COLUMN()+1,0),\"\")","v":"LOC100448624"},{"$f":"IFERROR(VLOOKUP(ROW()-5,Таблица!$A:$P,COLUMN()+1,0),\"\")","v":"2020-03-11"},{"$f":"IFERROR(VLOOKUP(ROW()-5,Таблица!$A:$P,COLUMN()+1,0),\"\")","v":"2020-09-11"},{"$f":"IFERROR(VLOOKUP(ROW()-5,Таблица!$A:$P,COLUMN()+1,0),\"\")","v":"2020-07-11"},{"$f":"IFERROR(VLOOKUP(ROW()-5,Таблица!$A:$P,COLUMN()+1,0),\"\")","v":"00:00:00"},{"$f":"IFERROR(VLOOKUP(ROW()-5,Таблица!$A:$P,COLUMN()+1,0),\"\")","v":"00:00:00"}]
[{"$f":"IFERROR(VLOOKUP(ROW()-5,Таблица!$A:$P,COLUMN()+1,0),\"\")","v":64},{"$f":"IFERROR(VLOOKUP(ROW()-5,Таблица!$A:$P,COLUMN()+1,0),\"\")","v":"Электропаяльник ЭПСН-100/220В"},{"$f":"IFERROR(VLOOKUP(ROW()-5,Таблица!$A:$P,COLUMN()+1,0),\"\")","v":2},{"$f":"IFERROR(VLOOKUP(ROW()-5,Таблица!$A:$P,COLUMN()+1,0),\"\")","v":"КАЗ №2"},{"$f":"IFERROR(VLOOKUP(ROW()-5,Таблица!$A:$P,COLUMN()+1,0),\"\")","v":"LOC100448624"},{"$f":"IFERROR(VLOOKUP(ROW()-5,Таблица!$A:$P,COLUMN()+1,0),\"\")","v":"2020-03-11"},{"$f":"IFERROR(VLOOKUP(ROW()-5,Таблица!$A:$P,COLUMN()+1,0),\"\")","v":"2020-09-11"},{"$f":"IFERROR(VLOOKUP(ROW()-5,Таблица!$A:$P,COLUMN()+1,0),\"\")","v":"2020-07-11"},{"$f":"IFERROR(VLOOKUP(ROW()-5,Таблица!$A:$P,COLUMN()+1,0),\"\")","v":"00:00:00"},{"$f":"IFERROR(VLOOKUP(ROW()-5,Таблица!$A:$P,COLUMN()+1,0),\"\")","v":"00:00:00"}]
[{"$f":"IFERROR(VLOOKUP(ROW()-5,Таблица!$A:$P,COLUMN()+1,0),\"\")","v":66},{"$f":"IFERROR(VLOOKUP(ROW()-5,Таблица!$A:$P,COLUMN()+1,0),\"\")","v":"Машина шлифовальная  МА 2001"},{"$f":"IFERROR(VLOOKUP(ROW()-5,Таблица!$A:$P,COLUMN()+1,0),\"\")","v":0},{"$f":"IFERROR(VLOOKUP(ROW()-5,Таблица!$A:$P,COLUMN()+1,0),\"\")","v":"КАЗ №2"},{"$f":"IFERROR(VLOOKUP(ROW()-5,Таблица!$A:$P,COLUMN()+1,0),\"\")","v":"350000043351"},{"$f":"IFERROR(VLOOKUP(ROW()-5,Таблица!$A:$P,COLUMN()+1,0),\"\")","v":"2020-03-11"},{"$f":"IFERROR(VLOOKUP(ROW()-5,Таблица!$A:$P,COLUMN()+1,0),\"\")","v":"2020-09-11"},{"$f":"IFERROR(VLOOKUP(ROW()-5,Таблица!$A:$P,COLUMN()+1,0),\"\")","v":"2020-07-11"},{"$f":"IFERROR(VLOOKUP(ROW()-5,Таблица!$A:$P,COLUMN()+1,0),\"\")","v":"00:00:00"},{"$f":"IFERROR(VLOOKUP(ROW()-5,Таблица!$A:$P,COLUMN()+1,0),\"\")","v":"00:00:00"}]
[{"$f":"IFERROR(VLOOKUP(ROW()-5,Таблица!$A:$P,COLUMN()+1,0),\"\")","v":67},{"$f":"IFERROR(VLOOKUP(ROW()-5,Таблица!$A:$P,COLUMN()+1,0),\"\")","v":"Машина электрическая перфорационная МЭП-500 ЭРУ"},{"$f":"IFERROR(VLOOKUP(ROW()-5,Таблица!$A:$P,COLUMN()+1,0),\"\")","v":0},{"$f":"IFERROR(VLOOKUP(ROW()-5,Таблица!$A:$P,COLUMN()+1,0),\"\")","v":"КАЗ №2"},{"$f":"IFERROR(VLOOKUP(ROW()-5,Таблица!$A:$P,COLUMN()+1,0),\"\")","v":"350000043521"},{"$f":"IFERROR(VLOOKUP(ROW()-5,Таблица!$A:$P,COLUMN()+1,0),\"\")","v":"2020-03-11"},{"$f":"IFERROR(VLOOKUP(ROW()-5,Таблица!$A:$P,COLUMN()+1,0),\"\")","v":"2020-09-11"},{"$f":"IFERROR(VLOOKUP(ROW()-5,Таблица!$A:$P,COLUMN()+1,0),\"\")","v":"2020-07-11"},{"$f":"IFERROR(VLOOKUP(ROW()-5,Таблица!$A:$P,COLUMN()+1,0),\"\")","v":"00:00:00"},{"$f":"IFERROR(VLOOKUP(ROW()-5,Таблица!$A:$P,COLUMN()+1,0),\"\")","v":"00:00:00"}]
[{"$f":"IFERROR(VLOOKUP(ROW()-5,Таблица!$A:$P,COLUMN()+1,0),\"\")","v":68},{"$f":"IFERROR(VLOOKUP(ROW()-5,Таблица!$A:$P,COLUMN()+1,0),\"\")","v":"Дрель Интерскол Д-16/1050Р2 безударная"},{"$f":"IFERROR(VLOOKUP(ROW()-5,Таблица!$A:$P,COLUMN()+1,0),\"\")","v":0},{"$f":"IFERROR(VLOOKUP(ROW()-5,Таблица!$A:$P,COLUMN()+1,0),\"\")","v":"КАЗ №2"},{"$f":"IFERROR(VLOOKUP(ROW()-5,Таблица!$A:$P,COLUMN()+1,0),\"\")","v":"LOC100733042"},{"$f":"IFERROR(VLOOKUP(ROW()-5,Таблица!$A:$P,COLUMN()+1,0),\"\")","v":"2020-03-11"},{"$f":"IFERROR(VLOOKUP(ROW()-5,Таблица!$A:$P,COLUMN()+1,0),\"\")","v":"2020-09-11"},{"$f":"IFERROR(VLOOKUP(ROW()-5,Таблица!$A:$P,COLUMN()+1,0),\"\")","v":"2020-07-11"},{"$f":"IFERROR(VLOOKUP(ROW()-5,Таблица!$A:$P,COLUMN()+1,0),\"\")","v":"00:00:00"},{"$f":"IFERROR(VLOOKUP(ROW()-5,Таблица!$A:$P,COLUMN()+1,0),\"\")","v":"00:00:00"}]
[{"$f":"IFERROR(VLOOKUP(ROW()-5,Таблица!$A:$P,COLUMN()+1,0),\"\")","v":71},{"$f":"IFERROR(VLOOKUP(ROW()-5,Таблица!$A:$P,COLUMN()+1,0),\"\")","v":"Фильтр сетев.ZIS Pilot-PRO( 5роз)+1 3м"},{"$f":"IFERROR(VLOOKUP(ROW()-5,Таблица!$A:$P,COLUMN()+1,0),\"\")","v":1},{"$f":"IFERROR(VLOOKUP(ROW()-5,Таблица!$A:$P,COLUMN()+1,0),\"\")","v":"Каб.нач."},{"$f":"IFERROR(VLOOKUP(ROW()-5,Таблица!$A:$P,COLUMN()+1,0),\"\")","v":"LOC100444829"},{"$f":"IFERROR(VLOOKUP(ROW()-5,Таблица!$A:$P,COLUMN()+1,0),\"\")","v":"2019-11-25"},{"$f":"IFERROR(VLOOKUP(ROW()-5,Таблица!$A:$P,COLUMN()+1,0),\"\")","v":"2020-05-25"},{"$f":"IFERROR(VLOOKUP(ROW()-5,Таблица!$A:$P,COLUMN()+1,0),\"\")","v":"2020-03-25"},{"$f":"IFERROR(VLOOKUP(ROW()-5,Таблица!$A:$P,COLUMN()+1,0),\"\")","v":"00:00:00"},{"$f":"IFERROR(VLOOKUP(ROW()-5,Таблица!$A:$P,COLUMN()+1,0),\"\")","v":"00:00:00"}]
[{"$f":"IFERROR(VLOOKUP(ROW()-5,Таблица!$A:$P,COLUMN()+1,0),\"\")","v":""},{"$f":"IFERROR(VLOOKUP(ROW()-5,Таблица!$A:$P,COLUMN()+1,0),\"\")","v":""},{"$f":"IFERROR(VLOOKUP(ROW()-5,Таблица!$A:$P,COLUMN()+1,0),\"\")","v":""},{"$f":"IFERROR(VLOOKUP(ROW()-5,Таблица!$A:$P,COLUMN()+1,0),\"\")","v":""},{"$f":"IFERROR(VLOOKUP(ROW()-5,Таблица!$A:$P,COLUMN()+1,0),\"\")","v":""},{"$f":"IFERROR(VLOOKUP(ROW()-5,Таблица!$A:$P,COLUMN()+1,0),\"\")","v":""},{"$f":"IFERROR(VLOOKUP(ROW()-5,Таблица!$A:$P,COLUMN()+1,0),\"\")","v":""},{"$f":"IFERROR(VLOOKUP(ROW()-5,Таблица!$A:$P,COLUMN()+1,0),\"\")","v":""},{"$f":"IFERROR(VLOOKUP(ROW()-5,Таблица!$A:$P,COLUMN()+1,0),\"\")","v":""},{"$f":"IFERROR(VLOOKUP(ROW()-5,Таблица!$A:$P,COLUMN()+1,0),\"\")","v":""}]
[{"$f":"IFERROR(VLOOKUP(ROW()-5,Таблица!$A:$P,COLUMN()+1,0),\"\")","v":""},{"$f":"IFERROR(VLOOKUP(ROW()-5,Таблица!$A:$P,COLUMN()+1,0),\"\")","v":""},{"$f":"IFERROR(VLOOKUP(ROW()-5,Таблица!$A:$P,COLUMN()+1,0),\"\")","v":""},{"$f":"IFERROR(VLOOKUP(ROW()-5,Таблица!$A:$P,COLUMN()+1,0),\"\")","v":""},{"$f":"IFERROR(VLOOKUP(ROW()-5,Таблица!$A:$P,COLUMN()+1,0),\"\")","v":""},{"$f":"IFERROR(VLOOKUP(ROW()-5,Таблица!$A:$P,COLUMN()+1,0),\"\")","v":""},{"$f":"IFERROR(VLOOKUP(ROW()-5,Таблица!$A:$P,COLUMN()+1,0),\"\")","v":""},{"$f":"IFERROR(VLOOKUP(ROW()-5,Таблица!$A:$P,COLUMN()+1,0),\"\")","v":""},{"$f":"IFERROR(VLOOKUP(ROW()-5,Таблица!$A:$P,COLUMN()+1,0),\"\")","v":""},{"$f":"IFERROR(VLOOKUP(ROW()-5,Таблица!$A:$P,COLUMN()+1,0),\"\")","v":""}]
[{"$f":"IFERROR(VLOOKUP(ROW()-5,Таблица!$A:$P,COLUMN()+1,0),\"\")","v":""},{"$f":"IFERROR(VLOOKUP(ROW()-5,Таблица!$A:$P,COLUMN()+1,0),\"\")","v":""},{"$f":"IFERROR(VLOOKUP(ROW()-5,Таблица!$A:$P,COLUMN()+1,0),\"\")","v":""},{"$f":"IFERROR(VLOOKUP(ROW()-5,Таблица!$A:$P,COLUMN()+1,0),\"\")","v":""},{"$f":"IFERROR(VLOOKUP(ROW()-5,Таблица!$A:$P,COLUMN()+1,0),\"\")","v":""},{"$f":"IFERROR(VLOOKUP(ROW()-5,Таблица!$A:$P,COLUMN()+1,0),\"\")","v":""},{"$f":"IFERROR(VLOOKUP(ROW()-5,Таблица!$A:$P,COLUMN()+1,0),\"\")","v":""},{"$f":"IFERROR(VLOOKUP(ROW()-5,Таблица!$A:$P,COLUMN()+1,0),\"\")","v":""},{"$f":"IFERROR(VLOOKUP(ROW()-5,Таблица!$A:$P,COLUMN()+1,0),\"\")","v":""},{"$f":"IFERROR(VLOOKUP(ROW()-5,Таблица!$A:$P,COLUMN()+1,0),\"\")","v":""}]
[{"$f":"IFERROR(VLOOKUP(ROW()-5,Таблица!$A:$P,COLUMN()+1,0),\"\")","v":""},{"$f":"IFERROR(VLOOKUP(ROW()-5,Таблица!$A:$P,COLUMN()+1,0),\"\")","v":""},{"$f":"IFERROR(VLOOKUP(ROW()-5,Таблица!$A:$P,COLUMN()+1,0),\"\")","v":""},{"$f":"IFERROR(VLOOKUP(ROW()-5,Таблица!$A:$P,COLUMN()+1,0),\"\")","v":""},{"$f":"IFERROR(VLOOKUP(ROW()-5,Таблица!$A:$P,COLUMN()+1,0),\"\")","v":""},{"$f":"IFERROR(VLOOKUP(ROW()-5,Таблица!$A:$P,COLUMN()+1,0),\"\")","v":""},{"$f":"IFERROR(VLOOKUP(ROW()-5,Таблица!$A:$P,COLUMN()+1,0),\"\")","v":""},{"$f":"IFERROR(VLOOKUP(ROW()-5,Таблица!$A:$P,COLUMN()+1,0),\"\")","v":""},{"$f":"IFERROR(VLOOKUP(ROW()-5,Таблица!$A:$P,COLUMN()+1,0),\"\")","v":""},{"$f":"IFERROR(VLOOKUP(ROW()-5,Таблица!$A:$P,COLUMN()+1,0),\"\")","v":""}]
[{"$f":"IFERROR(VLOOKUP(ROW()-5,Таблица!$A:$P,COLUMN()+1,0),\"\")","v":""},{"$f":"IFERROR(VLOOKUP(ROW()-5,Таблица!$A:$P,COLUMN()+1,0),\"\")","v":""},{"$f":"IFERROR(VLOOKUP(ROW()-5,Таблица!$A:$P,COLUMN()+1,0),\"\")","v":""},{"$f":"IFERROR(VLOOKUP(ROW()-5,Таблица!$A:$P,COLUMN()+1,0),\"\")","v":""},{"$f":"IFERROR(VLOOKUP(ROW()-5,Таблица!$A:$P,COLUMN()+1,0),\"\")","v":""},{"$f":"IFERROR(VLOOKUP(ROW()-5,Таблица!$A:$P,COLUMN()+1,0),\"\")","v":""},{"$f":"IFERROR(VLOOKUP(ROW()-5,Таблица!$A:$P,COLUMN()+1,0),\"\")","v":""},{"$f":"IFERROR(VLOOKUP(ROW()-5,Таблица!$A:$P,COLUMN()+1,0),\"\")","v":""},{"$f":"IFERROR(VLOOKUP(ROW()-5,Таблица!$A:$P,COLUMN()+1,0),\"\")","v":""},{"$f":"IFERROR(VLOOKUP(ROW()-5,Таблица!$A:$P,COLUMN()+1,0),\"\")","v":""}]
[{"$f":"IFERROR(VLOOKUP(ROW()-5,Таблица!$A:$P,COLUMN()+1,0),\"\")","v":""},{"$f":"IFERROR(VLOOKUP(ROW()-5,Таблица!$A:$P,COLUMN()+1,0),\"\")","v":""},{"$f":"IFERROR(VLOOKUP(ROW()-5,Таблица!$A:$P,COLUMN()+1,0),\"\")","v":""},{"$f":"IFERROR(VLOOKUP(ROW()-5,Таблица!$A:$P,COLUMN()+1,0),\"\")","v":""},{"$f":"IFERROR(VLOOKUP(ROW()-5,Таблица!$A:$P,COLUMN()+1,0),\"\")","v":""},{"$f":"IFERROR(VLOOKUP(ROW()-5,Таблица!$A:$P,COLUMN()+1,0),\"\")","v":""},{"$f":"IFERROR(VLOOKUP(ROW()-5,Таблица!$A:$P,COLUMN()+1,0),\"\")","v":""},{"$f":"IFERROR(VLOOKUP(ROW()-5,Таблица!$A:$P,COLUMN()+1,0),\"\")","v":""},{"$f":"IFERROR(VLOOKUP(ROW()-5,Таблица!$A:$P,COLUMN()+1,0),\"\")","v":""},{"$f":"IFERROR(VLOOKUP(ROW()-5,Таблица!$A:$P,COLUMN()+1,0),\"\")","v":""}]
[{"$f":"IFERROR(VLOOKUP(ROW()-5,Таблица!$A:$P,COLUMN()+1,0),\"\")","v":""},{"$f":"IFERROR(VLOOKUP(ROW()-5,Таблица!$A:$P,COLUMN()+1,0),\"\")","v":""},{"$f":"IFERROR(VLOOKUP(ROW()-5,Таблица!$A:$P,COLUMN()+1,0),\"\")","v":""},{"$f":"IFERROR(VLOOKUP(ROW()-5,Таблица!$A:$P,COLUMN()+1,0),\"\")","v":""},{"$f":"IFERROR(VLOOKUP(ROW()-5,Таблица!$A:$P,COLUMN()+1,0),\"\")","v":""},{"$f":"IFERROR(VLOOKUP(ROW()-5,Таблица!$A:$P,COLUMN()+1,0),\"\")","v":""},{"$f":"IFERROR(VLOOKUP(ROW()-5,Таблица!$A:$P,COLUMN()+1,0),\"\")","v":""},{"$f":"IFERROR(VLOOKUP(ROW()-5,Таблица!$A:$P,COLUMN()+1,0),\"\")","v":""},{"$f":"IFERROR(VLOOKUP(ROW()-5,Таблица!$A:$P,COLUMN()+1,0),\"\")","v":""},{"$f":"IFERROR(VLOOKUP(ROW()-5,Таблица!$A:$P,COLUMN()+1,0),\"\")","v":""}]
[]
[null,"январь",null,"годового испытания"]
[null,"февраль",null,"отправки на испытание"]
[null,"март",null,"периодического осмотра"]
[null,"апрель",null,"квартального осмотра"]
[null,"май"]
[null,"июнь"]
[null,"июль"]
[null,"август"]
[null,"сентябрь"]
[null,"октябрь"]
[null,"ноябрь"]
[null,"декабрь"]

{"sheet":"Лист1","index":2,"n_rows":41,"n_cols":2,"rows_kept":41,"cut":false,"hidden":true,"merged":[]}
["Перчатки диэлектрические № 4","LOC100433954"]
["Перчатки диэлектрические № 5","LOC100433954"]
["Перчатки диэлектрические № 9","LOC100433954"]
["Перчатки диэлектрические № 10","LOC100433954"]
["Перчатки диэлектрические № 11","LOC100828099"]
["Перчатки диэлектрические № 31","LOC100433954"]
["Боты диэлектрические № 9","350010000716"]
["Боты диэлектрические № 10","LOC100827944"]
["Боты диэлектрические № 11","350010000715"]
["Боты диэлектрические № 12","LOC100416152"]
["Набор отверток № 1 ","LOC100431335"]
["Пассатижи 1-1","LOC100433506"]
["Круглогубцы 1-2","LOC100427548"]
["Бокорезы 1-3","LOC100415755"]
["Набор отверток № 2","LOC100431335"]
["Пассатижи 2-1","LOC100433506"]
["Круглогубцы 2-2","LOC100427548"]
["Бокорезы 2-3","LOC100415755"]
["Набор отверток № 3","LOC100431348"]
["Набор отверток № 4","LOC100431348"]
["Индикатор ИНО-500 напряжения-отвертк № 6","LOC100422159"]
["Индикатор ИНО-500 напряжения-отвертк № 8","LOC100422159"]
["Индикатор ИНО-500 напряжения-отвертк № 9","LOC100422159"]
["Индикатор ИНО-500 напряжения-отвертк № 10","LOC100422159"]
["Индикатор напряж.ПИН90-2М № 5","LOC100422167"]
["Индикатор напряж.ПИН90-2М № 7","LOC100422167"]
["Лестница-стремян.Elkop ALW 403 3х56,5","LOC100834072"]
["Лестница-стремян.Elkop ALW 506 6х121","LOC100834073"]
["Электропаяльник ЭПСИ-40/220В","LOC100448622"]
["Электропаяльник ЭПСИ-40/220В","LOC100448622"]
["Электропаяльник ЭПСИ-40/220В","LOC100448622"]
["Электропаяльник ЭПСИ-40/220В","LOC100448622"]
["Электропаяльник ЭПСН-100/220В","LOC100448624"]
["Электропаяльник ЭПСН-100/220В","LOC100448624"]
["Машина шлифовальная  МА 2001","350000043351"]
["Машина электрическая перфорационная МЭП-500 ЭРУ","350000043521"]
["Дрель Интерскол Д-16/1050Р2 безударная","LOC100733042"]
["Удлинитель EKF Эксперт UBA16-310-4-05 5м","LOC100715318"]
["Удлинитель UNIVersal У10-555 5м 4гн","LOC100443989"]
["Фильтр сетев.ZIS Pilot-PRO( 5роз)+1 3м №1","LOC100444829"]
["Фильтр сетев.ZIS Pilot-PRO( 5роз)+1 3м №2","LOC100444829"]

{"sheet":"Лист2","index":3,"n_rows":0,"n_cols":0,"rows_kept":0,"cut":false,"hidden":false,"merged":[]}