{"text_format":"1","workbook":"xlsx","n_sheets":8,"sheets":["Табель","Годовая сводная","График отпусков","Настройки","На печать","Персонал","Табель за год","Праздники"],"not_rendered":{"charts":0,"images":34,"macros":1,"external_links":0,"defined_names":19,"comments":1,"pivot_tables":0},"unopened":[],"bounds":{"document_bytes":16777216,"sheet_cells":100000,"rows_first":2000,"rows_last":500,"rows_between":2000,"halvings":0,"cell_chars":16384,"cell_head_chars":4096},"cells_cut":0,"cells_raw":0,"read":"whole","date_system":"1900"}

{"sheet":"Табель","index":0,"n_rows":30,"n_cols":56,"rows_kept":30,"cut":false,"hidden":false,"merged":[[29,27,249,50],[9,42,9,50],[5,50,7,50],[5,43,5,45],[5,49,7,49],[8,34,8,41],[9,34,9,41],[9,3,9,33],[5,0,7,0],[5,1,7,1],[5,2,7,2],[5,3,6,33],[5,47,5,48],[5,46,7,46],[5,42,7,42],[6,43,7,43],[6,44,6,45],[6,47,7,47],[6,48,7,48],[5,34,6,41],[2,8,2,25],[3,10,3,16],[3,17,3,19],[3,20,3,21],[8,3,8,33]]}
[1,null,null,null,null,null,null,null,null,null,null,null,null,null,null,null,null,null,null,null,null,null,null,null,null,null,null,null,null,null,null,null,null,null,null,null,null,null,null,null,null,null,null,null,null,null,null,null,null,null,null,null,null,null,null,{"$f":"MAX(INDEX('Годовая сводная'!B:B,MATCH($A$10,'Годовая сводная'!A:A,0)):INDEX('Годовая сводная'!B:B,1000))","v":1927879}]
[]
[null,null,null,null,null,null,null,null,"График работы персонала"]
[null,null,null,null,null,null,null,null,null,null,"участка связи № 5 НЦС на",null,null,null,null,null,null,"Апрель",null,null,2021,null,"г."]
[]
["Фамилия Имя Отчество","Табельный номер","Профессия/ Должность","Календарные дни месяца",null,null,null,null,null,null,null,null,null,null,null,null,null,null,null,null,null,null,null,null,null,null,null,null,null,null,null,null,null,null,"Следующий месяц",null,null,null,null,null,null,null,"Норма по календарю","Часы работы за месяц",null,null,"ОТ, ПМ,Б, У","Отклонение от нормы",null,"Норма по ПФРВ","Средне-месячная норма"]
[null,null,null,null,null,null,null,null,null,null,null,null,null,null,null,null,null,null,null,null,null,null,null,null,null,null,null,null,null,null,null,null,null,null,null,null,null,null,null,null,null,null,null,"всего по графику","из них",null,null,"за месяц","с начала учет. периода"]
[null,null,null,{"$f":"--(\"1-\"&R4&U4)","v":"2021-04-01"},{"$f":"D8+1","v":"2021-04-02"},{"$f":"E8+1","v":"2021-04-03"},"2021-04-04","2021-04-05","2021-04-06","2021-04-07","2021-04-08","2021-04-09","2021-04-10","2021-04-11","2021-04-12","2021-04-13","2021-04-14","2021-04-15","2021-04-16","2021-04-17","2021-04-18","2021-04-19","2021-04-20","2021-04-21","2021-04-22","2021-04-23","2021-04-24","2021-04-25","2021-04-26","2021-04-27","2021-04-28",{"$f":"IF(MONTH(AE8+1)<>MONTH($D8),\"х\",AE8+1)","v":"2021-04-29"},{"$f":"IF(MONTH(AE8+2)<>MONTH($D8),\"х\",AE8+2)","v":"2021-04-30"},{"$f":"IF(MONTH(AE8+3)<>MONTH($D8),\"х\",AE8+3)","v":"х"},{"$f":"EDATE(D8,1)","v":"2021-05-01"},{"$f":"EDATE(E8,1)","v":"2021-05-02"},"2021-05-03","2021-05-04","2021-05-05","2021-05-06","2021-05-07","2021-05-08",null,null,"ночных","праздничных"]
[1,2,3,4,null,null,null,null,null,null,null,null,null,null,null,null,null,null,null,null,null,null,null,null,null,null,null,null,null,null,null,null,null,null,null,null,null,null,null,null,null,null,5,6,7,8,9,10,11,12,13]
[{"$f":"R4","v":"Апрель"},null,null,null,null,null,null,null,null,null,null,null,null,null,null,null,null,null,null,null,null,null,null,null,null,null,null,null,null,null,null,null,null,null,{"$f":"TEXT(AI8,\"ММММ\")","v":"Май"}]
{"$rows_left_out":21}
{"sheet":"Годовая сводная","index":1,"n_rows":254,"n_cols":44,"rows_kept":254,"cut":false,"hidden":true,"merged":[[46,34,46,42],[80,34,80,42],[165,34,165,42],[148,34,148,42],[235,37,235,40],[63,34,63,42],[114,34,114,42],[131,34,131,42],[97,3,97,33],[114,3,114,33],[238,16,238,24],[1,43,1,46],[1,34,1,37],[235,16,235,24],[8,43,10,43],[199,34,199,42],[11,3,11,33],[8,41,10,41],[8,42,10,42],[199,3,199,33],[131,3,131,33],[148,3,148,33],[165,3,165,33],[182,3,182,33],[29,3,29,33],[12,3,12,33],[46,3,46,33],[63,3,63,33],[80,3,80,33],[0,0,0,3],[1,0,1,3],[8,39,8,40],[8,35,8,37],[8,38,10,38],[9,39,10,39],[8,2,10,2],[9,35,10,35],[8,3,9,33],[9,40,10,40],[8,34,10,34],[9,36,9,37],[3,0,3,1],[5,0,5,43],[6,0,6,43],[8,0,10,0],[7,0,7,43],[251,1,251,3],[252,1,252,3],[253,1,253,3],[236,37,236,40],[246,20,247,25],[244,15,244,18],[244,20,244,24],[238,37,238,40],[239,37,239,40],[29,34,29,42],[97,34,97,42],[12,34,12,42],[182,34,182,42],[8,1,10,1],[243,16,243,19]]}
["СОГЛАСОВАНО",null,null,null,null,null,null,null,null,null,null,null,null,null,null,null,null,null,null,null,null,null,null,null,null,null,null,null,null,null,null,null,null,null,"УТВЕРЖДАЮ"]
["Председатель ППО                                                                 ",null,null,null,null,null,null,null,null,null,null,null,null,null,null,null,null,null,null,null,null,null,null,null,null,null,null,null,null,null,null,null,null,null," Начальник Управления связи"]
[null,null,null,null,null,null,null,null,null,null,null,null,null,null,null,null,null,null,null,null,null,null,null,null,null,null,null,null,null,null,null,null,null,null,null,null,null,null,null,"А.А.  Курбатов"]
[{"$f":"TODAY()","v":"2020-10-10"},null,null,null,null,null,null,null,null,null,null,null,null,null,null,null,null,null,null,null,null,null,null,null,null,null,null,null,null,null,null,null,null,null,"\"            \"",null,null,null,null,"2020 г."]
[]
["График работы персонала на 2021 год "]
["Общество с ограниченной ответственностью ООО \"Газпром трансгаз Сургут\""]
["Управление связи Ноябрьский цех связи участок связи № 5."]
["Фамилия Имя Отчество","Табельный номер","Профессия/ Должность","Календарные дни месяца",null,null,null,null,null,null,null,null,null,null,null,null,null,null,null,null,null,null,null,null,null,null,null,null,null,null,null,null,null,null,"Норма по календарю","Часы работы за месяц",null,null,"ОТ, ПМ,Б, У","Отклонение от нормы",null,"Норма по ПФРВ","Средне-месячная норма","С графиком ознакомлен (подпись, дата)"]
[null,null,null,null,null,null,null,null,null,null,null,null,null,null,null,null,null,null,null,null,null,null,null,null,null,null,null,null,null,null,null,null,null,null,null,"всего по графику","из них",null,null,"за месяц","с начала учет. периода"]
{"$rows_left_out":245}
{"sheet":"График отпусков","index":2,"n_rows":23,"n_cols":54,"rows_kept":23,"cut":false,"hidden":true,"merged":[[4,97,4,98],[5,0,6,2],[5,3,6,5],[5,6,6,56],[4,29,4,32],[4,33,4,36],[4,37,4,40],[4,41,4,44],[4,45,4,48],[4,49,4,52],[4,25,4,28],[4,53,4,56],[3,3,3,5],[4,9,4,12],[4,13,4,16],[4,17,4,20],[4,21,4,24],[2,103,4,103],[0,9,0,49],[1,0,1,8],[1,9,1,49],[1,51,1,56],[2,0,2,5],[2,6,4,6],[2,8,4,8],[2,9,3,56],[3,0,3,2],[2,85,2,86],[2,87,2,93],[2,94,4,94],[2,95,2,101],[2,102,4,102],[2,7,4,7]]}
[null,null,null,null,null,null,null,null,null,"График отпусков участка связи №5  НЦС на  2021год "]
[]
["Отпуск",null,null,null,null,null,"Фамилия, имя,\nотчество","Табельный номер","Профессия","Месяцы"]
["Первая часть",null,null,"Вторая часть"]
["Дней отп.","Начало","Окончание","Дней отп.","Начало","Окончание",null,null,null,"январь",null,null,null,"февраль",null,null,null,"март",null,null,null,"апрель",null,null,null,"май",null,null,null,"июнь",null,null,null,"июль",null,null,null,"август",null,null,null,"сентябрь",null,null,null,"октябрь",null,null,null,"ноябрь",null,null,null,"декабрь"]
[]
[]
[52,"2021-06-22",{"$f":"ОТПУСК(B8,A8,Праздники)","v":{"$error":"#NAME?"}},null,null,{"$f":"ОТПУСК(E8,D8,Праздники)","v":{"$error":"#NAME?"}},{"$f":"IFERROR(INDEX(_Фамилия,MATCH(H8,_ТабНом,0)),\"\")","v":"Шаврин А.А."},{"$f":"Табель!B11","v":1902910},{"$f":"IFERROR(VLOOKUP(H8,Персонал[[Табельный номер]:[Профессия/ Должность]],3,0),\"\")","v":"Начальник участка"}]
[52,"2021-05-01",{"$error":"#NAME?"},null,null,{"$f":"ОТПУСК(E9,D9,Праздники)","v":{"$error":"#NAME?"}},"Глазовский Д.А.",{"$f":"Табель!B12","v":1904068},{"$f":"IFERROR(VLOOKUP(H9,Персонал[[Табельный номер]:[Профессия/ Должность]],3,0),\"\")","v":"Инженер"}]
[52,"2021-05-01",{"$error":"#NAME?"},null,null,{"$error":"#NAME?"},"Гулеватый С.В.",{"$f":"Табель!B13","v":1915704},{"$f":"IFERROR(VLOOKUP(H10,Персонал[[Табельный номер]:[Профессия/ Должность]],3,0),\"\")","v":"Электромеханик"}]
{"$rows_left_out":14}
{"sheet":"Настройки","index":3,"n_rows":11,"n_cols":51,"rows_kept":11,"cut":false,"hidden":true,"merged":[[9,3,9,33],[5,1,7,1],[5,2,7,2],[5,3,6,33],[5,0,7,0],[8,3,8,33],[2,8,2,25],[3,10,3,16],[3,17,3,19],[3,20,3,21],[5,50,7,50],[6,44,6,45],[9,42,9,50],[5,34,6,41],[5,47,5,48],[5,49,7,49],[5,42,7,42],[6,43,7,43],[6,47,7,47],[6,48,7,48],[5,43,5,45],[5,46,7,46],[8,34,8,41],[9,34,9,41]]}
[]
[]
[null,null,null,null,null,null,null,null,"График работы персонала"]
[null,null,null,null,null,null,null,null,null,null,"участка связи № 5 НЦС на",null,null,null,null,null,null,"Февраль",null,null,2021,null,"г."]
[]
["Фамилия Имя Отчество","Табельный номер","Профессия/ Должность","Календарные дни месяца",null,null,null,null,null,null,null,null,null,null,null,null,null,null,null,null,null,null,null,null,null,null,null,null,null,null,null,null,null,null,"Следующий месяц",null,null,null,null,null,null,null,"Норма по календарю","Часы работы за месяц",null,null,"ОТ, ПМ,Б, У","Отклонение от нормы",null,"Норма по ПФРВ","Средне-месячная норма"]
[null,null,null,null,null,null,null,null,null,null,null,null,null,null,null,null,null,null,null,null,null,null,null,null,null,null,null,null,null,null,null,null,null,null,null,null,null,null,null,null,null,null,null,"всего по графику","из них",null,null,"за месяц","с начала учет. периода"]
[null,null,null,{"$f":"--(\"1-\"&R4&U4)","v":"2021-02-01"},{"$f":"D8+1","v":"2021-02-02"},{"$f":"E8+1","v":"2021-02-03"},"2021-02-04","2021-02-05","2021-02-06","2021-02-07","2021-02-08","2021-02-09","2021-02-10","2021-02-11","2021-02-12","2021-02-13","2021-02-14","2021-02-15","2021-02-16","2021-02-17","2021-02-18","2021-02-19","2021-02-20","2021-02-21","2021-02-22","2021-02-23","2021-02-24","2021-02-25","2021-02-26","2021-02-27","2021-02-28",{"$f":"IF(MONTH(AE8+1)<>MONTH($D8),\"х\",AE8+1)","v":"х"},{"$f":"IF(MONTH(AE8+2)<>MONTH($D8),\"х\",AE8+2)","v":"х"},{"$f":"IF(MONTH(AE8+3)<>MONTH($D8),\"х\",AE8+3)","v":"х"},{"$f":"EDATE(D8,1)","v":"2021-03-01"},{"$f":"EDATE(E8,1)","v":"2021-03-02"},"2021-03-03","2021-03-04","2021-03-05","2021-03-06","2021-03-07","2021-03-08",null,null,"ночных","праздничных"]
[1,2,3,4,null,null,null,null,null,null,null,null,null,null,null,null,null,null,null,null,null,null,null,null,null,null,null,null,null,null,null,null,null,null,null,null,null,null,null,null,null,null,5,6,7,8,9,10,11,12,13]
[{"$f":"R4","v":"Февраль"},null,null,null,null,null,null,null,null,null,null,null,null,null,null,null,null,null,null,null,null,null,null,null,null,null,null,null,null,null,null,null,null,null,{"$f":"TEXT(AI8,\"ММММ\")","v":"Март"}]
{"$rows_left_out":2}
{"sheet":"На печать","index":4,"n_rows":52,"n_cols":44,"rows_kept":52,"cut":false,"hidden":true,"merged":[[2,36,2,38],[3,36,3,38],[3,39,3,40],[8,43,10,43],[9,35,10,35],[9,39,10,39],[9,40,10,40],[8,42,10,42],[8,34,10,34],[8,39,8,40],[9,36,9,37],[8,35,8,37],[8,41,10,41],[8,38,10,38],[5,16,5,22],[5,23,5,26],[3,0,3,1],[8,0,10,0],[8,1,10,1],[8,2,10,2],[8,3,9,33],[11,3,11,33],[42,20,42,25],[38,16,38,19],[39,20,39,25],[33,16,33,24],[46,1,46,3],[47,1,47,3],[48,1,48,3],[12,3,12,33],[12,0,12,2]]}
["Согласовано: ",null,null,null,null,null,null,null,null,null,null,null,null,null,null,null,null,null,null,null,null,null,null,null,null,null,null,null,null,null,null,null,null,null,null,null,null,null,null,null,null,null,null,"УТВЕРЖДАЮ"]
["Председатель цехкома",null,null,null,null,null,null,null,null,null,null,null,null,null,null,null,null,null,null,null,null,null,null,null,null,null,null,null,null,null,null,null,null,null,null,null,null,null,null,null,null,null,null," Начальник Управления связи"]
["__________________","Ю.В. Чермакова",null,null,null,null,null,null,null,null,null,null,null,null,null,null,null,null,null,null,null,null,null,null,null,null,null,null,null,null,null,null,null,null,null,null,null,null,null,null,null,null,null,"А.А.  Курбатов"]
[{"$f":"TODAY()","v":"2020-10-10"},null,null,null,null,null,null,null,null,null,null,null,null,null,null,null,null,null,null,null,null,null,null,null,null,null,null,null,null,null,null,null,null,null,null,null,null,null,null,null,null,null,null,"\"            \"                      2021 г."]
[]
[null,null,null,null,null,null,null,null,null,null,null,null,null,null,null,null,"График работы персонала от",null,null,null,null,null,null,{"$f":"A4","v":"2020-10-10"}]
[null,null,null,null,null,null,null,null,null,null,null,null,null,null,"Общество с ограниченной ответственностью ООО \"Газпром трансгаз Сургут\""]
[null,null,null,null,null,null,null,null,null,null,null,null,null,null,null,null,"Управление связи Ноябрьский цех связи участок связи № 5."]
["Фамилия Имя Отчество","Таб. Номер","Профессия/ Должность","Календарные дни месяца",null,null,null,null,null,null,null,null,null,null,null,null,null,null,null,null,null,null,null,null,null,null,null,null,null,null,null,null,null,null,"Норма по календарю","Часы работы за месяц",null,null,"ОТ, ПМ,Б, У","Отклонение от нормы",null,"Норма по ПФРФ","Среднемесячная норма","С графиком ознакомлен (подпись, дата)"]
[null,null,null,null,null,null,null,null,null,null,null,null,null,null,null,null,null,null,null,null,null,null,null,null,null,null,null,null,null,null,null,null,null,null,null,"всего по графику","из них",null,null,"за месяц","с начала учет. периода"]
{"$rows_left_out":43}
{"sheet":"Персонал","index":5,"n_rows":18,"n_cols":10,"rows_kept":18,"cut":false,"hidden":true,"merged":[]}
[null,null,{"$f":"TODAY()","v":"2020-10-10"}]
["№ п/п","Табельный номер","Фамилия Имя Отчество","Профессия/ Должность","Пол","Отпуск      (кол-во календ. дней)","Место постоянного проживания","Дата устройства на работу","Трудовой стаж","Таб_ФИО"]
[{"$f":"ROW()-2","v":1},1904059,"Алмакаев В.И","Инженер","м",52,"г. Ноябрьск","2004-04-01",{"$f":"DATEDIF(H3,C$1,\"y\") & \" г. \" & DATEDIF(H3,C$1,\"ym\") & \" мес. \" & DATEDIF(H3,C$1,\"md\") & \" дн.\"","v":"16 г. 6 мес. 9 дн."},{"$f":"Персонал[[#This Row],[Табельный номер]]&\" \"&Персонал[[#This Row],[Фамилия Имя Отчество]]","v":"1904059 Алмакаев В.И"}]
[2,1904068,"Глазовский Д.А.","Инженер","м",52,"п. Ханымей","2008-02-18","12 г. 7 мес. 22 дн.",{"$f":"Персонал[[#This Row],[Табельный номер]]&\" \"&Персонал[[#This Row],[Фамилия Имя Отчество]]","v":"1904068 Глазовский Д.А."}]
[3,1915704,"Гулеватый С.В.","Электромеханик","м",52,"г. Сургут","2016-01-12","4 г. 8 мес. 28 дн.",{"$f":"Персонал[[#This Row],[Табельный номер]]&\" \"&Персонал[[#This Row],[Фамилия Имя Отчество]]","v":"1915704 Гулеватый С.В."}]
[4,1915436,"Кинжибалов Е.Ю.","Электромеханик","м",52,"г. Салым","2018-10-01","2 г. 0 мес. 9 дн.",{"$f":"Персонал[[#This Row],[Табельный номер]]&\" \"&Персонал[[#This Row],[Фамилия Имя Отчество]]","v":"1915436 Кинжибалов Е.Ю."}]
[5,1912622,"Кристовир А.А.","Электромонтер","м",52,"г. Ноябрьск","2012-10-02","8 г. 0 мес. 8 дн.",{"$f":"Персонал[[#This Row],[Табельный номер]]&\" \"&Персонал[[#This Row],[Фамилия Имя Отчество]]","v":"1912622 Кристовир А.А."}]
[6,1913850,"Кристовир А.А.","Телефонист","ж",53,"г. Ноябрьск","2009-08-06","11 г. 2 мес. 4 дн.",{"$f":"Персонал[[#This Row],[Табельный номер]]&\" \"&Персонал[[#This Row],[Фамилия Имя Отчество]]","v":"1913850 Кристовир А.А."}]
[7,1912037,"Кристовир А.Б.","Электромонтер","м",52,"г. Ноябрьск","1999-01-06","21 г. 9 мес. 4 дн.",{"$f":"Персонал[[#This Row],[Табельный номер]]&\" \"&Персонал[[#This Row],[Фамилия Имя Отчество]]","v":"1912037 Кристовир А.Б."}]
[8,1912044,"Кульчицкая Л.С.","Электромонтер","ж",52,"г. Ноябрьск","1999-01-06","21 г. 9 мес. 4 дн.",{"$f":"Персонал[[#This Row],[Табельный номер]]&\" \"&Персонал[[#This Row],[Фамилия Имя Отчество]]","v":"1912044 Кульчицкая Л.С."}]
{"$rows_left_out":9}
{"sheet":"Табель за год","index":6,"n_rows":257,"n_cols":48,"rows_kept":257,"cut":false,"hidden":false,"merged":[[239,3,239,33],[240,3,240,33],[236,34,238,34],[173,41,175,41],[173,42,175,42],[174,35,175,35],[174,36,174,37],[236,42,238,42],[237,35,238,35],[237,36,237,37],[237,39,238,39],[237,40,238,40],[236,35,236,37],[236,38,238,38],[236,39,236,40],[236,41,238,41],[194,42,196,42],[176,3,176,33],[177,3,177,33],[195,39,196,39],[195,40,196,40],[215,34,217,34],[215,35,215,37],[215,38,217,38],[215,39,215,40],[194,41,196,41],[236,0,238,0],[236,1,238,1],[236,2,238,2],[236,3,237,33],[197,3,197,33],[198,3,198,33],[215,0,217,0],[215,1,217,1],[215,2,217,2],[215,3,216,33],[218,3,218,33],[219,3,219,33],[194,0,196,0],[194,1,196,1],[194,2,196,2],[194,3,195,33],[155,3,155,33],[156,3,156,33],[173,0,175,0],[173,1,175,1],[173,2,175,2],[173,3,174,33],[215,41,217,41],[215,42,217,42],[216,35,217,35],[216,36,216,37],[216,39,217,39],[216,40,217,40],[173,34,175,34],[173,35,173,37],[173,38,175,38],[173,39,173,40],[174,39,175,39],[174,40,175,40],[194,34,196,34],[194,35,194,37],[194,38,196,38],[194,39,194,40],[195,35,196,35],[195,36,195,37],[152,41,154,41],[152,42,154,42],[131,0,133,0],[131,1,133,1],[131,2,133,2],[134,3,134,33],[135,3,135,33],[153,39,154,39],[153,40,154,40],[153,36,153,37],[152,35,152,37],[131,39,131,40],[152,38,154,38],[152,39,152,40],[152,0,154,0],[152,1,154,1],[152,2,154,2],[152,3,153,33],[152,34,154,34],[153,35,154,35],[114,3,114,33],[131,3,132,33],[110,34,112,34],[110,35,110,37],[110,38,112,38],[131,34,133,34],[131,41,133,41],[131,42,133,42],[132,35,133,35],[132,36,132,37],[132,39,133,39],[132,40,133,40],[131,35,131,37],[131,38,133,38],[110,41,112,41],[110,42,112,42],[111,35,112,35],[111,36,111,37],[111,39,112,39],[111,40,112,40],[110,39,110,40],[47,0,49,0],[47,1,49,1],[47,2,49,2],[47,3,48,33],[47,34,49,34],[92,3,92,33],[93,3,93,33],[113,3,113,33],[110,0,112,0],[110,1,112,1],[110,2,112,2],[110,3,111,33],[89,34,91,34],[68,0,70,0],[68,1,70,1],[68,2,70,2],[89,0,91,0],[89,1,91,1],[89,2,91,2],[68,41,70,41],[69,35,70,35],[69,36,69,37],[69,39,70,39],[69,40,70,40],[29,3,29,33],[71,3,71,33],[72,3,72,33],[89,3,90,33],[68,34,70,34],[68,35,68,37],[68,38,70,38],[68,39,68,40],[30,3,30,33],[89,35,89,37],[50,3,50,33],[51,3,51,33],[68,3,69,33],[89,38,91,38],[89,39,89,40],[26,38,28,38],[26,39,26,40],[26,41,28,41],[26,42,28,42],[27,35,28,35],[27,36,27,37],[27,39,28,39],[27,40,28,40],[89,41,91,41],[89,42,91,42],[90,35,91,35],[90,36,90,37],[90,39,91,39],[90,40,91,40],[68,42,70,42],[47,41,49,41],[47,42,49,42],[48,35,49,35],[48,36,48,37],[48,39,49,39],[48,40,49,40],[47,35,47,37],[47,38,49,38],[47,39,47,40],[3,20,3,21],[5,0,7,0],[5,1,7,1],[5,2,7,2],[5,3,6,33],[26,0,28,0],[26,1,28,1],[26,2,28,2],[26,3,27,33],[9,3,9,33],[3,32,3,42],[5,42,7,42],[6,35,7,35],[6,36,6,37],[6,39,7,39],[6,40,7,40],[8,3,8,33],[5,34,7,34],[5,35,5,37],[5,38,7,38],[5,39,5,40],[5,41,7,41],[26,34,28,34],[26,35,26,37]]}
[1,null,null,null,null,null,null,null,null,null,null,null,null,null,null,null,null,null,null,null,null,null,null,null,null,null,null,null,null,null,null,null,null,null,null,null,null,null,null,null,null,null,null,null,null,null,null,{"$f":"MAX(INDEX('Годовая сводная'!B:B,MATCH($A$10,'Годовая сводная'!A:A,0)):INDEX('Годовая сводная'!B:B,1000))","v":1927879}]
[]
[null,null,null,null,null,null,null,null,null,null,null,null,null,null,null,"График работы персонала"]
[null,null,null,null,null,null,null,null,null,null,null,null,null,null,null,null,null,null,null,"участка связи № 5 НЦС на",2021,null,"год",null,null,null,null,null,null,null,null,null,"Заблокировать от проставления чисел"]
[]
["Фамилия Имя Отчество","Табельный номер","Профессия/ Должность","Календарные дни месяца",null,null,null,null,null,null,null,null,null,null,null,null,null,null,null,null,null,null,null,null,null,null,null,null,null,null,null,null,null,null,"Норма по календарю","Часы работы за месяц",null,null,"ОТ, ПМ,Б, У","Отклонение от нормы",null,"Норма по ПФРВ","Средне-месячная норма"]
[null,null,null,null,null,null,null,null,null,null,null,null,null,null,null,null,null,null,null,null,null,null,null,null,null,null,null,null,null,null,null,null,null,null,null,"всего по графику","из них",null,null,"за месяц","с начала учет. периода"]
[null,null,null,{"$f":"--(\"1-\"&A10&$U$4)","v":"2021-01-01"},{"$f":"D8+1","v":"2021-01-02"},{"$f":"E8+1","v":"2021-01-03"},"2021-01-04","2021-01-05","2021-01-06","2021-01-07","2021-01-08","2021-01-09","2021-01-10","2021-01-11","2021-01-12","2021-01-13","2021-01-14","2021-01-15","2021-01-16","2021-01-17","2021-01-18","2021-01-19","2021-01-20","2021-01-21","2021-01-22","2021-01-23","2021-01-24","2021-01-25","2021-01-26","2021-01-27","2021-01-28",{"$f":"IF(MONTH(AE8+1)<>MONTH($D8),\"х\",AE8+1)","v":"2021-01-29"},{"$f":"IF(MONTH(AE8+2)<>MONTH($D8),\"х\",AE8+2)","v":"2021-01-30"},{"$f":"IF(MONTH(AE8+3)<>MONTH($D8),\"х\",AE8+3)","v":"2021-01-31"},null,null,"ночных","праздничных"]
[1,2,3,4,null,null,null,null,null,null,null,null,null,null,null,null,null,null,null,null,null,null,null,null,null,null,null,null,null,null,null,null,null,null,5,6,7,8,9,10,11,12,13]
["Январь"]
{"$rows_left_out":248}
{"sheet":"Праздники","index":7,"n_rows":22,"n_cols":16,"rows_kept":22,"cut":false,"hidden":false,"merged":[]}
[null,null,null,null,"Месяц","Число","Год","Наименование праздников","Предпраздничные сокращенные дни","Нерабочий праздничный день","Перенесенные выходные дни","Рабочие выходные ","Норма муж. по календарю","Норма жен. по календарю","Норма муж.","Норма жен."]
[null,null,null,null,"Январь",1,2019,"Новый год",null,"2021-01-01",null,null,120,108,164.34,147.86000000000001]
[null,null,null,null,"Февраль",2,2020,"Новый год",null,"2021-01-02",null,null,151,135.80000000000001,164.34,147.86000000000001]
[null,null,null,null,"Март",3,2021,"Новый год",null,"2021-01-03",null,null,176,158.4,164.34,147.86000000000001]
[null,null,null,null,"Апрель",4,2022,"Новый год",null,"2021-01-04",null,null,175,157.4,164.34,147.86000000000001]
[null,null,null,null,"Май",5,2023,"Новый год",null,"2021-01-05",null,null,152,136.80000000000001,164.33,147.87]
[null,null,null,null,"Июнь",6,2024,"Новый год",null,"2021-01-06",null,null,167,150.19999999999999,164.33,147.87]
[null,null,null,null,"Июль",7,2025,"Рождество",null,"2021-01-07",null,null,176,158.4,164.33,147.87]
[null,null,null,null,"Август",8,2026,"Новый год",null,"2021-01-08",null,null,176,158.4,164.33,147.87]
[null,null,null,null,"Сентябрь",9,2027,"Защитник","2021-02-20","2021-02-23","2021-02-22",null,176,158.4,164.33,147.87]
{"$rows_left_out":12}