{"text_format":"1","workbook":"xlsx","n_sheets":3,"sheets":["табель","input_table","Табель фио-пропуски"],"not_rendered":{"charts":0,"images":0,"macros":1,"external_links":0,"defined_names":1,"comments":0,"pivot_tables":0},"unopened":[],"bounds":{"document_bytes":16777216,"sheet_cells":100000,"rows_first":2000,"rows_last":500,"rows_between":2000,"halvings":0,"cell_chars":16384,"cell_head_chars":4096},"cells_cut":0,"cells_raw":0,"read":"whole","date_system":"1900"}

{"sheet":"табель","index":0,"n_rows":33,"n_cols":22,"rows_kept":33,"cut":false,"hidden":false,"merged":[[4,0,6,0],[4,4,4,19]]}
[1929]
[]
[]
[]
["№\nп/п","Наименование",null,null,"сентября 26.09.2020 / октября 25.10.2020",null,null,null,null,null,null,null,null,null,null,null,null,null,null,null,"Итого","Итого"]
[null,"объекта","Описание","ФИО","2020-09-26","2020-09-27","2020-09-28","2020-09-29","2020-09-30","2020-10-01","2020-10-02","2020-10-03","2020-10-04","2020-10-05","2020-10-06","2020-10-07","2020-10-08","2020-10-09","2020-10-10",null,"отработанных","пропущенных"]
[null,null,null,null,"2020-10-11","2020-10-12","2020-10-13","2020-10-14","2020-10-15","2020-10-16","2020-10-17","2020-10-18","2020-10-19","2020-10-20","2020-10-21","2020-10-22","2020-10-23","2020-10-24","2020-10-25",null,"дней","дней"]
[]
[null,null,null,null,1,"x","x","x","x","x","x","x","x","x","x","x","x","x","x",null,{"$f":"COUNTIF($E9:$S10,\">0\")","v":2},{"$f":"COUNTIF($E9:$S10,\"=x\")","v":28}]
[1,"скв.№106-1","Простой из-за погодных условий","Иванов А.А.","x","x","x","x",1,"x","x","x","x","x","x","x","x","x","x"]
[null,null,null,null,null,null,null,null,null,null,null,null,null,null,null,null,null,null,null,null,{"$f":"COUNTIF($E11:$S12,\">0\")","v":0},{"$f":"COUNTIF($E11:$S12,\"=x\")","v":0}]
[2]
[null,null,null,null,null,null,null,null,null,null,null,null,null,null,null,null,null,null,null,null,{"$f":"COUNTIF($E13:$S14,\">0\")","v":0},{"$f":"COUNTIF($E13:$S14,\"=x\")","v":0}]
[3]
[null,null,null,null,1,"x","x","x","x","x","x","x","x","x","x","x","x","x","x",null,{"$f":"COUNTIF($E15:$S16,\">0\")","v":1},{"$f":"COUNTIF($E15:$S16,\"=x\")","v":29}]
[4,"скв.№1033-1","Оказание Услуг","Петров Б.Б.","x","x","x","x","x","x","x","x","x","x","x","x","x","x","x"]
[null,null,null,null,null,null,null,null,null,null,null,null,null,null,null,null,null,null,null,null,{"$f":"COUNTIF($E17:$S18,\">0\")","v":0},{"$f":"COUNTIF($E17:$S18,\"=x\")","v":0}]
[5]
[null,null,null,null,null,null,null,null,null,null,null,null,null,null,null,null,null,null,null,null,{"$f":"COUNTIF($E19:$S20,\">0\")","v":0},{"$f":"COUNTIF($E19:$S20,\"=x\")","v":0}]
[6]
[null,null,null,null,"x","x","x","x","x","x",1,"x","x","x","x","x","x","x","x",null,{"$f":"COUNTIF($E21:$S22,\">0\")","v":2},{"$f":"COUNTIF($E21:$S22,\"=x\")","v":28}]
[7,"скв.№106-1","Оказание Услуг","Сидоров В.В.","x",1,"x","x","x","x","x","x","x","x","x","x","x","x","x"]
[null,null,null,null,null,null,null,null,null,null,null,null,null,null,null,null,null,null,null,null,{"$f":"COUNTIF($E23:$S24,\">0\")","v":0},{"$f":"COUNTIF($E23:$S24,\"=x\")","v":0}]
[8]
[null,null,null,null,null,null,null,null,null,null,null,null,null,null,null,null,null,null,null,null,{"$f":"COUNTIF($E25:$S26,\">0\")","v":0},{"$f":"COUNTIF($E25:$S26,\"=x\")","v":0}]
[]
[null,null,null,null,"x","x","x","x","x","x","x","x","x","x","x","x","x","x","x",null,{"$f":"COUNTIF($E27:$S28,\">0\")","v":1},{"$f":"COUNTIF($E27:$S28,\"=x\")","v":29}]
[10,"скв.№1073","Оказание Услуг","Кузнецов Г.Г.","x","x","x","x","x","x",1,"x","x","x","x","x","x","x","x"]
[null,null,null,null,null,null,null,null,null,null,null,null,null,null,null,null,null,null,null,null,{"$f":"COUNTIF($E29:$S30,\">0\")","v":0},{"$f":"COUNTIF($E29:$S30,\"=x\")","v":0}]
[11]
[null,null,null,null,null,null,null,null,null,null,null,null,null,null,null,null,null,null,null,null,{"$f":"COUNTIF($E31:$S32,\">0\")","v":0},{"$f":"COUNTIF($E31:$S32,\"=x\")","v":0}]
[12]
[null,null,null,null,null,null,null,null,null,null,null,null,null,null,null,null,null,null,"Итого:  ",null,{"$f":"SUM(U9:U32)","v":6},{"$f":"SUM(V9:V32)","v":114}]

{"sheet":"input_table","index":1,"n_rows":15,"n_cols":35,"rows_kept":15,"cut":false,"hidden":false,"merged":[]}
[1929,null,null,null,"ЕСЛИ(табель!$E$9>0;табель!$E$9;\"\")"]
[1,2,3,4,5,6,7,8,9,10,11,12,13,14,15,16,17,18,19,20,22,23,24,25,26,27,28,29,30,31,32,33,34,35,36]
["№\nп/п","Наименование объекта   ","Описание ","ФИО\n   ","не работал",{"$f":"табель!E6","v":"2020-09-26"},{"$f":"табель!F6","v":"2020-09-27"},{"$f":"табель!G6","v":"2020-09-28"},{"$f":"табель!H6","v":"2020-09-29"},{"$f":"табель!I6","v":"2020-09-30"},{"$f":"табель!J6","v":"2020-10-01"},{"$f":"табель!K6","v":"2020-10-02"},{"$f":"табель!L6","v":"2020-10-03"},{"$f":"табель!M6","v":"2020-10-04"},{"$f":"табель!N6","v":"2020-10-05"},{"$f":"табель!O6","v":"2020-10-06"},{"$f":"табель!P6","v":"2020-10-07"},{"$f":"табель!Q6","v":"2020-10-08"},{"$f":"табель!R6","v":"2020-10-09"},{"$f":"табель!S6","v":"2020-10-10"},{"$f":"табель!E7","v":"2020-10-11"},{"$f":"табель!F7","v":"2020-10-12"},{"$f":"табель!G7","v":"2020-10-13"},{"$f":"табель!H7","v":"2020-10-14"},{"$f":"табель!I7","v":"2020-10-15"},{"$f":"табель!J7","v":"2020-10-16"},{"$f":"табель!K7","v":"2020-10-17"},{"$f":"табель!L7","v":"2020-10-18"},{"$f":"табель!M7","v":"2020-10-19"},{"$f":"табель!N7","v":"2020-10-20"},{"$f":"табель!O7","v":"2020-10-21"},{"$f":"табель!P7","v":"2020-10-22"},{"$f":"табель!Q7","v":"2020-10-23"},{"$f":"табель!R7","v":"2020-10-24"},{"$f":"табель!S7","v":"2020-10-25"}]
[{"$f":"IF(табель!$A$10>0,табель!$A$10,\"\")","v":1},{"$f":"IF(табель!$B$10>0,табель!$B$10,\"\")","v":"скв.№106-1"},{"$f":"IF(табель!$C$10>0,табель!$C$10,\"\")","v":"Простой из-за погодных условий"},{"$f":"IF(табель!$D$10>0,табель!$D$10,\"\")","v":"Иванов А.А."},"26.10.2020, 27.10.2020, 28.10.2020, 29.10.2020, 30.10.2020, 31.10.2020, 01.11.2020, 02.11.2020, 03.11.2020, 04.11.2020, 05.11.2020, 06.11.2020, 07.11.2020, 08.11.2020, 09.11.2020, 11.11.2020, 12.11.2020, 13.11.2020, 14.11.2020, 16.11.2020, 17.11.2020, 18.11.2020, 19.11.2020, 20.11.2020, ",{"$f":"IF(табель!E9>0,табель!E9,\"\")","v":1},{"$f":"IF(табель!F9>0,табель!F9,\"\")","v":"x"},{"$f":"IF(табель!G9>0,табель!G9,\"\")","v":"x"},{"$f":"IF(табель!H9>0,табель!H9,\"\")","v":"x"},{"$f":"IF(табель!I9>0,табель!I9,\"\")","v":"x"},{"$f":"IF(табель!J9>0,табель!J9,\"\")","v":"x"},{"$f":"IF(табель!K9>0,табель!K9,\"\")","v":"x"},{"$f":"IF(табель!L9>0,табель!L9,\"\")","v":"x"},{"$f":"IF(табель!M9>0,табель!M9,\"\")","v":"x"},{"$f":"IF(табель!N9>0,табель!N9,\"\")","v":"x"},{"$f":"IF(табель!O9>0,табель!O9,\"\")","v":"x"},{"$f":"IF(табель!P9>0,табель!P9,\"\")","v":"x"},{"$f":"IF(табель!Q9>0,табель!Q9,\"\")","v":"x"},{"$f":"IF(табель!R9>0,табель!R9,\"\")","v":"x"},{"$f":"IF(табель!S9>0,табель!S9,\"\")","v":"x"},{"$f":"IF(табель!E10>0,табель!E10,\"\")","v":"x"},{"$f":"IF(табель!F10>0,табель!F10,\"\")","v":"x"},{"$f":"IF(табель!G10>0,табель!G10,\"\")","v":"x"},{"$f":"IF(табель!H10>0,табель!H10,\"\")","v":"x"},{"$f":"IF(табель!I10>0,табель!I10,\"\")","v":1},{"$f":"IF(табель!J10>0,табель!J10,\"\")","v":"x"},{"$f":"IF(табель!K10>0,табель!K10,\"\")","v":"x"},{"$f":"IF(табель!L10>0,табель!L10,\"\")","v":"x"},{"$f":"IF(табель!M10>0,табель!M10,\"\")","v":"x"},{"$f":"IF(табель!N10>0,табель!N10,\"\")","v":"x"},{"$f":"IF(табель!O10>0,табель!O10,\"\")","v":"x"},{"$f":"IF(табель!P10>0,табель!P10,\"\")","v":"x"},{"$f":"IF(табель!Q10>0,табель!Q10,\"\")","v":"x"},{"$f":"IF(табель!R10>0,табель!R10,\"\")","v":"x"},{"$f":"IF(табель!S10>0,табель!S10,\"\")","v":"x"}]
[{"$f":"IF(табель!$A$12>0,табель!$A$12,\"\")","v":2},{"$f":"IF(табель!$B$12>0,табель!$B$12,\"\")","v":""},{"$f":"IF(табель!$C$12>0,табель!$C$12,\"\")","v":""},{"$f":"IF(табель!$D$12>0,табель!$D$12,\"\")","v":""},null,{"$f":"IF(табель!E11>0,табель!E11,\"\")","v":""},{"$f":"IF(табель!F11>0,табель!F11,\"\")","v":""},{"$f":"IF(табель!G11>0,табель!G11,\"\")","v":""},{"$f":"IF(табель!H11>0,табель!H11,\"\")","v":""},{"$f":"IF(табель!I11>0,табель!I11,\"\")","v":""},{"$f":"IF(табель!J11>0,табель!J11,\"\")","v":""},{"$f":"IF(табель!K11>0,табель!K11,\"\")","v":""},{"$f":"IF(табель!L11>0,табель!L11,\"\")","v":""},{"$f":"IF(табель!M11>0,табель!M11,\"\")","v":""},{"$f":"IF(табель!N11>0,табель!N11,\"\")","v":""},{"$f":"IF(табель!O11>0,табель!O11,\"\")","v":""},{"$f":"IF(табель!P11>0,табель!P11,\"\")","v":""},{"$f":"IF(табель!Q11>0,табель!Q11,\"\")","v":""},{"$f":"IF(табель!R11>0,табель!R11,\"\")","v":""},{"$f":"IF(табель!S11>0,табель!S11,\"\")","v":""},{"$f":"IF(табель!E12>0,табель!E12,\"\")","v":""},{"$f":"IF(табель!F12>0,табель!F12,\"\")","v":""},{"$f":"IF(табель!G12>0,табель!G12,\"\")","v":""},{"$f":"IF(табель!H12>0,табель!H12,\"\")","v":""},{"$f":"IF(табель!I12>0,табель!I12,\"\")","v":""},{"$f":"IF(табель!J12>0,табель!J12,\"\")","v":""},{"$f":"IF(табель!K12>0,табель!K12,\"\")","v":""},{"$f":"IF(табель!L12>0,табель!L12,\"\")","v":""},{"$f":"IF(табель!M12>0,табель!M12,\"\")","v":""},{"$f":"IF(табель!N12>0,табель!N12,\"\")","v":""},{"$f":"IF(табель!O12>0,табель!O12,\"\")","v":""},{"$f":"IF(табель!P12>0,табель!P12,\"\")","v":""},{"$f":"IF(табель!Q12>0,табель!Q12,\"\")","v":""},{"$f":"IF(табель!R12>0,табель!R12,\"\")","v":""},{"$f":"IF(табель!S12>0,табель!S12,\"\")","v":""}]
[{"$f":"IF(табель!$A$14>0,табель!$A$14,\"\")","v":3},{"$f":"IF(табель!$B$14>0,табель!$B$14,\"\")","v":""},{"$f":"IF(табель!$C$14>0,табель!$C$14,\"\")","v":""},{"$f":"IF(табель!$D$14>0,табель!$D$14,\"\")","v":""},null,{"$f":"IF(табель!E13>0,табель!E13,\"\")","v":""},{"$f":"IF(табель!F13>0,табель!F13,\"\")","v":""},{"$f":"IF(табель!G13>0,табель!G13,\"\")","v":""},{"$f":"IF(табель!H13>0,табель!H13,\"\")","v":""},{"$f":"IF(табель!I13>0,табель!I13,\"\")","v":""},{"$f":"IF(табель!J13>0,табель!J13,\"\")","v":""},{"$f":"IF(табель!K13>0,табель!K13,\"\")","v":""},{"$f":"IF(табель!L13>0,табель!L13,\"\")","v":""},{"$f":"IF(табель!M13>0,табель!M13,\"\")","v":""},{"$f":"IF(табель!N13>0,табель!N13,\"\")","v":""},{"$f":"IF(табель!O13>0,табель!O13,\"\")","v":""},{"$f":"IF(табель!P13>0,табель!P13,\"\")","v":""},{"$f":"IF(табель!Q13>0,табель!Q13,\"\")","v":""},{"$f":"IF(табель!R13>0,табель!R13,\"\")","v":""},{"$f":"IF(табель!S13>0,табель!S13,\"\")","v":""},{"$f":"IF(табель!E14>0,табель!E14,\"\")","v":""},{"$f":"IF(табель!F14>0,табель!F14,\"\")","v":""},{"$f":"IF(табель!G14>0,табель!G14,\"\")","v":""},{"$f":"IF(табель!H14>0,табель!H14,\"\")","v":""},{"$f":"IF(табель!I14>0,табель!I14,\"\")","v":""},{"$f":"IF(табель!J14>0,табель!J14,\"\")","v":""},{"$f":"IF(табель!K14>0,табель!K14,\"\")","v":""},{"$f":"IF(табель!L14>0,табель!L14,\"\")","v":""},{"$f":"IF(табель!M14>0,табель!M14,\"\")","v":""},{"$f":"IF(табель!N14>0,табель!N14,\"\")","v":""},{"$f":"IF(табель!O14>0,табель!O14,\"\")","v":""},{"$f":"IF(табель!P14>0,табель!P14,\"\")","v":""},{"$f":"IF(табель!Q14>0,табель!Q14,\"\")","v":""},{"$f":"IF(табель!R14>0,табель!R14,\"\")","v":""},{"$f":"IF(табель!S14>0,табель!S14,\"\")","v":""}]
[{"$f":"IF(табель!$A$16>0,табель!$A$16,\"\")","v":4},{"$f":"IF(табель!$B$16>0,табель!$B$16,\"\")","v":"скв.№1033-1"},{"$f":"IF(табель!$C$16>0,табель!$C$16,\"\")","v":"Оказание Услуг"},{"$f":"IF(табель!$D$16>0,табель!$D$16,\"\")","v":"Петров Б.Б."}," 26.10.2020, 27.10.2020, 28.10.2020, 29.10.2020, 30.10.2020, 31.10.2020, 01.11.2020, 02.11.2020, 03.11.2020, 04.11.2020, 05.11.2020, 06.11.2020, 07.11.2020, 08.11.2020, 09.11.2020, 11.11.2020, 12.11.2020, 13.11.2020, 14.11.2020, 15.11.2020, 18.11.2020, 19.11.2020, 20.11.2020, ",{"$f":"IF(табель!E15>0,табель!E15,\"\")","v":1},{"$f":"IF(табель!F15>0,табель!F15,\"\")","v":"x"},{"$f":"IF(табель!G15>0,табель!G15,\"\")","v":"x"},{"$f":"IF(табель!H15>0,табель!H15,\"\")","v":"x"},{"$f":"IF(табель!I15>0,табель!I15,\"\")","v":"x"},{"$f":"IF(табель!J15>0,табель!J15,\"\")","v":"x"},{"$f":"IF(табель!K15>0,табель!K15,\"\")","v":"x"},{"$f":"IF(табель!L15>0,табель!L15,\"\")","v":"x"},{"$f":"IF(табель!M15>0,табель!M15,\"\")","v":"x"},{"$f":"IF(табель!N15>0,табель!N15,\"\")","v":"x"},{"$f":"IF(табель!O15>0,табель!O15,\"\")","v":"x"},{"$f":"IF(табель!P15>0,табель!P15,\"\")","v":"x"},{"$f":"IF(табель!Q15>0,табель!Q15,\"\")","v":"x"},{"$f":"IF(табель!R15>0,табель!R15,\"\")","v":"x"},{"$f":"IF(табель!S15>0,табель!S15,\"\")","v":"x"},{"$f":"IF(табель!E16>0,табель!E16,\"\")","v":"x"},{"$f":"IF(табель!F16>0,табель!F16,\"\")","v":"x"},{"$f":"IF(табель!G16>0,табель!G16,\"\")","v":"x"},{"$f":"IF(табель!H16>0,табель!H16,\"\")","v":"x"},{"$f":"IF(табель!I16>0,табель!I16,\"\")","v":"x"},{"$f":"IF(табель!J16>0,табель!J16,\"\")","v":"x"},{"$f":"IF(табель!K16>0,табель!K16,\"\")","v":"x"},{"$f":"IF(табель!L16>0,табель!L16,\"\")","v":"x"},{"$f":"IF(табель!M16>0,табель!M16,\"\")","v":"x"},{"$f":"IF(табель!N16>0,табель!N16,\"\")","v":"x"},{"$f":"IF(табель!O16>0,табель!O16,\"\")","v":"x"},{"$f":"IF(табель!P16>0,табель!P16,\"\")","v":"x"},{"$f":"IF(табель!Q16>0,табель!Q16,\"\")","v":"x"},{"$f":"IF(табель!R16>0,табель!R16,\"\")","v":"x"},{"$f":"IF(табель!S16>0,табель!S16,\"\")","v":"x"}]
[{"$f":"IF(табель!$A$18>0,табель!$A$18,\"\")","v":5},{"$f":"IF(табель!$B$18>0,табель!$B$18,\"\")","v":""},{"$f":"IF(табель!$C$18>0,табель!$C$18,\"\")","v":""},{"$f":"IF(табель!$D$18>0,табель!$D$18,\"\")","v":""},null,{"$f":"IF(табель!E17>0,табель!E13,\"\")","v":""},{"$f":"IF(табель!F17>0,табель!F13,\"\")","v":""},{"$f":"IF(табель!G17>0,табель!G13,\"\")","v":""},{"$f":"IF(табель!H17>0,табель!H13,\"\")","v":""},{"$f":"IF(табель!I17>0,табель!I13,\"\")","v":""},{"$f":"IF(табель!J17>0,табель!J13,\"\")","v":""},{"$f":"IF(табель!K17>0,табель!K13,\"\")","v":""},{"$f":"IF(табель!L17>0,табель!L13,\"\")","v":""},{"$f":"IF(табель!M17>0,табель!M13,\"\")","v":""},{"$f":"IF(табель!N17>0,табель!N13,\"\")","v":""},{"$f":"IF(табель!O17>0,табель!O13,\"\")","v":""},{"$f":"IF(табель!P17>0,табель!P13,\"\")","v":""},{"$f":"IF(табель!Q17>0,табель!Q13,\"\")","v":""},{"$f":"IF(табель!R17>0,табель!R13,\"\")","v":""},{"$f":"IF(табель!S17>0,табель!S13,\"\")","v":""},{"$f":"IF(табель!E18>0,табель!E18,\"\")","v":""},{"$f":"IF(табель!F18>0,табель!F18,\"\")","v":""},{"$f":"IF(табель!G18>0,табель!G18,\"\")","v":""},{"$f":"IF(табель!H18>0,табель!H18,\"\")","v":""},{"$f":"IF(табель!I18>0,табель!I18,\"\")","v":""},{"$f":"IF(табель!J18>0,табель!J18,\"\")","v":""},{"$f":"IF(табель!K18>0,табель!K18,\"\")","v":""},{"$f":"IF(табель!L18>0,табель!L18,\"\")","v":""},{"$f":"IF(табель!M18>0,табель!M18,\"\")","v":""},{"$f":"IF(табель!N18>0,табель!N18,\"\")","v":""},{"$f":"IF(табель!O18>0,табель!O18,\"\")","v":""},{"$f":"IF(табель!P18>0,табель!P18,\"\")","v":""},{"$f":"IF(табель!Q18>0,табель!Q18,\"\")","v":""},{"$f":"IF(табель!R18>0,табель!R18,\"\")","v":""},{"$f":"IF(табель!S18>0,табель!S18,\"\")","v":""}]
[{"$f":"IF(табель!$A$20>0,табель!$A$20,\"\")","v":6},{"$f":"IF(табель!$B$20>0,табель!$B$20,\"\")","v":""},{"$f":"IF(табель!$C$20>0,табель!$C$20,\"\")","v":""},{"$f":"IF(табель!$D$20>0,табель!$D$20,\"\")","v":""},null,{"$f":"IF(табель!E19>0,табель!E19,\"\")","v":""},{"$f":"IF(табель!F19>0,табель!F19,\"\")","v":""},{"$f":"IF(табель!G19>0,табель!G19,\"\")","v":""},{"$f":"IF(табель!H19>0,табель!H19,\"\")","v":""},{"$f":"IF(табель!I19>0,табель!I19,\"\")","v":""},{"$f":"IF(табель!J19>0,табель!J19,\"\")","v":""},{"$f":"IF(табель!K19>0,табель!K19,\"\")","v":""},{"$f":"IF(табель!L19>0,табель!L19,\"\")","v":""},{"$f":"IF(табель!M19>0,табель!M19,\"\")","v":""},{"$f":"IF(табель!N19>0,табель!N19,\"\")","v":""},{"$f":"IF(табель!O19>0,табель!O19,\"\")","v":""},{"$f":"IF(табель!P19>0,табель!P19,\"\")","v":""},{"$f":"IF(табель!Q19>0,табель!Q19,\"\")","v":""},{"$f":"IF(табель!R19>0,табель!R19,\"\")","v":""},{"$f":"IF(табель!S19>0,табель!S19,\"\")","v":""},{"$f":"IF(табель!E20>0,табель!E20,\"\")","v":""},{"$f":"IF(табель!F20>0,табель!F20,\"\")","v":""},{"$f":"IF(табель!G20>0,табель!G20,\"\")","v":""},{"$f":"IF(табель!H20>0,табель!H20,\"\")","v":""},{"$f":"IF(табель!I20>0,табель!I20,\"\")","v":""},{"$f":"IF(табель!J20>0,табель!J20,\"\")","v":""},{"$f":"IF(табель!K20>0,табель!K20,\"\")","v":""},{"$f":"IF(табель!L20>0,табель!L20,\"\")","v":""},{"$f":"IF(табель!M20>0,табель!M20,\"\")","v":""},{"$f":"IF(табель!N20>0,табель!N20,\"\")","v":""},{"$f":"IF(табель!O20>0,табель!O20,\"\")","v":""},{"$f":"IF(табель!P20>0,табель!P20,\"\")","v":""},{"$f":"IF(табель!Q20>0,табель!Q20,\"\")","v":""},{"$f":"IF(табель!R20>0,табель!R20,\"\")","v":""},{"$f":"IF(табель!S20>0,табель!S20,\"\")","v":""}]
[{"$f":"IF(табель!$A$22>0,табель!$A$22,\"\")","v":7},{"$f":"IF(табель!$B$22>0,табель!$B$22,\"\")","v":"скв.№106-1"},{"$f":"IF(табель!$C$22>0,табель!$C$22,\"\")","v":"Оказание Услуг"},{"$f":"IF(табель!$D$22>0,табель!$D$22,\"\")","v":"Сидоров В.В."}," 26.10.2020, 27.10.2020, 28.10.2020, 29.10.2020, 30.10.2020, 31.10.2020, 01.11.2020, 02.11.2020, 03.11.2020, 04.11.2020, 05.11.2020, 06.11.2020, 07.11.2020, 08.11.2020, 09.11.2020, 11.11.2020, 13.11.2020, 14.11.2020, 15.11.2020, 16.11.2020, 17.11.2020, 18.11.2020, 19.11.2020, 20.11.2020, ",{"$f":"IF(табель!E21>0,табель!E21,\"\")","v":"x"},{"$f":"IF(табель!F21>0,табель!F21,\"\")","v":"x"},{"$f":"IF(табель!G21>0,табель!G21,\"\")","v":"x"},{"$f":"IF(табель!H21>0,табель!H21,\"\")","v":"x"},{"$f":"IF(табель!I21>0,табель!I21,\"\")","v":"x"},{"$f":"IF(табель!J21>0,табель!J21,\"\")","v":"x"},{"$f":"IF(табель!K21>0,табель!K21,\"\")","v":1},{"$f":"IF(табель!L21>0,табель!L21,\"\")","v":"x"},{"$f":"IF(табель!M21>0,табель!M21,\"\")","v":"x"},{"$f":"IF(табель!N21>0,табель!N21,\"\")","v":"x"},{"$f":"IF(табель!O21>0,табель!O21,\"\")","v":"x"},{"$f":"IF(табель!P21>0,табель!P21,\"\")","v":"x"},{"$f":"IF(табель!Q21>0,табель!Q21,\"\")","v":"x"},{"$f":"IF(табель!R21>0,табель!R21,\"\")","v":"x"},{"$f":"IF(табель!S21>0,табель!S21,\"\")","v":"x"},{"$f":"IF(табель!E22>0,табель!E22,\"\")","v":"x"},{"$f":"IF(табель!F22>0,табель!F22,\"\")","v":1},{"$f":"IF(табель!G22>0,табель!G22,\"\")","v":"x"},{"$f":"IF(табель!H22>0,табель!H22,\"\")","v":"x"},{"$f":"IF(табель!I22>0,табель!I22,\"\")","v":"x"},{"$f":"IF(табель!J22>0,табель!J22,\"\")","v":"x"},{"$f":"IF(табель!K22>0,табель!K22,\"\")","v":"x"},{"$f":"IF(табель!L22>0,табель!L22,\"\")","v":"x"},{"$f":"IF(табель!M22>0,табель!M22,\"\")","v":"x"},{"$f":"IF(табель!N22>0,табель!N22,\"\")","v":"x"},{"$f":"IF(табель!O22>0,табель!O22,\"\")","v":"x"},{"$f":"IF(табель!P22>0,табель!P22,\"\")","v":"x"},{"$f":"IF(табель!Q22>0,табель!Q22,\"\")","v":"x"},{"$f":"IF(табель!R22>0,табель!R22,\"\")","v":"x"},{"$f":"IF(табель!S22>0,табель!S22,\"\")","v":"x"}]
[{"$f":"IF(табель!$A$24>0,табель!$A$24,\"\")","v":8},{"$f":"IF(табель!$B$24>0,табель!$B$24,\"\")","v":""},{"$f":"IF(табель!$C$24>0,табель!$C$24,\"\")","v":""},{"$f":"IF(табель!$D$24>0,табель!$D$24,\"\")","v":""},null,{"$f":"IF(табель!E23>0,табель!E16,\"\")","v":""},{"$f":"IF(табель!F23>0,табель!F16,\"\")","v":""},{"$f":"IF(табель!G23>0,табель!G16,\"\")","v":""},{"$f":"IF(табель!H23>0,табель!H16,\"\")","v":""},{"$f":"IF(табель!I23>0,табель!I16,\"\")","v":""},{"$f":"IF(табель!J23>0,табель!J16,\"\")","v":""},{"$f":"IF(табель!K23>0,табель!K16,\"\")","v":""},{"$f":"IF(табель!L23>0,табель!L16,\"\")","v":""},{"$f":"IF(табель!M23>0,табель!M16,\"\")","v":""},{"$f":"IF(табель!N23>0,табель!N16,\"\")","v":""},{"$f":"IF(табель!O23>0,табель!O16,\"\")","v":""},{"$f":"IF(табель!P23>0,табель!P16,\"\")","v":""},{"$f":"IF(табель!Q23>0,табель!Q16,\"\")","v":""},{"$f":"IF(табель!R23>0,табель!R16,\"\")","v":""},{"$f":"IF(табель!S23>0,табель!S16,\"\")","v":""},{"$f":"IF(табель!E24>0,табель!E24,\"\")","v":""},{"$f":"IF(табель!F24>0,табель!F24,\"\")","v":""},{"$f":"IF(табель!G24>0,табель!G24,\"\")","v":""},{"$f":"IF(табель!H24>0,табель!H24,\"\")","v":""},{"$f":"IF(табель!I24>0,табель!I24,\"\")","v":""},{"$f":"IF(табель!J24>0,табель!J24,\"\")","v":""},{"$f":"IF(табель!K24>0,табель!K24,\"\")","v":""},{"$f":"IF(табель!L24>0,табель!L24,\"\")","v":""},{"$f":"IF(табель!M24>0,табель!M24,\"\")","v":""},{"$f":"IF(табель!N24>0,табель!N24,\"\")","v":""},{"$f":"IF(табель!O24>0,табель!O24,\"\")","v":""},{"$f":"IF(табель!P24>0,табель!P24,\"\")","v":""},{"$f":"IF(табель!Q24>0,табель!Q24,\"\")","v":""},{"$f":"IF(табель!R24>0,табель!R24,\"\")","v":""},{"$f":"IF(табель!S24>0,табель!S24,\"\")","v":""}]
[{"$f":"IF(табель!$A$26>0,табель!$A$26,\"\")","v":""},{"$f":"IF(табель!$B$26>0,табель!$B$26,\"\")","v":""},{"$f":"IF(табель!$C$26>0,табель!$C$26,\"\")","v":""},{"$f":"IF(табель!$D$26>0,табель!$D$26,\"\")","v":""},null,{"$f":"IF(табель!E25>0,табель!E25,\"\")","v":""},{"$f":"IF(табель!F25>0,табель!F25,\"\")","v":""},{"$f":"IF(табель!G25>0,табель!G25,\"\")","v":""},{"$f":"IF(табель!H25>0,табель!H25,\"\")","v":""},{"$f":"IF(табель!I25>0,табель!I25,\"\")","v":""},{"$f":"IF(табель!J25>0,табель!J25,\"\")","v":""},{"$f":"IF(табель!K25>0,табель!K25,\"\")","v":""},{"$f":"IF(табель!L25>0,табель!L25,\"\")","v":""},{"$f":"IF(табель!M25>0,табель!M25,\"\")","v":""},{"$f":"IF(табель!N25>0,табель!N25,\"\")","v":""},{"$f":"IF(табель!O25>0,табель!O25,\"\")","v":""},{"$f":"IF(табель!P25>0,табель!P25,\"\")","v":""},{"$f":"IF(табель!Q25>0,табель!Q25,\"\")","v":""},{"$f":"IF(табель!R25>0,табель!R25,\"\")","v":""},{"$f":"IF(табель!S25>0,табель!S25,\"\")","v":""},{"$f":"IF(табель!E26>0,табель!E26,\"\")","v":""},{"$f":"IF(табель!F26>0,табель!F26,\"\")","v":""},{"$f":"IF(табель!G26>0,табель!G26,\"\")","v":""},{"$f":"IF(табель!H26>0,табель!H26,\"\")","v":""},{"$f":"IF(табель!I26>0,табель!I26,\"\")","v":""},{"$f":"IF(табель!J26>0,табель!J26,\"\")","v":""},{"$f":"IF(табель!K26>0,табель!K26,\"\")","v":""},{"$f":"IF(табель!L26>0,табель!L26,\"\")","v":""},{"$f":"IF(табель!M26>0,табель!M26,\"\")","v":""},{"$f":"IF(табель!N26>0,табель!N26,\"\")","v":""},{"$f":"IF(табель!O26>0,табель!O26,\"\")","v":""},{"$f":"IF(табель!P26>0,табель!P26,\"\")","v":""},{"$f":"IF(табель!Q26>0,табель!Q26,\"\")","v":""},{"$f":"IF(табель!R26>0,табель!R26,\"\")","v":""},{"$f":"IF(табель!S26>0,табель!S26,\"\")","v":""}]
[{"$f":"IF(табель!$A$28>0,табель!$A$28,\"\")","v":10},{"$f":"IF(табель!$B$28>0,табель!$B$28,\"\")","v":"скв.№1073"},{"$f":"IF(табель!$C$28>0,табель!$C$28,\"\")","v":"Оказание Услуг"},{"$f":"IF(табель!$D$28>0,табель!$D$28,\"\")","v":"Кузнецов Г.Г."}," 26.10.2020, 27.10.2020, 28.10.2020, 29.10.2020, 30.10.2020, 31.10.2020, 01.11.2020, 02.11.2020, 03.11.2020, 04.11.2020, 05.11.2020, 06.11.2020, 07.11.2020, 08.11.2020, 09.11.2020, 11.11.2020, 13.11.2020, 14.11.2020, 15.11.2020, 16.11.2020, 17.11.2020, 18.11.2020, 19.11.2020, 20.11.2020, ",{"$f":"IF(табель!E27>0,табель!E27,\"\")","v":"x"},{"$f":"IF(табель!F27>0,табель!F27,\"\")","v":"x"},{"$f":"IF(табель!G27>0,табель!G27,\"\")","v":"x"},{"$f":"IF(табель!H27>0,табель!H27,\"\")","v":"x"},{"$f":"IF(табель!I27>0,табель!I27,\"\")","v":"x"},{"$f":"IF(табель!J27>0,табель!J27,\"\")","v":"x"},{"$f":"IF(табель!K27>0,табель!K27,\"\")","v":"x"},{"$f":"IF(табель!L27>0,табель!L27,\"\")","v":"x"},{"$f":"IF(табель!M27>0,табель!M27,\"\")","v":"x"},{"$f":"IF(табель!N27>0,табель!N27,\"\")","v":"x"},{"$f":"IF(табель!O27>0,табель!O27,\"\")","v":"x"},{"$f":"IF(табель!P27>0,табель!P27,\"\")","v":"x"},{"$f":"IF(табель!Q27>0,табель!Q27,\"\")","v":"x"},{"$f":"IF(табель!R27>0,табель!R27,\"\")","v":"x"},{"$f":"IF(табель!S27>0,табель!S27,\"\")","v":"x"},{"$f":"IF(табель!E28>0,табель!E28,\"\")","v":"x"},{"$f":"IF(табель!F28>0,табель!F28,\"\")","v":"x"},{"$f":"IF(табель!G28>0,табель!G28,\"\")","v":"x"},{"$f":"IF(табель!H28>0,табель!H28,\"\")","v":"x"},{"$f":"IF(табель!I28>0,табель!I28,\"\")","v":"x"},{"$f":"IF(табель!J28>0,табель!J28,\"\")","v":"x"},{"$f":"IF(табель!K28>0,табель!K28,\"\")","v":1},{"$f":"IF(табель!L28>0,табель!L28,\"\")","v":"x"},{"$f":"IF(табель!M28>0,табель!M28,\"\")","v":"x"},{"$f":"IF(табель!N28>0,табель!N28,\"\")","v":"x"},{"$f":"IF(табель!O28>0,табель!O28,\"\")","v":"x"},{"$f":"IF(табель!P28>0,табель!P28,\"\")","v":"x"},{"$f":"IF(табель!Q28>0,табель!Q28,\"\")","v":"x"},{"$f":"IF(табель!R28>0,табель!R28,\"\")","v":"x"},{"$f":"IF(табель!S28>0,табель!S28,\"\")","v":"x"}]
[{"$f":"IF(табель!$A$30>0,табель!$A$30,\"\")","v":11},{"$f":"IF(табель!$B$30>0,табель!$B$30,\"\")","v":""},{"$f":"IF(табель!$C$30>0,табель!$C$30,\"\")","v":""},{"$f":"IF(табель!$D$30>0,табель!$D$30,\"\")","v":""},null,{"$f":"IF(табель!E29>0,табель!E29,\"\")","v":""},{"$f":"IF(табель!F29>0,табель!F29,\"\")","v":""},{"$f":"IF(табель!G29>0,табель!G29,\"\")","v":""},{"$f":"IF(табель!H29>0,табель!H29,\"\")","v":""},{"$f":"IF(табель!I29>0,табель!I29,\"\")","v":""},{"$f":"IF(табель!J29>0,табель!J29,\"\")","v":""},{"$f":"IF(табель!K29>0,табель!K29,\"\")","v":""},{"$f":"IF(табель!L29>0,табель!L29,\"\")","v":""},{"$f":"IF(табель!M29>0,табель!M29,\"\")","v":""},{"$f":"IF(табель!N29>0,табель!N29,\"\")","v":""},{"$f":"IF(табель!O29>0,табель!O29,\"\")","v":""},{"$f":"IF(табель!P29>0,табель!P29,\"\")","v":""},{"$f":"IF(табель!Q29>0,табель!Q29,\"\")","v":""},{"$f":"IF(табель!R29>0,табель!R29,\"\")","v":""},{"$f":"IF(табель!S29>0,табель!S29,\"\")","v":""},{"$f":"IF(табель!E30>0,табель!E30,\"\")","v":""},{"$f":"IF(табель!F30>0,табель!F30,\"\")","v":""},{"$f":"IF(табель!G30>0,табель!G30,\"\")","v":""},{"$f":"IF(табель!H30>0,табель!H30,\"\")","v":""},{"$f":"IF(табель!I30>0,табель!I30,\"\")","v":""},{"$f":"IF(табель!J30>0,табель!J30,\"\")","v":""},{"$f":"IF(табель!K30>0,табель!K30,\"\")","v":""},{"$f":"IF(табель!L30>0,табель!L30,\"\")","v":""},{"$f":"IF(табель!M30>0,табель!M30,\"\")","v":""},{"$f":"IF(табель!N30>0,табель!N30,\"\")","v":""},{"$f":"IF(табель!O30>0,табель!O30,\"\")","v":""},{"$f":"IF(табель!P30>0,табель!P30,\"\")","v":""},{"$f":"IF(табель!Q30>0,табель!Q30,\"\")","v":""},{"$f":"IF(табель!R30>0,табель!R30,\"\")","v":""},{"$f":"IF(табель!S30>0,табель!S30,\"\")","v":""}]
[{"$f":"IF(табель!$A$32>0,табель!$A$32,\"\")","v":12},{"$f":"IF(табель!$B$32>0,табель!$B$32,\"\")","v":""},{"$f":"IF(табель!$C$32>0,табель!$C$32,\"\")","v":""},{"$f":"IF(табель!$D$32>0,табель!$D$32,\"\")","v":""},null,{"$f":"IF(табель!E31>0,табель!E31,\"\")","v":""},{"$f":"IF(табель!F31>0,табель!F31,\"\")","v":""},{"$f":"IF(табель!G31>0,табель!G31,\"\")","v":""},{"$f":"IF(табель!H31>0,табель!H31,\"\")","v":""},{"$f":"IF(табель!I31>0,табель!I31,\"\")","v":""},{"$f":"IF(табель!J31>0,табель!J31,\"\")","v":""},{"$f":"IF(табель!K31>0,табель!K31,\"\")","v":""},{"$f":"IF(табель!L31>0,табель!L31,\"\")","v":""},{"$f":"IF(табель!M31>0,табель!M31,\"\")","v":""},{"$f":"IF(табель!N31>0,табель!N31,\"\")","v":""},{"$f":"IF(табель!O31>0,табель!O31,\"\")","v":""},{"$f":"IF(табель!P31>0,табель!P31,\"\")","v":""},{"$f":"IF(табель!Q31>0,табель!Q31,\"\")","v":""},{"$f":"IF(табель!R31>0,табель!R31,\"\")","v":""},{"$f":"IF(табель!S31>0,табель!S31,\"\")","v":""},{"$f":"IF(табель!E32>0,табель!E32,\"\")","v":""},{"$f":"IF(табель!F32>0,табель!F32,\"\")","v":""},{"$f":"IF(табель!G32>0,табель!G32,\"\")","v":""},{"$f":"IF(табель!H32>0,табель!H32,\"\")","v":""},{"$f":"IF(табель!I32>0,табель!I32,\"\")","v":""},{"$f":"IF(табель!J32>0,табель!J32,\"\")","v":""},{"$f":"IF(табель!K32>0,табель!K32,\"\")","v":""},{"$f":"IF(табель!L32>0,табель!L32,\"\")","v":""},{"$f":"IF(табель!M32>0,табель!M32,\"\")","v":""},{"$f":"IF(табель!N32>0,табель!N32,\"\")","v":""},{"$f":"IF(табель!O32>0,табель!O32,\"\")","v":""},{"$f":"IF(табель!P32>0,табель!P32,\"\")","v":""},{"$f":"IF(табель!Q32>0,табель!Q32,\"\")","v":""},{"$f":"IF(табель!R32>0,табель!R32,\"\")","v":""},{"$f":"IF(табель!S32>0,табель!S32,\"\")","v":""}]

{"sheet":"Табель фио-пропуски","index":2,"n_rows":16,"n_cols":4,"rows_kept":16,"cut":false,"hidden":false,"merged":[]}
[]
["Табель пропущенных дней"]
["№ п/п","ФИО","Не работал","Итого дней отсутствия"]
[]
[1,"Иванов А.А.","27.09.2020, 28.09.2020, 29.09.2020, 30.09.2020, 01.10.2020, 02.10.2020, 03.10.2020, 04.10.2020, 05.10.2020, 06.10.2020, 07.10.2020, 08.10.2020, 09.10.2020, 10.10.2020, 11.10.2020, 12.10.2020, 13.10.2020, 14.10.2020, 16.10.2020, 17.10.2020, 18.10.2020, 19.10.2020, 20.10.2020, 21.10.2020, 22.10.2020, 23.10.2020, 24.10.2020, 25.10.2020, ",28]
[2,"Иванов А.А.",null,0]
[3,"Иванов А.А.",null,0]
[4,"Петров Б.Б.","27.09.2020, 28.09.2020, 29.09.2020, 30.09.2020, 01.10.2020, 02.10.2020, 03.10.2020, 04.10.2020, 05.10.2020, 06.10.2020, 07.10.2020, 08.10.2020, 09.10.2020, 10.10.2020, 11.10.2020, 12.10.2020, 13.10.2020, 14.10.2020, 15.10.2020, 16.10.2020, 17.10.2020, 18.10.2020, 19.10.2020, 20.10.2020, 21.10.2020, 22.10.2020, 23.10.2020, 24.10.2020, 25.10.2020, ",29]
[5,"Петров Б.Б.",null,0]
[6,"Петров Б.Б.",null,0]
[7,"Сидоров В.В.","26.09.2020, 27.09.2020, 28.09.2020, 29.09.2020, 30.09.2020, 01.10.2020, 03.10.2020, 04.10.2020, 05.10.2020, 06.10.2020, 07.10.2020, 08.10.2020, 09.10.2020, 10.10.2020, 11.10.2020, 13.10.2020, 14.10.2020, 15.10.2020, 16.10.2020, 17.10.2020, 18.10.2020, 19.10.2020, 20.10.2020, 21.10.2020, 22.10.2020, 23.10.2020, 24.10.2020, 25.10.2020, ",28]
[8,"Сидоров В.В.",null,0]
[9,"Сидоров В.В.",null,0]
[10,"Кузнецов Г.Г.","26.09.2020, 27.09.2020, 28.09.2020, 29.09.2020, 30.09.2020, 01.10.2020, 02.10.2020, 03.10.2020, 04.10.2020, 05.10.2020, 06.10.2020, 07.10.2020, 08.10.2020, 09.10.2020, 10.10.2020, 11.10.2020, 12.10.2020, 13.10.2020, 14.10.2020, 15.10.2020, 16.10.2020, 18.10.2020, 19.10.2020, 20.10.2020, 21.10.2020, 22.10.2020, 23.10.2020, 24.10.2020, 25.10.2020, ",29]
[11,"Кузнецов Г.Г.",null,0]
[12,"Кузнецов Г.Г.",null,0]