{"text_format":"1","workbook":"xlsx","n_sheets":4,"sheets":["Списки УОП","ЖУВР","ИДР","ИКРР"],"not_rendered":{"charts":0,"images":0,"macros":1,"external_links":1,"defined_names":3,"comments":0,"pivot_tables":0},"unopened":[],"bounds":{"document_bytes":16777216,"sheet_cells":100000,"rows_first":2000,"rows_last":500,"rows_between":2000,"halvings":0,"cell_chars":16384,"cell_head_chars":4096},"cells_cut":0,"cells_raw":0,"read":"whole","date_system":"1900"}

{"sheet":"Списки УОП","index":0,"n_rows":302,"n_cols":8,"rows_kept":302,"cut":false,"hidden":false,"merged":[[2,0,2,7]]}
[null,"выкл ","подстветку","вкл"]
[]
["общий список детей"]
["№ ","группа","код","возраст","пол","фамилия","имя","код нарушения"]
[1,10,{"$f":"CONCATENATE(LEFT(F5),LEFT(G5))","v":"ЖИ"},{"$f":"VLOOKUP(список_детей[[#This Row],[группа]],[1]!груп_воз[#Data],2,0)","v":{"$error":"#REF!"}},"д","Жукова","Ирина","ТНР"]
[2,10,"КЛ",{"$f":"VLOOKUP(список_детей[[#This Row],[группа]],[1]!груп_воз[#Data],2,0)","v":{"$error":"#REF!"}},"д","Карявина","Любовь","ТНР"]
[3,10,"ББ",{"$f":"VLOOKUP(список_детей[[#This Row],[группа]],[1]!груп_воз[#Data],2,0)","v":{"$error":"#REF!"}},"м","Бабанов","Бронислав","ТНР"]
[4,10,"БХ",{"$f":"VLOOKUP(список_детей[[#This Row],[группа]],[1]!груп_воз[#Data],2,0)","v":{"$error":"#REF!"}},"м","Быстров","Харитон","ТНР"]
[5,10,"ЮЧ",{"$f":"VLOOKUP(список_детей[[#This Row],[группа]],[1]!груп_воз[#Data],2,0)","v":{"$error":"#REF!"}},"м","Юганцев","Чеслав","ТНР"]
[6,10,"СЕ",{"$f":"VLOOKUP(список_детей[[#This Row],[группа]],[1]!груп_воз[#Data],2,0)","v":{"$error":"#REF!"}},"д","Савинкова","Елизавета","ТНР"]
{"$rows_left_out":293}
{"sheet":"ЖУВР","index":1,"n_rows":36,"n_cols":23,"rows_kept":36,"cut":false,"hidden":false,"merged":[[0,1,0,17]]}
[null,"ЖУРНАЛ УЧЁТА ВИДОВ РАБОТЫ"]
[null,"№ пп","месяц","группа","номер ребенка/группы","Код ребенка","Возраст","Первичное обследование","Вторичное обследовние","Групповая диагностика","Индивидуальное занятие","Групповая КРР\n/ (тренинг)","Индивидуальная консультация","Консультация для родителей\n(собрание)","Консультация для специалистов","Участие\\проведение консилиума","Проведение\\посещение занятий","Другие виды работ (в т.ч. семинары и групповые консультации)"]
[null,1,null,{"$f":"VLOOKUP(E3,[1]!список_детей[#Data],2,1)","v":10},1,{"$f":"VLOOKUP(E3,[1]!список_детей[#Data],3,1)","v":"ЖИ"},{"$f":"VLOOKUP(E3,[1]!список_детей[#Data],4,1)","v":"5-6 лет"},{"$f":"INDEX([1]!ИДР[[#All],[месяц]:[Код участника]],MATCH(ЖУВР[[#This Row],[номер ребенка/группы]],[1]!ИДР[[#All],[номер участника]]),2)","v":"2020-09-02"},null,{"$f":"INDEX([1]!ГДР[#All],MATCH(D3,[1]!ГДР[[#All],[ Группа]],0),2)","v":"2020-10-01"},null,null,null,null,null,null,null,null,null,{"$f":"IF(INDEX([1]ИДР!$D:$D,MATCH(E3,[1]!ИДР[[#All],[номер участника]],0))=1,\"+\",\"\")","v":""},null,"подстветка","выкл"]
[null,2,{"$f":"TEXT(#REF!,\"МММ\")","v":{"$error":"#REF!"}},{"$f":"VLOOKUP(E4,[1]!список_детей[#Data],2,1)","v":10},2,{"$f":"VLOOKUP(E4,[1]!список_детей[#Data],3,1)","v":"КЛ"},{"$f":"VLOOKUP(E4,[1]!список_детей[#Data],4,1)","v":"5-6 лет"},{"$f":"INDEX([1]!ИДР[[#All],[месяц]:[Код участника]],MATCH(ЖУВР[[#This Row],[номер ребенка/группы]],[1]!ИДР[[#All],[номер участника]]),2)","v":"2020-09-02"},{"$f":"IF(INDEX([1]ИДР!$D:$D,MATCH(E4,[1]!ИДР[[#All],[номер участника]],0))=2,\"+\",\"\")","v":"+"},{"$f":"INDEX([1]!ГДР[#All],MATCH(D4,[1]!ГДР[[#All],[ Группа]],0),2)","v":"2020-10-01"},null,null,null,null,null,null,null,null,null,{"$f":"IF([1]!ГДР[[#This Row],[Дата проведения]],INDEX([1]!ГДР[[#All],[ Группа]],MATCH([1]!ГДР[[#This Row],[ Группа]],[1]!ГДР[[#All],[ Группа]],0)),\"\")","v":10}]
[null,3,{"$f":"TEXT(#REF!,\"МММ\")","v":{"$error":"#REF!"}},{"$f":"VLOOKUP(E5,[1]!список_детей[#Data],2,1)","v":10},3,{"$f":"VLOOKUP(E5,[1]!список_детей[#Data],3,1)","v":"ББ"},{"$f":"VLOOKUP(E5,[1]!список_детей[#Data],4,1)","v":"5-6 лет"},{"$f":"INDEX([1]!ИДР[[#All],[месяц]:[Код участника]],MATCH(ЖУВР[[#This Row],[номер ребенка/группы]],[1]!ИДР[[#All],[номер участника]]),2)","v":"2020-09-03"},{"$f":"IF(INDEX([1]ИДР!$D:$D,MATCH(E5,[1]!ИДР[[#All],[номер участника]],0))=2,\"+\",\"\")","v":"+"},{"$f":"INDEX([1]!ГДР[#All],MATCH(D5,[1]!ГДР[[#All],[ Группа]],0),2)","v":"2020-10-01"}]
[null,4,{"$f":"TEXT(#REF!,\"МММ\")","v":{"$error":"#REF!"}},{"$f":"VLOOKUP(E6,[1]!список_детей[#Data],2,1)","v":10},4,{"$f":"VLOOKUP(E6,[1]!список_детей[#Data],3,1)","v":"БХ"},{"$f":"VLOOKUP(E6,[1]!список_детей[#Data],4,1)","v":"5-6 лет"},{"$f":"INDEX([1]!ИДР[[#All],[месяц]:[Код участника]],MATCH(ЖУВР[[#This Row],[номер ребенка/группы]],[1]!ИДР[[#All],[номер участника]]),2)","v":"2020-09-04"},null,{"$f":"INDEX([1]!ГДР[#All],MATCH(D6,[1]!ГДР[[#All],[ Группа]],0),2)","v":"2020-10-01"}]
[null,5,{"$f":"TEXT(#REF!,\"МММ\")","v":{"$error":"#REF!"}},{"$f":"VLOOKUP(E7,[1]!список_детей[#Data],2,1)","v":10},5,{"$f":"VLOOKUP(E7,[1]!список_детей[#Data],3,1)","v":"ЮЧ"},{"$f":"VLOOKUP(E7,[1]!список_детей[#Data],4,1)","v":"5-6 лет"},{"$f":"INDEX([1]!ИДР[[#All],[месяц]:[Код участника]],MATCH(ЖУВР[[#This Row],[номер ребенка/группы]],[1]!ИДР[[#All],[номер участника]]),2)","v":"2020-09-05"},null,{"$f":"INDEX([1]!ГДР[#All],MATCH(D7,[1]!ГДР[[#All],[ Группа]],0),2)","v":"2020-10-01"},null,null,null,null,null,null,null,null,null,"ИНДЕКС(ИДР[[#Все];[месяц]:[Код участника]];ПОИСКПОЗ([@[номер ребенка/группы]];ИДР[[#Все];[номер участника]]);2)"]
[null,6,{"$f":"TEXT(#REF!,\"МММ\")","v":{"$error":"#REF!"}},{"$f":"VLOOKUP(E8,[1]!список_детей[#Data],2,1)","v":10},6,{"$f":"VLOOKUP(E8,[1]!список_детей[#Data],3,1)","v":"СЕ"},{"$f":"VLOOKUP(E8,[1]!список_детей[#Data],4,1)","v":"5-6 лет"},{"$f":"INDEX([1]!ИДР[[#All],[месяц]:[Код участника]],MATCH(ЖУВР[[#This Row],[номер ребенка/группы]],[1]!ИДР[[#All],[номер участника]]),2)","v":"2020-09-06"},{"$f":"IF(INDEX([1]ИДР!$D:$D,MATCH(E8,[1]!ИДР[[#All],[номер участника]],0))=2,\"+\",\"\")","v":""},{"$f":"INDEX([1]!ГДР[#All],MATCH(D8,[1]!ГДР[[#All],[ Группа]],0),2)","v":"2020-10-01"}]
[null,7,{"$f":"TEXT(#REF!,\"МММ\")","v":{"$error":"#REF!"}},{"$f":"VLOOKUP(E9,[1]!список_детей[#Data],2,1)","v":10},7,{"$f":"VLOOKUP(E9,[1]!список_детей[#Data],3,1)","v":"БА"},{"$f":"VLOOKUP(E9,[1]!список_детей[#Data],4,1)","v":"5-6 лет"},{"$f":"INDEX([1]!ИДР[[#All],[месяц]:[Код участника]],MATCH(ЖУВР[[#This Row],[номер ребенка/группы]],[1]!ИДР[[#All],[номер участника]]),2)","v":"2020-09-07"},{"$f":"IF(INDEX([1]ИДР!$D:$D,MATCH(E9,[1]!ИДР[[#All],[номер участника]],0))=2,\"+\",\"\")","v":""},{"$f":"INDEX([1]!ГДР[#All],MATCH(D9,[1]!ГДР[[#All],[ Группа]],0),2)","v":"2020-10-01"}]
[null,8,{"$f":"TEXT(#REF!,\"МММ\")","v":{"$error":"#REF!"}},{"$f":"VLOOKUP(E10,[1]!список_детей[#Data],2,1)","v":10},8,{"$f":"VLOOKUP(E10,[1]!список_детей[#Data],3,1)","v":"КЗ"},{"$f":"VLOOKUP(E10,[1]!список_детей[#Data],4,1)","v":"5-6 лет"},{"$f":"INDEX([1]!ИДР[[#All],[месяц]:[Код участника]],MATCH(ЖУВР[[#This Row],[номер ребенка/группы]],[1]!ИДР[[#All],[номер участника]]),2)","v":"2020-09-08"},{"$f":"IF(INDEX([1]ИДР!$D:$D,MATCH(E10,[1]!ИДР[[#All],[номер участника]],0))=2,\"+\",\"\")","v":""},{"$f":"INDEX([1]!ГДР[#All],MATCH(D10,[1]!ГДР[[#All],[ Группа]],0),2)","v":"2020-10-01"}]
{"$rows_left_out":27}
{"sheet":"ИДР","index":2,"n_rows":298,"n_cols":23,"rows_kept":298,"cut":false,"hidden":false,"merged":[[0,1,0,10]]}
[]
[null,"месяц","Дата проведения","Вид обследования","номер участника","Код участника","возраст","пол","Группа","Код обращения","Используемые методики",null,"сентябрь","подсчет по месяцам","Кол-во по коду","подсчет по годам","Кол-во детей","подсчет по полу","Кол-во по полу","Вид обследования","Кол-во по виду"]
[null,{"$f":"TEXT(C3,\"ММММ\")","v":"Сентябрь"},"2020-09-02",2,1,{"$f":"VLOOKUP(E3,[1]!список_детей[#Data],3,1)","v":{"$error":"#REF!"}},{"$f":"VLOOKUP(E3,[1]!список_детей[#Data],4,1)","v":{"$error":"#REF!"}},{"$f":"VLOOKUP(E3,[1]!список_детей[#Data],5,1)","v":{"$error":"#REF!"}},{"$f":"VLOOKUP(E3,[1]!список_детей[#Data],2,1)","v":{"$error":"#REF!"}},"ИО",{"$f":"VLOOKUP(J3,[1]!СИДМ[#Data],3,0)","v":"Психолого-педагогическая диагностика нарушений развития детей раннего и дошкольного возраста"},null,null,"ООП",{"$f":"COUNTIFS(ИДР[месяц],$M$2,ИДР[Код обращения],N3)","v":3},"1-2 года",{"$f":"COUNTIFS(ИДР[месяц],$M$2,ИДР[возраст],P3)","v":0},"д",{"$f":"COUNTIF(ИДР[пол],R3)","v":17},1,{"$f":"COUNTIFS(ИДР[месяц],M2,ИДР[Вид обследования],T3)","v":15},null,{"$f":"INDEX(ИДР[[#All],[месяц]:[Код участника]],MATCH(ИДР[[#This Row],[номер участника]],ИДР[[#All],[номер участника]]),2)","v":"2020-09-02"}]
[null,{"$f":"TEXT(C4,\"ММММ\")","v":"Сентябрь"},"2020-09-02",2,2,{"$f":"VLOOKUP(E4,[1]!список_детей[#Data],3,1)","v":"КЛ"},{"$f":"VLOOKUP(E4,[1]!список_детей[#Data],4,1)","v":"5-6 лет"},{"$f":"VLOOKUP(E4,[1]!список_детей[#Data],5,1)","v":"д"},{"$f":"VLOOKUP(E4,[1]!список_детей[#Data],2,1)","v":10},"РР",{"$f":"VLOOKUP(J4,[1]!СИДМ[#Data],3,0)","v":0},null,null,"В",{"$f":"COUNTIFS(ИДР[месяц],$M$2,ИДР[Код обращения],N4)","v":25},"2-3 года",{"$f":"COUNTIFS(ИДР[месяц],$M$2,ИДР[возраст],P4)","v":0},"м",{"$f":"COUNTIF(ИДР[пол],R4)","v":14},2,{"$f":"COUNTIFS(ИДР[[#Data],[#Totals],[месяц]],Таблица8[[#Headers],[сентябрь]],ИДР[[#Data],[#Totals],[Вид обследования]],Таблица8[[#This Row],[Вид обследования]])","v":37},null,{"$f":"INDEX(ИДР[[#All],[месяц]:[Код участника]],MATCH(ИДР[[#This Row],[номер участника]],ИДР[[#All],[номер участника]]),2)","v":"2020-09-02"}]
[null,"Сентябрь","2020-09-03",2,3,{"$f":"VLOOKUP(E5,[1]!список_детей[#Data],3,1)","v":"ББ"},{"$f":"VLOOKUP(E5,[1]!список_детей[#Data],4,1)","v":"5-6 лет"},{"$f":"VLOOKUP(E5,[1]!список_детей[#Data],5,1)","v":"м"},{"$f":"VLOOKUP(E5,[1]!список_детей[#Data],2,1)","v":10},"П",{"$f":"VLOOKUP(J5,[1]!СИДМ[#Data],3,0)","v":"Диагностика эмоционально-личностной сферы детей дошкольного и младшего школьного возраста. Анкеты, опросники. Тесты, методики. Карты наблюдения."},null,null,"П",{"$f":"COUNTIFS(ИДР[месяц],$M$2,ИДР[Код обращения],N5)","v":5},"3-4 года",{"$f":"COUNTIFS(ИДР[месяц],$M$2,ИДР[возраст],P5)","v":4},null,null,null,null,null,{"$f":"INDEX(ИДР[[#All],[месяц]:[Код участника]],MATCH(ИДР[[#This Row],[номер участника]],ИДР[[#All],[номер участника]]),2)","v":"2020-09-03"}]
[null,"Сентябрь","2020-09-04",2,4,{"$f":"VLOOKUP(E6,[1]!список_детей[#Data],3,1)","v":"БХ"},{"$f":"VLOOKUP(E6,[1]!список_детей[#Data],4,1)","v":"5-6 лет"},{"$f":"VLOOKUP(E6,[1]!список_детей[#Data],5,1)","v":"м"},{"$f":"VLOOKUP(E6,[1]!список_детей[#Data],2,1)","v":10},"П",{"$f":"VLOOKUP(J6,[1]!СИДМ[#Data],3,0)","v":"Диагностика эмоционально-личностной сферы детей дошкольного и младшего школьного возраста. Анкеты, опросники. Тесты, методики. Карты наблюдения."},null,null,"ЭП",{"$f":"COUNTIFS(ИДР[месяц],$M$2,ИДР[Код обращения],N6)","v":5},"4-5 лет",{"$f":"COUNTIFS(ИДР[месяц],$M$2,ИДР[возраст],P6)","v":0},null,null,null,null,null,{"$f":"INDEX(ИДР[[#All],[месяц]:[Код участника]],MATCH(ИДР[[#This Row],[номер участника]],ИДР[[#All],[номер участника]]),2)","v":"2020-09-04"}]
[null,"Сентябрь","2020-09-05",1,5,{"$f":"VLOOKUP(E7,[1]!список_детей[#Data],3,1)","v":"ЮЧ"},{"$f":"VLOOKUP(E7,[1]!список_детей[#Data],4,1)","v":"5-6 лет"},{"$f":"VLOOKUP(E7,[1]!список_детей[#Data],5,1)","v":"м"},{"$f":"VLOOKUP(E7,[1]!список_детей[#Data],2,1)","v":10},"ЭП",{"$f":"VLOOKUP(J7,[1]!СИДМ[#Data],3,0)","v":"Диагностика эмоционально-личностной сферы детей дошкольного и младшего школьного возраста. Анкеты, опросники. Тесты, методики. Карты наблюдения."},null,null,"ИО",{"$f":"COUNTIFS(ИДР[месяц],$M$2,ИДР[Код обращения],N7)","v":6},"5-6 лет",{"$f":"COUNTIFS(ИДР[месяц],$M$2,ИДР[возраст],P7)","v":12},null,null,null,null,null,{"$f":"IF(INDEX([1]ИДР!$D$3:$D$1048576,MATCH(E3,ИДР[[#All],[номер участника]],0))=2,\"+\",\"\")","v":"+"}]
[null,"Сентябрь","2020-09-06",1,6,{"$f":"VLOOKUP(E8,[1]!список_детей[#Data],3,1)","v":"СЕ"},{"$f":"VLOOKUP(E8,[1]!список_детей[#Data],4,1)","v":"5-6 лет"},{"$f":"VLOOKUP(E8,[1]!список_детей[#Data],5,1)","v":"д"},{"$f":"VLOOKUP(E8,[1]!список_детей[#Data],2,1)","v":10},"ЭП",{"$f":"VLOOKUP(J8,[1]!СИДМ[#Data],3,0)","v":"Диагностика эмоционально-личностной сферы детей дошкольного и младшего школьного возраста. Анкеты, опросники. Тесты, методики. Карты наблюдения."},null,null,"РР",{"$f":"COUNTIFS(ИДР[месяц],$M$2,ИДР[Код обращения],N8)","v":3},"6-7 лет",{"$f":"COUNTIFS(ИДР[месяц],$M$2,ИДР[возраст],P8)","v":13}]
[null,"Сентябрь","2020-09-07",1,7,{"$f":"VLOOKUP(E9,[1]!список_детей[#Data],3,1)","v":"БА"},{"$f":"VLOOKUP(E9,[1]!список_детей[#Data],4,1)","v":"5-6 лет"},{"$f":"VLOOKUP(E9,[1]!список_детей[#Data],5,1)","v":"д"},{"$f":"VLOOKUP(E9,[1]!список_детей[#Data],2,1)","v":10},"ООМ",{"$f":"VLOOKUP(J9,[1]!СИДМ[#Data],3,0)","v":"Психолого-педагогическая диагностика нарушений развития детей раннего и дошкольного возраста"},null,null,"ООМ",{"$f":"COUNTIFS(ИДР[месяц],$M$2,ИДР[Код обращения],N9)","v":4}]
[null,"Сентябрь","2020-09-08",1,8,{"$f":"VLOOKUP(E10,[1]!список_детей[#Data],3,1)","v":"КЗ"},{"$f":"VLOOKUP(E10,[1]!список_детей[#Data],4,1)","v":"5-6 лет"},{"$f":"VLOOKUP(E10,[1]!список_детей[#Data],5,1)","v":"д"},{"$f":"VLOOKUP(E10,[1]!список_детей[#Data],2,1)","v":10},"ООМ",{"$f":"VLOOKUP(J10,[1]!СИДМ[#Data],3,0)","v":"Психолого-педагогическая диагностика нарушений развития детей раннего и дошкольного возраста"},null,null,"УАР",{"$f":"COUNTIFS(ИДР[месяц],$M$2,ИДР[Код обращения],N10)","v":0}]
{"$rows_left_out":289}
{"sheet":"ИКРР","index":3,"n_rows":58,"n_cols":39,"rows_kept":58,"cut":false,"hidden":false,"merged":[[25,1,25,5],[1,6,1,25],[13,33,13,34],[14,33,14,34],[15,33,15,34],[16,33,16,34],[24,1,24,5]]}
["Индивидуальная коррекционно-развивающая работа",null,null,null,null,null,null,null,null,null,null,null,null,null,null,null,null,null,null,null,null,null,null,null,null,null,null,null,null,null,null,null,null,null,"подстветка","вкл"]
[null,null,null,null,null,null,"Даты проведения занятий"]
[null,null,null,null,null,null,{"$f":"TEXT(G4,\"ДДД\")","v":"Чт"},"Пт","Пн","Вт","Ср","Чт","Пт","Пн","Вт","Ср","Чт","Пт","Пн","Вт","Ср","Чт","Пт","Пн","Вт","Ср"]
["номер","Код ребенка","пол","возраст","группа","Программа\n","2020-10-01","2020-10-02","2020-10-05","2020-10-06","2020-10-07","2020-10-08","2020-10-09","2020-10-12","2020-10-13","2020-10-14","2020-10-15","2020-10-16","2020-10-19","2020-10-20","2020-10-21","2020-10-22","2020-10-23","2020-10-26","2020-10-27","2020-10-28","дни посещения","дни отсутствия (н)","дни отсутствия (у)","отработка",null,{"$f":"[1]!Таблица8[[#Headers],[сентябрь]]","v":"сентябрь"},"Возраст","подсчет по годам","КОЛ-ВО ЗАНЯТИЙ","по нарушению","кол-во"]
[1,{"$f":"VLOOKUP(A5,[1]!список_детей[#Data],3,1)","v":"ЖИ"},{"$f":"VLOOKUP(A5,[1]!список_детей[#Data],5,1)","v":"д"},{"$f":"VLOOKUP(A5,[1]!список_детей[#Data],4,1)","v":"5-6 лет"},{"$f":"VLOOKUP(A5,[1]!список_детей[#Data],2,1)","v":10},{"$f":"VLOOKUP(A5,[1]!индвид[#Data],6,1)","v":"АОП ТНР"},null,"п","п",null,null,null,"п","у",null,null,null,"н","п",null,null,null,"п","н",null,"о",{"$f":"IF($D$5:$D$24=\"1-2 года\",COUNTIF(G5:Z5,$AG$14),IF($D$5:$D$24=\"2-3 года\",COUNTIF(G5:Z5,$AG$14),IF($D$5:$D$24=\"3-4 года\",COUNTIF(G5:Z5,AG14),IF($D$5:$D$24=\"4-5 лет\",COUNTIF(G5:Z5,AG14),IF($D$5:$D$24=\"5-6 лет\",COUNTIF(G5:Z5,AG14),IF($D$5:$D$24=\"6-7 лет\",COUNTIF(G5:Z5,AG14)))))))","v":5},{"$f":"IF($D$5:$D$24=\"1-2 года\",COUNTIF(G5:Z5,$AG$15),IF($D$5:$D$24=\"2-3 года\",COUNTIF(G5:Z5,$AG$15),IF($D$5:$D$24=\"3-4 года\",COUNTIF(G5:Z5,$AG$15),IF($D$5:$D$24=\"4-5 лет\",COUNTIF(G5:Z5,$AG$15),IF($D$5:$D$24=\"5-6 лет\",COUNTIF(G5:Z5,$AG$15),IF($D$5:$D$24=\"6-7 лет\",COUNTIF(G5:Z5,$AG$15)))))))","v":2},{"$f":"IF($D$5:$D$24=\"1-2 года\",COUNTIF(G5:Z5,$AG$16),IF($D$5:$D$24=\"2-3 года\",COUNTIF(G5:Z5,$AG$16),IF($D$5:$D$24=\"3-4 года\",COUNTIF(G5:Z5,$AG$16),IF($D$5:$D$24=\"4-5 лет\",COUNTIF(G5:Z5,$AG$16),IF($D$5:$D$24=\"5-6 лет\",COUNTIF(G5:Z5,$AG$16),IF($D$5:$D$24=\"6-7 лет\",COUNTIF(G5:Z5,$AG$16)))))))","v":1},{"$f":"IF($D$5:$D$24=\"1-2 года\",COUNTIF(G5:Z5,$AG$17),IF($D$5:$D$24=\"2-3 года\",COUNTIF(G5:Z5,$AG$17),IF($D$5:$D$24=\"3-4 года\",COUNTIF(G5:Z5,$AG$17),IF($D$5:$D$24=\"4-5 лет\",COUNTIF(G5:Z5,$AG$17),IF($D$5:$D$24=\"5-6 лет\",COUNTIF(G5:Z5,$AG$17),IF($D$5:$D$24=\"6-7 лет\",COUNTIF(G5:Z5,$AG$17)))))))","v":1},null,null,"1-2 года",{"$f":"COUNTIF($D$5:D24,ИКРР!$AG5)","v":0},{"$f":"SUMIF($D$5:$D$24,AG5,$AA$5:$AA$24)","v":0},"ТНР",{"$f":"SUMIF(программа,[1]данные!F2,$AA$5:$AA$24)","v":116},null,{"$f":"MATCH(A5,A5:A24,)","v":1}]
[2,{"$f":"VLOOKUP(A6,[1]!список_детей[#Data],3,1)","v":"КЛ"},{"$f":"VLOOKUP(A6,[1]!список_детей[#Data],5,1)","v":"д"},{"$f":"VLOOKUP(A6,[1]!список_детей[#Data],4,1)","v":"5-6 лет"},{"$f":"VLOOKUP(A6,[1]!список_детей[#Data],2,1)","v":10},{"$f":"VLOOKUP(A6,[1]!индвид[#Data],6,1)","v":"АОП ТНР"},"п",null,null,"п",null,"п",null,null,"п",null,"п",null,null,"п",null,"п",null,null,"п",null,{"$f":"IF($D$5:$D$24=\"1-2 года\",COUNTIF(G6:Z6,$AG$14),IF($D$5:$D$24=\"2-3 года\",COUNTIF(G6:Z6,$AG$14),IF($D$5:$D$24=\"3-4 года\",COUNTIF(G6:Z6,$AG$14),IF($D$5:$D$24=\"4-5 лет\",COUNTIF(G6:Z6,$AG$14),IF($D$5:$D$24=\"5-6 лет\",COUNTIF(G6:Z6,$AG$14),IF($D$5:$D$24=\"6-7 лет\",COUNTIF(G6:Z6,$AG$14)))))))","v":8},0,0,0,null,null,"2-3 года",{"$f":"COUNTIF($D$5:D25,ИКРР!$AG6)","v":0},0,"ЗПР",{"$f":"SUMIF(программа,[1]данные!F3,$AA$5:$AA$24)","v":0}]
[3,{"$f":"VLOOKUP(A7,[1]!список_детей[#Data],3,1)","v":"ББ"},{"$f":"VLOOKUP(A7,[1]!список_детей[#Data],5,1)","v":"м"},{"$f":"VLOOKUP(A7,[1]!список_детей[#Data],4,1)","v":"5-6 лет"},{"$f":"VLOOKUP(A7,[1]!список_детей[#Data],2,1)","v":10},{"$f":"VLOOKUP(A7,[1]!индвид[#Data],6,1)","v":"АОП ТНР"},"п",null,"п",null,null,"н",null,"п",null,"о","п",null,"п",null,null,"н",null,"п",null,null,6,2,0,1,null,null,"3-4 года",{"$f":"COUNTIF($D$5:D26,ИКРР!$AG7)","v":0},0,"ОДА",{"$f":"SUMIF(программа,[1]данные!F4,$AA$5:$AA$24)","v":0}]
[4,{"$f":"VLOOKUP(A8,[1]!список_детей[#Data],3,1)","v":"БХ"},{"$f":"VLOOKUP(A8,[1]!список_детей[#Data],5,1)","v":"м"},{"$f":"VLOOKUP(A8,[1]!список_детей[#Data],4,1)","v":"5-6 лет"},{"$f":"VLOOKUP(A8,[1]!список_детей[#Data],2,1)","v":10},{"$f":"VLOOKUP(A8,[1]!индвид[#Data],6,1)","v":"АОП ТНР"},null,"п",null,null,"п",null,"у",null,"о","п",null,null,null,null,"н",null,"у",null,null,"п",4,1,2,1,null,null,"4-5 лет",{"$f":"COUNTIF($D$5:D27,ИКРР!$AG8)","v":0},0,"НЗ",{"$f":"SUMIF(программа,[1]данные!F5,$AA$5:$AA$24)","v":0}]
[5,{"$f":"VLOOKUP(A9,[1]!список_детей[#Data],3,1)","v":"ЮЧ"},{"$f":"VLOOKUP(A9,[1]!список_детей[#Data],5,1)","v":"м"},{"$f":"VLOOKUP(A9,[1]!список_детей[#Data],4,1)","v":"5-6 лет"},{"$f":"VLOOKUP(A9,[1]!список_детей[#Data],2,1)","v":10},{"$f":"VLOOKUP(A9,[1]!индвид[#Data],6,1)","v":"АОП ТНР"},"п","п",null,null,null,"у","н","о",null,null,"н","п","о",null,null,"п","п",null,null,null,5,2,1,2,null,null,"5-6 лет",{"$f":"COUNTIF($D$5:D28,ИКРР!$AG9)","v":13},77," УО",{"$f":"SUMIF(программа,[1]данные!F6,$AA$5:$AA$24)","v":0}]
[6,{"$f":"VLOOKUP(A10,[1]!список_детей[#Data],3,1)","v":"СЕ"},{"$f":"VLOOKUP(A10,[1]!список_детей[#Data],5,1)","v":"д"},{"$f":"VLOOKUP(A10,[1]!список_детей[#Data],4,1)","v":"5-6 лет"},{"$f":"VLOOKUP(A10,[1]!список_детей[#Data],2,1)","v":10},{"$f":"VLOOKUP(A10,[1]!индвид[#Data],6,1)","v":"АОП ТНР"},"п",null,"п",null,null,"п",null,"п",null,null,"п",null,"н",null,null,"у",null,"у",null,null,5,1,2,0,null,null,"6-7 лет",{"$f":"COUNTIF($D$5:D29,ИКРР!$AG10)","v":7},39,"РАС",{"$f":"SUMIF(программа,[1]данные!F7,$AA$5:$AA$24)","v":0}]
{"$rows_left_out":48}